##TITLE=$$ Begin of the data block
##JCAMP-DX=5.00 $$ ACD/SpecManager v 10.08
##SPECTROMETER/DATA SYSTEM=Varian
##DATE=20 Nov 2012 13:28:28
##DATA TYPE=INFRARED SPECTRUM
##DATA CLASS=XYDATA
##ORIGIN=
##OWNER=
##NPOINTS=3735
##FIRSTX=399.26403809
##LASTX=4000.35498047
##MAXX=4000.35498047
##MINX=399.26403809
##MAXY=76.24626923
##MINY=27.01739693
##XFACTOR=1.0000000000
##YFACTOR=0.000000100000000
##FIRSTY=55.68051910
##DELTAX=0.96440572
##XUNITS=1/CM
##YUNITS=TRANSMITTANCE
##XYDATA=(X++(Y..Y))
399.3E56805191j4380913j5264663o38619L534813r415970o008949L20282k72827J891365
407.9E16569710L906250J3029403K323876q328743k897911K133217J285896l892784
415.7E24128914L14598k890816j1403084l92494N741692O854744M265594K37503j341247
424.3E25515404N053406k44484p244835l655968l853264m212761o587486o17943M566765
433E08718834J097870j975060l342590N746460N133095l173943k250175K049522K264061
441.7E14268074k033195J22871N238228L97453n474052O59713N326386M205704R93576
450.4E23704758M02145M816208K186737n28488l198624m687538L004837M637833o99997
459.1E29637871p31430j448479m47540j91727j59531q40759j412697l279304p900162
$$ y = [556805191, 542424278, 527159615, 526520996, 530055809, 520639839, 514630890, 514951172, 514678345, 516569710, 520475960, 533505363, 535829239, 527500496, 524602585, 526735802, 528021698, 524128914, 524443512, 521552696, 510149612, 509757118, 515498810, 522353554, 526619148, 526856651, 525515404, 530568810, 530324326, 523079491, 519423523, 515570259, 511357498, 504770012, 504152069, 508718834, 509816704, 507841644, 504499054, 510245514, 515378609, 512204666, 509954491, 512004013, 514268074, 512234879, 512357750, 517595978, 517993431, 512519379, 513179092, 518505478, 522711182, 523704758, 524106903, 528923111, 531109848, 530581360, 527382736, 522695198, 525700035, 530337868, 529637871, 528906441, 527457962, 527010422, 526818695, 526659164, 525818405, 524405708, 521126404, 513226242]
467.7E13226242m721527J690750j102219j505508l788719m695358M632949L588028
475.5E07324638J231003l46832q74405j99699l934174m623184j935234K095184k601967
484.1D96135330m230766Q59795J753845K334556j220970J385307N079232N193329J300354
492.8E08590012l960724m54216M1504l692513l179169k460899m018974k981911l257446
501.5D84625664l874970M722901N225792Q14857l189316o88667J207848l667069l955154
510.2D81221886j871529m05769k057762l264580k940827j332931J102028j898308k074966
518.9D66477242j777649n86281j946373j960640o96602l390236k236671j673355L122940
527.5D55332375K985916k075768j884956l23563J957703J629295L165512J424675k5100
$$ y = [513226242, 508504715, 510195465, 509093246, 507587738, 503799019, 499103661, 503736610, 507324638, 508555641, 508208809, 507334404, 507134705, 503200531, 498577347, 496642113, 498737297, 496135330, 491904564, 492764359, 494518204, 496852760, 495631790, 497017097, 502096329, 507289658, 508590012, 504629288, 504175072, 504216576, 500524063, 497344894, 494883995, 490865021, 487883110, 484625664, 480750694, 485473595, 490699387, 491514244, 488324928, 487636261, 488844109, 485177040, 481221886, 479350357, 478944588, 476886826, 473622246, 470681419, 469348488, 470450516, 468552208, 466477242, 464699593, 464113312, 462166939, 460206299, 459509697, 456119461, 453882790, 452209435, 455332375, 458318291, 456242523, 454357567, 454034004, 455991707, 457621002, 460786514, 462211189, 462186089]
536.2D62186089K750511J941795K454224J620407J42479J370277L081856J404724O00739
544.9D77553101K493209N88303N27649J003914J605644R22051k638627k374458j273270
553.6D78407516j693000l385964j354789N58776N6610J58234j920509j616326p71942
562.3D68438606j539688l622207l589554k561150m258766k748604k961121l377532
570D43779984k239075q66356j733666j390495J666298M44641J406555J213799J511230
578.6D43792915J272240j39122K149582K876854L766403L398972K609062L148842M341087
587.3D67216835K750664J717109L594971K553597J027031o30417j232949j171798m52118
596D75372925j14098k27394P65953j073608Q1482J088333Q45375K316666k06490m19579
$$ y = [462186089, 464936600, 466878395, 469332619, 470953026, 471095505, 472465782, 475547638, 476952362, 477553101, 480046310, 480634613, 481162262, 482166176, 483771820, 484693871, 482055244, 479680786, 478407516, 476714516, 473328552, 471973763, 472532539, 472589149, 472747383, 470826874, 469210548, 468438606, 466898918, 463276711, 459687157, 457126007, 452867241, 450118637, 447157516, 443779984, 441540909, 440674553, 438940887, 437550392, 439216690, 439661331, 441067886, 442281685, 443792915, 445065155, 444926033, 447075615, 449952469, 453718872, 457117844, 459726906, 462875748, 467216835, 469967499, 471684608, 475279579, 477833176, 478860207, 478229790, 476996841, 475825043, 475372925, 475258827, 475031433, 475797386, 474723778, 474805260, 475893593, 476738968, 479055634, 478849144, 478429565]
605.6D78429565l78456j587982R6169J050491o6261r16558k07901K52190J517563J421013
615.3D79609833R62562J582833J952781J988716J415711J837959J041527J002846R29222
624D92323990N46989J481667M24385O21223K114983K970505K495231J544075J871643
632.7E06394691K371636J637878n49125o20690m48494j150398j0643J121559R31511
641.3E09677925m88853J76658K367325J969223L24860J120949K015609J12725q03032
650E16473389L26805O09131k0600r2582r17283j215171L16772J409264K134361J569023
659.7E20593109J994858J432686q14438M03290M57191q38814J14212k123909j1596984
668.3E09621201N712623O749535K792358R67636J562119K142372K827301J782455m43229
$$ y = [478429565, 478051109, 476463127, 476559296, 477609787, 477543526, 476626968, 476419067, 476671257, 478188820, 479609833, 480572395, 482155228, 484108009, 486096725, 487512436, 489350395, 490391922, 491394768, 492323990, 492870979, 494352646, 494777031, 495398254, 497513237, 500483742, 502978973, 504523048, 506394691, 508766327, 510404205, 509855080, 509234390, 508785896, 507635498, 507624855, 508746414, 509677925, 509189072, 509365730, 511733055, 513702278, 514027138, 515148087, 517163696, 517276421, 516473389, 516800194, 517409325, 517388725, 517296143, 516378860, 515163689, 515480461, 516889725, 519024086, 520593109, 522587967, 524020653, 523206215, 523609505, 524066696, 523227882, 523342094, 521218185, 509621201, 515333824, 522083359, 524875717, 525843353, 527405472, 529547844, 532375145, 534157600, 533714371]
677E33714371q27446j9074l37257n05524m48570o3515J062279K19727L24745J811294
686.7E34931030J126442J327896K573662K040825K82745j437454j768951k240219k334099
695.3E34501877j139641j233673k034035j149483L83454N69343M8142J99318l11279
704E29834023r11141p02896j083794j372223j125907j386490j556359n20363J399765
712.7E22574615K501297K317353K929802K972603K198677K948379K784386K392654
720.4E43619766J998406J582451J365737Q77610J658973K103386L025437L618812K526245
729.1E62376823K626458L246421K926484K691612K428894P31926m18396l95928n22804
737.8E75691490k46162L29551k7351J41754R01146L49732K93655J052895J574478O61926
$$ y = [533714371, 532886925, 532867851, 532530594, 532025070, 531576500, 531512985, 532575264, 532794991, 533119736, 534931030, 536057472, 537385368, 539959030, 541999855, 542282600, 540845146, 539076195, 536835976, 534501877, 533362236, 532128563, 530094528, 528945045, 529328499, 529897842, 529945984, 530145302, 529834023, 528922882, 528219986, 527136192, 525763969, 524638062, 523251572, 521695213, 521174850, 522574615, 525075912, 527393265, 530323067, 533295670, 535494347, 538442726, 541227112, 543619766, 545618172, 547200623, 548566360, 549443970, 551102943, 553206329, 556231766, 559850578, 562376823, 565003281, 568249702, 571176186, 573867798, 576296692, 577028618, 576610222, 576214294, 575691490, 575445328, 575774879, 575747528, 575889282, 576790428, 577140160, 577433815, 578486710, 580061188, 580723114]
747.4E80723114r69963j382980k254754l485603l718796k618103k152557k908592k954407
756.1E58277359r77364N32265p76672j316643r05190j204109j635589j965065p70455
764.8E49258537m09813j372032j036377L60298K576828L074494K410583L460160M596290
773.5E62918968M933090N005303M444923L522454K796707K075119K225456J403618
781.2E89325638Q66203K052994K935867L218994L372536L983955L920861L360214K544174
789.9F15581436K275086J019744k22740r7274j058884k75231R6398J235924K265586
798.5F20820045J964875L716850L657379L751221L225899J694526Q80204L77807k61383
807.2F39827423j626205j029854j786881r62906K19422M1275J212311M76913J263466
$$ y = [580723114, 579753151, 578370171, 576115417, 572629814, 568911018, 566292915, 564140358, 561231766, 558277359, 557299995, 557832260, 557055588, 555738945, 554833755, 553629646, 551994057, 550028992, 549258537, 548848724, 547476692, 546440315, 546800613, 549377441, 552451935, 554862518, 558322678, 562918968, 567852058, 572857361, 577302284, 580824738, 583621445, 585696564, 587922020, 589325638, 590191841, 592244835, 595180702, 598399696, 601772232, 605756187, 609677048, 613037262, 615581436, 617856522, 618876266, 618653526, 618556252, 617497368, 617222137, 617318535, 618554459, 620820045, 622784920, 626501770, 630159149, 633910370, 637136269, 638830795, 639710999, 640088806, 639827423, 638201218, 637171364, 635384483, 634421577, 634640999, 634682274, 635894585, 636371498, 637634964]
815.9F37634964K195244J853218J062241q71735j577301j571579l037834l581047j434670
824.6F30671501k246094k433967n88188P5836O00357J29166m5052j023712j375771
833.3F23764076j737671k783394l480720m413490l716965l538513l270188k401237
841E98421898r88579Q6746j51519J42822o64177p24869o25267j179581j792030l133926
850.6E89391518k669220k942391l709297l389435l191147j682319l13454j060333j705780
859.3E68728142r1744J149254J496277K422981J703491J469117K777710L517685L926391
868E87099304M206848M499512N710335O397400N769691N858917N637169M457436K201538
876.7F31838150R23767o47240r51461N4245k532692l565140k372551j579895j656265
$$ y = [637634964, 639830208, 641683426, 642745667, 641873932, 640296631, 638725052, 635687218, 632106171, 630671501, 628425407, 625991440, 625403252, 625479088, 626079445, 626208611, 626163559, 625139847, 623764076, 622026405, 619243011, 615762291, 611348801, 607631836, 604093323, 600823135, 598421898, 597433319, 597520065, 597368546, 597511368, 596847191, 596122322, 595497055, 594317474, 592525444, 589391518, 586722298, 583779907, 580070610, 576681175, 573490028, 571807709, 571494255, 570433922, 568728142, 568636398, 569785652, 571281929, 573704910, 575408401, 576877518, 579655228, 583172913, 587099304, 591306152, 595805664, 601515999, 607913399, 613683090, 619542007, 625179176, 629636612, 631838150, 632761917, 632114677, 631163216, 631217461, 628684769, 625119629, 622747078, 621167183, 619510918]
885.3F19510918j467629o63338j336975j875877k214584k720490l753090m665489m391060
894E96422386l795700l850174l611526k523575j298104q85505j439057p23877r11216
902.7E77383652k043686k101174k775077l711663m743805m576225n012016n514984
910.4E46905022m579735m346008l452263l583832m052086k886810k949677l268013
918.1E17786598l300094l574257k773934k755966l135719k616577j632805r28650l63999
926.8D96704597P54281P09762J518974J442109Q33664J952552J785088J379166M25224
935.5E07505417K20566O09092L2349N15022J038323J669235K571869K872429K405662
944.2E19439964J840477R94683n4131m10881j910782m720001o254654o257553o059189
$$ y = [619510918, 618043289, 617379951, 616042976, 614167099, 611952515, 609232025, 605478935, 600813446, 596422386, 592626686, 588776512, 585164986, 582641411, 581343307, 580457802, 579018745, 578294868, 577383652, 575339966, 573238792, 570463715, 566752052, 562008247, 557432022, 552420006, 546905022, 542325287, 537979279, 534527016, 530943184, 526891098, 524004288, 521054611, 517786598, 514486504, 510912247, 508138313, 505382347, 502246628, 499630051, 497997246, 497068596, 496704597, 497458878, 498168640, 499687614, 501129723, 501963387, 503915939, 505701027, 507080193, 507505417, 507725983, 508335075, 508367424, 508882446, 509920769, 511590004, 514161873, 517034302, 519439964, 521280441, 522275124, 522220993, 521810112, 519899330, 515179329, 508924675, 502667122, 496607933]
952.8D96607933o364059o445237o123619n669594n908622n921898o646347p145348
960.6D46383209o202049o384125p010193q871002q625946p841148q185540q076591
968.3C85186615q558159p307777q168602p608376p295799p392693o282768p647362
976C24925079o832027p302837o228257o018104o050225m374332m299049k778511l551350
984.7B77490387k156448j989098j341381j27907q73680L63445l99399K28673q94013
993.3B70300579Q5907O74820q87337M01001O20957J622753M65412J276894P58438M28486
1003B75747910J283264j23177J430264o0101R2163k86102q40092J74885m51336L31955
1012.6B77299633o12640K70157k03953K44541L34015N17730K343731P86400J310139
$$ y = [496607933, 490243874, 483798637, 477675018, 472005424, 466096802, 460174904, 453528557, 446383209, 440181160, 433797035, 426786842, 417915840, 409289894, 401448746, 393263206, 385186615, 376628456, 369320679, 361152077, 353543701, 346247902, 338855209, 332572441, 324925079, 318093052, 310790215, 304561958, 298543854, 292493629, 288119297, 283820248, 281041737, 277490387, 275333939, 273344841, 272003460, 271875553, 271001873, 271365318, 270965919, 271194592, 270300579, 270386486, 271061306, 270173969, 270574970, 271195927, 272818680, 273284092, 274560986, 275319424, 275747910, 277031174, 276907997, 278338261, 278278160, 278370323, 278084221, 277244129, 277419014, 276967678, 277299633, 276686993, 276957150, 276753197, 276997738, 277331753, 277849483, 280193214, 280979614, 282289753]
1021.3B82289753L21903J824322J674557L81050J208896M5567J807098J332932K162514
1030B93048592J708259J983586K178478q5850J353436N60798J657791K22168l03135
1038.7C02324123P02801l98426J14555j403236P8468m09736M98924J010723O45657
1047.4C03163853J604938n96866J044578Q05378J654663J244755J349125K997970J648827
1056C14917221L197975K450867L527870L120384L780403M904290L582039M466667K956085
1064.7C46903801L986206L244934K239380P50771j718102k822533m516563l084145
1072.4C44983749m695434m141579l414459k706833r45930j443367L47137j188087N07698
1081.1C27302895O05583O81419R52873q9721K764702J480712K698632K043380K730637
$$ y = [282289753, 282611656, 284435978, 286110535, 286491585, 287700481, 287746048, 289553146, 290886078, 293048592, 294756851, 296740437, 298918915, 298833065, 300186501, 300747299, 302405090, 302627258, 302324123, 303026924, 302628498, 302743053, 301339817, 301418285, 301008549, 301507473, 302518196, 303163853, 304768791, 304171925, 305216503, 306021881, 307676544, 308921299, 310270424, 313268394, 314917221, 318115196, 320566063, 324093933, 327214317, 330994720, 335899010, 339481049, 343947716, 346903801, 350890007, 354134941, 356374321, 357125092, 355406990, 352584457, 348067894, 344983749, 340288315, 336146736, 332732277, 330025444, 329079514, 327636147, 327983284, 326795197, 327302895, 327908478, 328589897, 329542770, 329453049, 332217751, 333698463, 336397095, 338440475, 341171112]
1089.8C41171112L613930K457428L852653J442223K281303J590805J106911J244545
1097.5C58760910J138039K140770P6255M69132k16141P27730O18324N50308J353417
1106.2C65618744J44768J278457O11496J951981J564140J222992J237641Q17565K386666
1114.9C76834450P34367J657143K172966K631187J892586J116219J274452k22397J511421
1123.5C89602394M83360P44667N43061O4125J335869O41327K109146J560630K524949
1132.2C99609528K615165J893502J717529N23529P05261p12013p74307k716828k920837
1140.9C99940529k510986l658371k367974l279876k319069k926903k655258j414910
1148.6C78807182j939125k038574k965584j312179j657257j068764r96552q98819k84919
$$ y = [341171112, 344785042, 347242470, 351095123, 352537346, 354818649, 356409454, 357516365, 358760910, 359898949, 362039719, 362115974, 362585106, 362368965, 363096695, 363715019, 364265327, 365618744, 365763512, 367041969, 367653465, 369605446, 371169586, 372392578, 373630219, 374447784, 376834450, 377568817, 379225960, 381398926, 384030113, 385922699, 387038918, 388313370, 388090973, 389602394, 390085754, 390830421, 391373482, 391437607, 392773476, 393414803, 395523949, 397084579, 399609528, 402224693, 404118195, 405835724, 406359253, 407064514, 406352501, 405578194, 402861366, 399940529, 397429543, 393771172, 391403198, 388123322, 385804253, 382877350, 380222092, 378807182, 376868057, 374829483, 371863899, 370551720, 368894463, 367825699, 366829147, 365930328, 365645409]
1157.3C65645409o23665R20830k52762J289825J446457J843071K402229J527176L378144
1166C77576714K765884L796806L446961L861046M532356M656677N866814N062179N486718
1174.6D17052155M576683O071434O367149O212463P011261N038567N581131M998817
1182.4D62909660M548607M784050M623451M712449M210968M283523L718109L582230
1190.1D97373047L114319L259086L097878J989250J512833M72030P08046Q70514N19371
1198.8E12916374M26064J33743M12941L47595R77097J655350J789360J666679J562576
1207.4E21887779J685601J531600J376534J178741J456757J679726J690788J775474
1215.1E34263000J705513J645279J982804K560386J952477J305695J576156J211701
$$ y = [365645409, 365021744, 365942574, 365689812, 366979637, 368426094, 370269165, 372671394, 374198570, 377576714, 380342598, 384139404, 387586365, 391447411, 395979767, 400636444, 406503258, 411565437, 417052155, 421628838, 427700272, 434067421, 440279884, 447291145, 452329712, 457910843, 462909660, 467458267, 472242317, 476865768, 481578217, 485789185, 490072708, 493790817, 497373047, 500487366, 503746452, 506844330, 508833580, 510346413, 510818443, 511526489, 512397003, 512916374, 513342438, 513476181, 513889122, 514236717, 515213814, 516869164, 518658524, 520325203, 521887779, 523573380, 525104980, 526481514, 527660255, 529117012, 530796738, 532487526, 534263000, 535968513, 537613792, 539596596, 542156982, 544109459, 545415154, 546991310, 548203011]
1222.9E48203011N20973j32714o40335o73790r81979r79729j202545j121864m84123
1231.5E42506905m48075n81207k26364K87742k75421o58607o92902r71641m32663n25818
1241.2E37981949q71506n15671m07066l67317J27907Q72879J006927J178894J434670
1249.9E40441666J207389J290398J044464O01006J945k7122M56772K72522J96266L94401
1259.5E45879707M54979N61562P86552N93529P02210R14459P10792R47533P72896O80465
1269.2E53004684P63894M52995L47938Q27561N60226J45569Q91228P49512M36210p9307
1278.8E58100510n9395K03628m38270l60260j044541q57849k18162j37444k10953q10203
1288.4E54167061k33765K5292L55682J90697m32625n80788j291389j163216j023826
$$ y = [548203011, 548723984, 548591270, 547950935, 547277145, 546295166, 545315437, 544112892, 542991028, 542506905, 542058830, 541477623, 541251259, 541539001, 541263580, 540604973, 539912071, 538940430, 538507767, 537981949, 537110443, 536594772, 536187706, 535820389, 535948296, 536821175, 537828102, 539006996, 540441666, 541649055, 542939453, 543983917, 544584923, 544586868, 544559746, 545016518, 545289040, 545485306, 545879707, 546334686, 546896248, 547682800, 548276329, 548978539, 549892998, 550603790, 551551323, 552324219, 553004684, 553768578, 554221573, 554569511, 555397072, 555957298, 556102867, 556994095, 557743607, 558179817, 558100510, 558041115, 558244743, 557806473, 557446213, 556401672, 555543823, 555325661, 555188217, 554977264, 554167061, 553933296, 553958588, 554314270, 554504967, 554072342, 553491554, 552200165, 551036949, 550013123]
1297.1E50013123j324501j392594j137848j305580j247520o11229j021080q42133n14107
1305.8E40616531q91189j070328j028480o68107r69238j048698j161804j443635q68911
1314.5E31466141p75376q28857n76668k16522l38402n97229j10512k34947p60536j260071
1324.1E25767021j656112j995125k532997k555161k532158k504845k360229j872864
1331.8E07757530j562385j981087j316567p29942p00264o99959l70292p28493r99451
1340.5D98669090j83487k12478l06435o51817L48053O01234J93634O72035N58854P67593
1350.2E00456276O409k87438l13530j58233j70517o50673l73917p61642k22702m48342
1359.8D97075691n77583l48396j112824n7602L90892N67932m7569K50511P9727p60345
$$ y = [550013123, 548688622, 547296028, 546158180, 544852600, 543605080, 542993851, 541972771, 541130638, 540616531, 539725342, 538655014, 537626534, 536958427, 535989189, 534940491, 533778687, 532335052, 531466141, 530690765, 529861908, 529285240, 529068718, 528730316, 528133087, 528022575, 527787628, 527027092, 525767021, 524110909, 522115784, 519582787, 517027626, 514495468, 511990623, 509630394, 507757530, 506195145, 504214058, 502897491, 502167549, 501467285, 500767326, 500397034, 499668541, 498669090, 498485603, 498273125, 497966690, 497314873, 497662926, 498264160, 498457794, 499129829, 499688683, 500456276, 500462685, 500175247, 499861717, 499703484, 499532967, 498882294, 498508377, 497746735, 497524033, 497075691, 496498108, 496149712, 495036888, 494979286, 495370178, 495938110, 495890541, 496141052, 496220779, 495460434]
1369.4D95460434o9351n11246M33769J32599n4016N46494Q29429J330490K59095Q63494
1379.1D99221191L28751L68042R46388N04799L68881K4987J245460J500054J536521
1387.8E06045074J548806J942405J788292R68170R64699P38297N55916j112061k6436
1396.4E13413162n72o85043j477738j109695L32260o01997l05443j97563j090432m64401
1406.1E07812538j26228l36609j173325p19909j005936j052856r67980j122322r47723
1414.8E00359650r24187P6599o66199m23507j829834N03616K274971M50668J56670
1423.4D99978447r78127N08080R08928k43034L67622J44653Q9722l00827J267547P42646
1433.1E02485657Q81462K348251Q11615q20999N10216K434616J019783O58226N90248
$$ y = [495460434, 495391083, 494879837, 495313606, 495446205, 495392189, 495938683, 496768112, 498098602, 498357697, 499221191, 499549942, 499917984, 500864372, 501369171, 501738052, 501763039, 503008499, 504508553, 506045074, 507593880, 509536285, 511324577, 512292747, 513257446, 513995743, 514551659, 513439598, 513413162, 513412590, 512727547, 511249809, 510140114, 510472374, 509870377, 509564934, 509367371, 508276939, 507812538, 507686310, 507349701, 506176376, 505456467, 504450531, 503397675, 502429695, 501307373, 500359650, 499435463, 499512062, 498845863, 498422356, 496592522, 497096138, 499371109, 499821777, 499978447, 499000320, 499508400, 500417328, 500174294, 500541916, 500686569, 500776291, 500475464, 501743011, 502485657, 503367119, 505715370, 506526985, 505705986, 506216202, 508650818, 509670601, 510328827, 510919075]
1441.8E10919075l63655N95665k25182P32727K99378J49040J86577P95822J371536
1450.5E14460983o00853J43891r27544J53961O4392k199669k045097l017120J792259
1459.1E07825203j088371J230659N10636Q05969K132950m92096K885894J699372K717552
1467.8E18227768K042732L083496L742371J729851M771347J453056M616432L326111
1475.5E42993164M498673M295578L477516M083748K510337L800965K765846L829575
1483.2E72255402K754097J983566K520409P17315K762833J103134J831360Q57887L446808
1491.9E90232811L902359J635361K827301J893043J344910J659355J507835O6910J607361
1500.6F06677246K256165M64248J560440O21071J874581M00123m379997M313889J205749
$$ y = [510919075, 510555420, 511151085, 510925903, 511658630, 511958008, 512107048, 512293625, 513089447, 514460983, 513860130, 514004021, 513076477, 513230438, 513294830, 511095161, 509050064, 506032944, 507825203, 506736832, 507967491, 508478127, 509284096, 511417046, 510924950, 513810844, 515510216, 518227768, 520270500, 523353996, 527096367, 528826218, 533597565, 535050621, 539667053, 542993164, 547491837, 551787415, 555264931, 559348679, 561859016, 565659981, 568425827, 572255402, 575009499, 576993065, 579513474, 580230789, 582993622, 584096756, 585928116, 586786003, 590232811, 594135170, 595770531, 598597832, 600490875, 601835785, 603495140, 605002975, 605069885, 606677246, 608933411, 609397659, 610958099, 611579170, 613453751, 613853874, 609473877, 613787766, 614993515]
1509.3F14993515K862129J867867J962318l57513R50660R33800j061592O54068j758385
1518F21046867L365136K305030R8839O04096o39916L375015J641427N26237K65274
1526.6F32588005J397972j28136m17900J052170J26419J430168j473617j143379K648277
1535.3F36079979J744957K115250J271209o23932n958290N038338K352829j774750
1543F40245590J318817o62536j230011Q71200J060486J016846K09808r36050J218719
1551.7F43112869J911392P39289j927262l76739L306656K549591o454315k647095j556282
1560.4F38658104K855873Q09631R6283N0278p61108L35464R33380J153641K83203l449173
1570F40965576m46014K48413q49075p44210K1553j816749n399971J299095R65996J40304
$$ y = [614993515, 617855644, 619723511, 621685829, 621328316, 622278976, 623212776, 622151184, 622805252, 621046867, 624412003, 626717033, 626815872, 627419968, 626780052, 630155067, 631796494, 632322731, 632588005, 633985977, 633857841, 633439941, 634492111, 634618530, 636048698, 634575081, 633431702, 636079979, 637824936, 639940186, 641211395, 640587463, 634629173, 639667511, 642020340, 640245590, 641564407, 640901871, 639671860, 640543060, 641603546, 642620392, 642830200, 641894150, 643112869, 645024261, 645763550, 643836288, 643459549, 646766205, 649315796, 642861481, 640214386, 638658104, 641513977, 642323608, 642419891, 642470169, 641709061, 642044525, 642977905, 644131546, 644414749, 640965576, 640519562, 640767975, 639918900, 639174690, 639196243, 637379494, 631979523, 633278618, 634244614, 634384918]
1579.7F34384918k98729l15323j78909p32384j66397k46010j027984j458969j453095
1588.4F28507118j118164j681671j220665j476250p67326o31256j275673m46129j084938
1597F18805046q41141r72557r13124j473160j943206j406441k241936j645241j631660
1605.7F05736580j451836k142257j213265j206932k552719j095963j793899j229134
1613.4E93050575j991691r70841q43544p914352J37672n58929j052819j860389p11327
1622.1E77284355j546936m805870P515m9973M13018k412796k419663p28187r27735
1630.8E64813728r60769j764412J15394m09050l123283j9302J075553k71301N90019
1639.5E60046577P90749r16672R13239M2801R75227J168633j589547J9799o80695K242508
$$ y = [634384918, 634086189, 633770866, 633591957, 632859573, 632693176, 632447166, 631419182, 629960213, 628507118, 627388954, 625707283, 624486618, 623010368, 622243042, 621611786, 620336113, 619889984, 618805046, 617963905, 616991348, 616078224, 614605064, 612661858, 611255417, 609013481, 607368240, 605736580, 604284744, 602142487, 600929222, 599722290, 597169571, 596073608, 594279709, 593050575, 591058884, 590088043, 589244499, 581330147, 581467819, 580908890, 579856071, 577995682, 577284355, 575737419, 570931549, 570939064, 570889091, 571302109, 568889313, 566469650, 565741463, 564813728, 563852959, 562088547, 562203941, 561794891, 558671608, 558652306, 559727859, 559456558, 560046577, 560837326, 559920654, 560833893, 560876694, 561851921, 563020554, 561431007, 561450806, 560770111, 563012619]
1649.1E63012619J187172K490349L133964l606682k355499L763581L529243J831665
1656.8E72986412J408234Q66508J131325R53331J265182J096535k32391K788048K067680
1665.5E84330864J827698K467117K862816O17714K53448K997170J337356K450486K964859
1674.2F02109528J576767k68326K287636K918624K150460K556610J898193L401261
1681.9F18630753L958091L55377j095008N009079M668884L063354J952515K471428
1689.6F39014473J977119J918412K274627K041626K581787K092896j203156L800354
1697.3F54498138L775177L499375q60748m30146N069733L192902J753463L08991J204529
1706F72011414j19782N57480J715240R38645Q82950J478424J808014J487884j58386
$$ y = [563012619, 564199791, 566690140, 569824104, 566217422, 563861923, 567625504, 571154747, 572986412, 574394646, 575261154, 576392479, 577345810, 578610992, 579707527, 579475136, 582263184, 584330864, 586158562, 588625679, 591488495, 592106209, 592359657, 595356827, 596694183, 599144669, 602109528, 603686295, 603417969, 605705605, 608624229, 610774689, 613331299, 615229492, 618630753, 622588844, 622944221, 621849213, 626858292, 631527176, 634590530, 636543045, 639014473, 640991592, 642910004, 645184631, 647226257, 649808044, 651900940, 650697784, 654498138, 658273315, 661772690, 660911942, 660481796, 665551529, 668744431, 670497894, 670806885, 672011414, 671891632, 672449112, 674164352, 675102997, 675985947, 677464371, 679272385, 680760269, 680601883]
1714.7F80601883P400K741700K095565l173751R85641J723862Q45108M87060M19617
1723.4F86734085l21503O45905J131897Q09631J010895J192246L65219l30887K107239
1732F93344727J787567k974472k395630K793274K518387M31213J309662k73819j413574
1740.7F95127335K793655J599274P0343J49078J738358J476516N55954J054688o1188
1749.4G04504013K254486O87790m48761K319946J596756J691437J732483l65295P85522
1758.1G14758377J659317R00421J558151r90066j28632K255021P82775P63855J355820
1766.8G22915039J376419j061706J232071K557449r8038j235123j471176K807389J793365
1775.4G28815689p29141P85065k39106K89841M36554K39639R73969J187820R35364
$$ y = [680601883, 680609283, 683350983, 685446548, 682272797, 683258438, 684982300, 685827408, 686314468, 686734085, 686412582, 687058487, 688190384, 689000015, 690010910, 691203156, 691568375, 691237488, 693344727, 695132294, 692157822, 689762192, 692555466, 695073853, 695505066, 696814728, 696540909, 695127335, 697920990, 699520264, 699590607, 699739685, 701478043, 702954559, 703510513, 704565201, 704504013, 706758499, 707446289, 706997528, 709317474, 710914230, 712605667, 714338150, 713972855, 714758377, 716417694, 717318115, 718876266, 717886200, 717757568, 720012589, 720795364, 721559219, 722915039, 724291458, 723229752, 724461823, 727019272, 726921234, 725686111, 724214935, 727022324, 728815689, 728086548, 728871613, 728632507, 728922348, 729358902, 729598541, 730572510, 731760330, 732695694]
1784.1G32695694m87900J84326J037522O48651N1346O49032k42080J66397K20108j311875
1793.8G33611221J452942N24521j31149P80792J287689O10199p93838J658249J24282
1802.4G39124908m06570Q11005K65808p8812m44183k62985J72348R25293o77872K13241
1812.1G39642181J210709M41513J230698O70471O52313k98691l50799K64740j63880
1820.8G43299255K81830q07953M06266J057205j492539k10952J273727J285248L10364
1829.4G45402451j728363N84030J886291J87378L4943K4109j66245o1798o85730O53305
1839.1G46130371J33896k3880m6463P37839J155319k978745J236725J534882p6904
1847.8G47803040l86124R5901L65372o61621M9286J9684K13928L37906o8054K45132
$$ y = [732695694, 732207794, 732392120, 733429642, 734078293, 734129639, 734778671, 734536591, 734702988, 734923096, 733611221, 735064163, 735588684, 735457535, 736238327, 737526016, 738136215, 737342377, 739000626, 739124908, 738718338, 739529343, 739795151, 739716339, 739272156, 739009171, 739181519, 740106812, 739428940, 739642181, 740852890, 741294403, 742525101, 743195572, 743847885, 743549194, 743198395, 743463135, 743299255, 743581085, 742773132, 743179398, 744236603, 742744064, 742533112, 743806839, 745092087, 745402451, 743674088, 744258118, 746144409, 746331787, 746366730, 746390839, 746224594, 746162796, 745477066, 746130371, 746264267, 746240387, 746193924, 746931763, 748087082, 745108337, 746345062, 747879944, 747803040, 747416916, 747512817, 747878189, 747216568, 747265854, 747285538, 747499466, 747837372, 747769318, 748014450]
1857.4G48014450K28958M32434j220L66287o2256j11847K33078j30234n0430o74286
1867.1G48244934K80838n87921q01621J087876R95102N33447j3504L06778Q240r0332
1876.7G49963837k46506L8376K46429m25873m8141j41449M57306N54047M04129M49905
1886.3G51252060L19214Q11844l30658q42819Q3160K48108K3804J32522j47629q17489
1896G50732117L83224N54733M09546j678J42517O05164J37558K83966j56403r4681
1905.6G52996063l74450m08097j97296m70199k71912k88162L37753j89438N27420R68170
1915.3G52629852O48880J338501j181488r11484N59464O3782P2250p49588n89905K85416
1924.9G52165680L60870j85928l9673J52130P19910P17697J67770M96674j97220k30865
$$ y = [748014450, 748243408, 748675842, 748674622, 749040909, 748978653, 748866806, 749099884, 748969650, 748919220, 748244934, 748525772, 747937851, 747136230, 748224106, 749219208, 749752655, 749739151, 750045929, 750054169, 749963837, 749717331, 749755707, 750002136, 749576263, 749528122, 749386673, 749843979, 750398026, 750802155, 751252060, 751571274, 752383118, 752052460, 751209641, 751292801, 751540909, 751564713, 751697235, 751549606, 750732117, 751115341, 751670074, 752079620, 752077942, 752220459, 752825623, 752963181, 753247147, 753090744, 752996063, 752621613, 752213516, 752016220, 751546021, 751274109, 750985947, 751323700, 751134262, 751661682, 752629852, 753278732, 754617233, 753435745, 752524261, 753083725, 753147507, 753219757, 752470169, 751880264, 752165680, 752526550, 752340622, 752300949, 752453079, 753172989, 753890686, 754058456, 754555130, 754357910, 754127045]
1934.6G54127045l30735k92968k56958n47715l00827n43823O12335n2719r63211J179352
1944.2G52629776J255264K67487n5542L57361o6757q0796k32696l18528k8686m92172
1953.8G53234711j73188j11846J58462L35312J51138L71018L90472M08173K10571K52075
1963.5G55226898p8583n8441r3612p57981o23092K822K02103j49231K76718L13340
1973.1G54260941L90777N63049K77863L52249n6991j30005m20609j99661j86539l96194
1982.8G54454880m9362j44883M43726O1188o5460K7008K0370Q95157L32184o17600
1992.4G55357208l27682M77142J11542k71454m72107p38296j61438R002Q38776K69241
2002.1G55091934l49197K93350j14365k86407r7809K88391l85132n40542n0431n2261
$$ y = [754127045, 753796310, 753503342, 753246384, 752698669, 752397842, 751854019, 752466354, 752413635, 751450424, 752629776, 753885040, 754152527, 754096985, 754454346, 754387589, 754306793, 754074097, 753755569, 753726883, 753234711, 753061523, 752949677, 753108139, 753443451, 753594589, 753965607, 754356079, 754764252, 754974823, 755226898, 755148315, 755089874, 754996262, 754238281, 753615189, 753618011, 753820114, 753670883, 753947601, 754260941, 754651718, 755214767, 755492630, 755844879, 755787888, 755657883, 755237274, 755037613, 754851074, 754454880, 754405518, 754260635, 754704361, 754765549, 754700089, 754727097, 754747467, 755642624, 755974808, 755357208, 755029526, 755506668, 755618210, 755346756, 754874649, 754136353, 753974915, 753983917, 754822693, 755091934, 754742737, 755036087, 754921722, 754635315, 754537506, 754825897, 754440765, 753900223, 753849792, 753797531]
2011.7G53797531k6169m55703j73798l0823J75629J11923K36054K34375o69709l79638
2021.3G52819672k23084j11236k41623l21885l69949l69415L14941J15814O257j21384
2031G51498108Q4457j69830l58734J26572o5079n4703p49969m83323k53372j21994
2040.6G49452133O6147n70450L13950J31149R3231J62277k50930J70898J74866J05438
2050.3G49848709n03540k43683j82876k50626k20489l13874K64664j93482L7079L14102
2059.9G48555984M77067J66931q2932N59769P019J7624m45786n21698j71280l41568
2069.6G48221130k49633l71399M84085M32129L61328L85589J71509K45056k31476J95466
2079.2G49643784k7466l42865k25754J34735K53677l87191m70734m17709M03518N49546
$$ y = [753797531, 753771362, 753315659, 753141861, 753111038, 753286667, 753398590, 753634644, 753869019, 753199310, 752819672, 752596588, 752485352, 752243729, 751921844, 751551895, 751182480, 751497421, 751613235, 751619492, 751498108, 751582565, 751412735, 751054001, 751180573, 751115494, 751060791, 750310822, 749827499, 749574127, 749452133, 749518280, 748947830, 749261780, 749392929, 749486160, 749648437, 749397507, 749568405, 749743271, 749848709, 749345169, 749101486, 748918610, 748667984, 748447495, 748133621, 748398285, 748204803, 748241882, 748555984, 749033051, 749199982, 749117050, 749676819, 749683838, 749701462, 749255676, 748733978, 748562698, 748221130, 747971497, 747600098, 748084183, 748516312, 748877640, 749263229, 749434738, 749679794, 749448318, 749643784, 749616318, 749273453, 749047699, 749182434, 749436111, 749048920, 748578186, 748160477, 748563995, 749113541]
2088.9G49113541J80587P0038K10190N30853R6436J00784j23977k1210k32010n11932
2098.5G49413300k29035j60370N42221M37775K89459l81o9123J37253l3188J96686
2108.1G50524597m1962L58048R0790l82462m61349l15857K36282k05917L20205L02659
2117.8G50425034o6376O3553J13220M33044l8757O8588j38321l37524j37634j21155
2127.4G50263672J79367J30844k4261k35596J82037J62964k7389J45950J84250J09100
2137.1G51070938k43072R460k46277n1193K39181j02539j35192k05918R7580O7139
2146.7G50500107J50070j09024o4774N8518J05667O93359j74179k88391L7689K38572
2156.4G51147614J86004l89252J2436j00937K90375M82941J52283n2643m5548M94614
$$ y = [749113541, 749294128, 749364166, 749574356, 750105209, 750201645, 750302429, 750178452, 750157242, 749925232, 749413300, 749184265, 749023895, 749566116, 750003891, 750293350, 750292969, 750223846, 750361099, 750327911, 750524597, 750482635, 750840683, 750931473, 750549011, 750087662, 749771805, 750008087, 749802170, 750122375, 750425034, 750358658, 750422211, 750535431, 750968475, 750929718, 750998306, 750859985, 750522461, 750384827, 750263672, 750443039, 750573883, 750549622, 750314026, 750496063, 750659027, 750631638, 750777588, 750961838, 751070938, 750827866, 750837326, 750591049, 750539856, 750779037, 750676498, 750541306, 750335388, 750432968, 750500107, 750650177, 750541153, 750476379, 750534897, 750640564, 751333923, 751159744, 750871353, 750909042, 751147614, 751333618, 750944366, 750956802, 750855865, 751146240, 751629181, 751781464, 751728821, 751683273, 752177887]
2166G52177887L83987K89765m29459k77557J78757j99738J03607L37067M93927K35672
2175.6G53293915N21698L02810l11431J9226J57470L01895j17645k26745K39868Q60977
2185.3G55042038P04040o1721j89743j98059J16119j30081J30234N89752O04400M17557
2194.9G57024536m21524l06244j11084O5842J84860m2877q5983K52075L84826k7694
2204.6G56916733K52228J71966L81699L35006K37046K31094m19006L75976J05744l41950
2214.2G58246536j9226J74790M61578J61209L31726o7291K59247L10135m0741K82974
2223.9G60100937k93198j89514o4087K0828n1727J16501K09885j53351J16119Q3924
2233.5G59896317O17752K45285j16120J75247l738L8147l13644K6245P8048J1521l00141
$$ y = [752177887, 752561874, 752851639, 752422180, 752144623, 752323380, 752123642, 752227249, 752564316, 753058243, 753293915, 753815613, 754118423, 753806992, 753826218, 753983688, 754285583, 754167938, 753941193, 754181061, 755042038, 755746078, 755684357, 755494614, 755296555, 755412674, 755282593, 755412827, 756002579, 756606979, 757024536, 756603012, 756296768, 756185684, 756251526, 756436386, 756393509, 756307526, 756559601, 756944427, 756916733, 757168961, 757340927, 757722626, 758057632, 758294678, 758525772, 758106766, 758482742, 758588486, 758246536, 758227310, 758402100, 758863678, 759024887, 759356613, 759289322, 759548569, 759858704, 759817963, 760100937, 759807739, 759618225, 759554138, 759574966, 759523239, 759639740, 759849625, 759696274, 759812393, 759896317, 760514069, 760759354, 760643234, 760818481, 760814743, 760852890, 760539246, 760565491, 760643539, 760655060, 760354919]
2244.1G60354919j84173O33926Q6365k95944m04740J77460N22385L34625R7198j02767
2253.8G61219254J00326l22418K11944J34049l24097k92206o8893N52063o6452j49078
2263.4G60994492p5913j44577r4757K91214J17187m72412K86026J60218K84576n7220
2273G61288834J39083P94678Q7815J52282l23791J26724Q2397l12500Q3924J18332
2282.7G62237778J27182p30973j30844k30560j62811L25699k7008K94952k05002M32968
2292.3G61931381p0038o68411m74777n20554k136q93707n85175m62951J05056M88816
2302G58847504J61667P400q71048O3095m10690k28958m18320j514282n37491m66461
2311.6G54632416q2703r97314l35999j11999q43888j86157o61926j83258j172791o11801
$$ y = [760354919, 760170746, 760804672, 760891037, 760595093, 760190353, 760367813, 760890198, 761224823, 761322021, 761219254, 761319580, 760997162, 761209106, 761343155, 761019058, 760726852, 760657959, 761210022, 761143570, 760994492, 760918579, 760774002, 760679245, 760970459, 761087646, 760615234, 760901260, 761061478, 761346054, 761288834, 761427917, 762222595, 762310410, 762462692, 762138901, 762265625, 762348022, 762035522, 762119446, 762237778, 762364960, 761633987, 761503143, 761272583, 761109772, 761435471, 761408463, 761703415, 761498413, 761931381, 761861343, 761192932, 760718155, 760197601, 760195465, 759301758, 758716583, 758253632, 758358688, 758847504, 759009171, 759016571, 758145523, 758208618, 757797928, 757568970, 757150650, 755636368, 755098877, 754632416, 754549713, 753552399, 753216400, 753104401, 752260513, 752074356, 751412430, 751229172, 750056381, 749444580]
2321.3G49444580J18637k44522j261139j711349N02548r96170o53382m90722l28064
2329.9G44380417M14963r54895l48282j27411K122803N3787j398087l91082j883317
2338.6G41868896p45468l46832M65393l54843l5172p1411k9602K194290K144318K741776
2348.3G47831345P63702j007538j253280k073899k596664k736817j603927j567459
2356G35755463q21610o91681j436920j725693m30755J289291N20706K341919Q65021
2364.7G35665741o9656J129608J175995N23681P88498L053436M52500k70004J620178
2373.3G44069977J843262R98001O55288K021714J190719P31812J330490J334381P09228
2382G54884872M12903N07431l77502k3804N20630L54538l7842j36184M01306K51388
$$ y = [749444580, 749563217, 749318695, 748057556, 746346207, 746848755, 745852585, 745199203, 744708481, 744380417, 744795380, 743840485, 743492203, 743364792, 745487595, 745541382, 744143295, 743752213, 741868896, 741123428, 740776596, 741241989, 740887146, 740851974, 740780563, 740750961, 742945251, 745089569, 747831345, 748595047, 747587509, 746334229, 744260330, 741663666, 738926849, 737322922, 735755463, 734933853, 734242172, 732805252, 731079559, 730648804, 731938095, 732458801, 734800720, 735665741, 735596085, 736725693, 737901688, 738425369, 739213867, 742267303, 742719803, 742449799, 744069977, 745913239, 746911240, 747566528, 749588242, 750778961, 751510773, 752841263, 754175644, 754884872, 755297775, 755805206, 755427704, 755403900, 755924530, 756279068, 756241226, 756105042, 756506348, 756757736]
2391.7G56757736m3106l19061J05362J31836m36173o95343o73752j66626k27432J3733
2401.3G54447174J31683M4785J6022K06299K61230j83487L87726j15662p28149m66767
2410.9G54000854l91769k94189n82886n65491o54907j28174J32828L03573M79584j87912
2420.6G52111511m730k16751k65961k83279p46155p63016n78689j03684j15967k66265
2430.2G48767014m94462o6146J08566j69678J90964K10724K60315j32599n10712p37839
2439.9G47426147o01577p04270j038437k22931M3641J56097k06680k10037L08685P8583
2449.5G45029221N2108j85699R0408m09698p87430m47769n99213k66724l15704l05939
2459.2G41853561n31158m39301j44882J6632M24805O3171j07803j51291J25580l46680
$$ y = [756757736, 756714630, 756395569, 756500931, 756632767, 756196594, 755501251, 754827499, 754660873, 754433441, 754447174, 754578857, 754623642, 754639664, 754845963, 755107193, 754923706, 755311432, 755195770, 754467621, 754000854, 753609085, 753314896, 752732010, 752166519, 751511612, 751383438, 751516266, 751819839, 752299423, 752111511, 752106781, 751890030, 751624069, 751340790, 750594635, 749831619, 749252930, 749149246, 749033279, 748767014, 748272552, 748206406, 748314972, 748145294, 748336258, 748546982, 748807297, 748674698, 748163986, 747426147, 746824570, 746120300, 745081863, 744858932, 744902573, 745058670, 744851990, 744641953, 744950638, 745029221, 745081329, 744895630, 744986038, 744576340, 743788910, 743341141, 742741928, 742475204, 742159500, 741853561, 741322403, 740883102, 740738220, 740754852, 741179657, 741242828, 741135025, 740983734, 741109314, 740762634]
2468.8G40762634o87713m82941r11942j63650n7831k69089j28708n7907J21766l89481
2478.5G37735138l25699K5940K00577l97263m93850J78146J4191l81241r46274n43900
2488.1G35065765O256j14593k3193K29873R6588j71508p2480l67889m1275k29k41013
2498.7G34366302k04544p43255k80914J29165j03988j48011m501K24380J62964k45514
2508.3G33152084n49469j51825K18811M3030n47714l08075m66232p97272K3346j38168
2518G30478516Q3847L87115J37253j17340j64108K84805k31705l25851n74494o97021
2527.6G29261017l62549n41000n08271n16586J75476Q2092N188J12229l08914R1247
2537.3G27489929N799j16883o17752n01938j49612p56302p51877r64126n46952K23770
$$ y = [740762634, 740074921, 739591980, 738680038, 738516388, 738458557, 738189468, 738060760, 738002853, 738124619, 737735138, 737409439, 737435379, 737635956, 737238693, 736744843, 736922989, 736937180, 736555939, 735609665, 735065765, 735072021, 734957428, 734934235, 735164108, 735260696, 735089188, 735016708, 734648819, 734607544, 734607315, 734366302, 734161758, 733418503, 733137589, 733266754, 733162766, 733014755, 733010254, 733234634, 733397598, 733152084, 732602615, 732450790, 732669601, 732712631, 732164917, 731856842, 731390610, 730593338, 730616684, 730478516, 730562363, 730949478, 731086731, 730969391, 730805283, 731090088, 730858383, 730532532, 729958038, 729261017, 728898468, 728357468, 727849197, 727332611, 727508087, 727590179, 727595367, 727707596, 727398682, 727489929, 727495728, 727378845, 726761093, 726259155, 726109543, 725353241, 724601364, 723637238, 723090286, 723314056]
2546.9G23314056K71149j49307m16489P6M01307L67813j72348k91825p48062p76214
2556.6G21800156j42670m86984q64182p68280j83563q1177L7613M56772L40042M8599
2566.2G20156326l07007k33306k51618n52444j019440n58395R6664m34036n06745l55682
2575.9G16034317k00348j65863j98593k2125J36337l4637k28196K23618l00064n40772
2585.5G14703674k53601n52368n59845n04227l03268l03574l9291j03836J5869L15857
2595.1G12415390l73154m28619r9411J64413l02429n56106m52500m90951J97220P0953
2604.8G10144806J51596k12402p19529K1134Q9722j96763m75540m54788m91104m28314
2614.4G07428818k72599l27987l23944o69632n29480m13895j97601m5014p1029Q3847
$$ y = [723314056, 723585205, 723435898, 723019409, 723019485, 723420792, 723788605, 723616257, 723324432, 722576370, 721800156, 721657486, 721170502, 720306320, 719538040, 719354477, 719273300, 719310913, 719767685, 720107727, 720156326, 719849319, 719616013, 719364395, 718811951, 717792511, 717234116, 717330780, 716896744, 716389999, 716034317, 715833969, 715668106, 715469513, 715447388, 715583725, 715549088, 715320892, 715544510, 715244446, 714703674, 714450073, 713897705, 713337860, 712833633, 712530365, 712226791, 712187500, 712083664, 712099533, 712415390, 712042236, 711613617, 711514206, 711678619, 711376190, 710820084, 710367584, 709876633, 710073853, 710144806, 710296402, 710084000, 709364471, 709385605, 709475327, 709278564, 708803024, 708348236, 707857132, 707428818, 707156219, 706828232, 706504288, 705834656, 705305176, 704891281, 704693680, 704648666, 704577637, 704661484]
2624.1G04661484l36533l86581m48609p50656q28323o56357p19223r37424m93622j30691
2633.7F98973465j28479l44925R613n4855m42887k90908p78885n69306k53601p02438
2643.4F95416794q80051o23474n87082p36084m37851l02963J7395k86636n04761L8071
2653F91113358j08567m38385p72094o13022m74930p03659o63071m55093p47376q33130
2662.6F85304031r7961j90888l1661k17591m68979O3782k23389k31170m93012m15802
2672.3F82997360n65948r55353k67487m28085l91693m15726o74057k76718n7678j6937
2681.9F78947678Q2092J34125m25415p09229p20978n36575o16760q46253l58886m86222
2691.6F74463577k60772K00576j53122n84564l68194L3035j63193m01077j038666o02188
$$ y = [704661484, 704324951, 703938370, 703489761, 702739105, 701910782, 701254425, 700535202, 699597778, 699104156, 698973465, 698844986, 698500061, 698509674, 698454819, 698011932, 697721024, 696942139, 696372833, 696119232, 695416794, 694536743, 693913269, 693326187, 692590103, 692152252, 691849289, 691866684, 691580048, 691075287, 691113358, 691004791, 690566406, 689794312, 689181290, 688706360, 688002701, 687339630, 686884537, 686137161, 685304031, 685206070, 685015182, 684983521, 684765930, 684296951, 684360733, 684137344, 683906174, 683413162, 682997360, 682431412, 681476059, 681208572, 680780487, 680388794, 679973068, 679299011, 679022293, 678964615, 678947678, 679029770, 679163895, 678738480, 678029251, 677308273, 676771698, 676154938, 675308685, 674949799, 674463577, 674202805, 674403381, 674250259, 673665695, 673297501, 673330536, 673167343, 672766266, 671727600, 671125412]
2701.2F71125412m9973o79550m32968m20761q09555o96411l14560j55487j63727j82571
2710.9F67219849n94025m66843j23367k80609o94351p64771l91388m32129n13992o7749
2720.5F62890625o4850o43463n84564r7580L04031j11084q38623o91147m63867m67834
2730.2F59231644m84925j63421l00370n95397l50190j34277p1182o04554k05841K17362
2739.8F56538849l08838m95453n16739J1978J00174k51999n08041m61960l00598m55627
2749.4F53351746k36359k77634q7585N4931j69830k60391k79541l70255n14755o6833
2759.1F51143494o20804o90537J25580R0561K66037m04205p36695k8381J39465l56063
2768.7F48928452o50483k00805j14975j72348l57209m45861n55649r84497n56565Q4000
$$ y = [671125412, 671075439, 670395889, 669962921, 669542160, 668732605, 668036194, 667721634, 667566147, 667402420, 667219849, 666625824, 666158981, 666035614, 665755005, 665060654, 664295883, 663904495, 663472366, 662958374, 662890625, 662825775, 662182312, 661597748, 661500168, 661804199, 661693115, 660854492, 660163345, 659699478, 659231644, 658746719, 658583298, 658282928, 657687531, 657337341, 657203064, 657131882, 656527328, 656321487, 656538849, 656230011, 655734558, 655217819, 655229797, 655329971, 655077972, 654569931, 654107971, 653807373, 653351746, 653115387, 652837753, 652750168, 652805099, 652635269, 652374878, 652095337, 651725082, 651210327, 651143494, 650522690, 649832153, 649957733, 650048294, 650314331, 649910126, 649173431, 649145050, 649284515, 648928452, 648277969, 648077164, 647962189, 647789841, 647432632, 646986771, 646431122, 645446625, 644890060, 644974060]
2778.4F44974060j64108m18701M5013j11084o23245n89600k99606k99072l79944k7466
2788F42106247o64063q84704l39127p42836q39424l57246m56391p03315j99547k26975
2797.7F36692619k99644n07469r02596o76727j034355m46320l66516j132393q22601
2806.3F30503998q21419n44319j86157o43082j290588q28591n56221p31468n91736
2815F24310417j013031n83763r80453j289216m47464q45069j120301j167564r63364
2823.7F15900192r50889j294175j135673q51517n37834n57938q74862j201706q04176
2832.4F07691422r44672j250153r94224j308861q75320r67255j453705j274147j606102
2841.1E97016983j812706j558113j278458j613846j744880j414528j474686j867065
$$ y = [644974060, 644809952, 644391251, 644436264, 644325180, 643701935, 643112335, 642812729, 642513657, 642133713, 642106247, 641442184, 640557480, 640218353, 639475517, 638636093, 638278847, 637822456, 637119141, 636919594, 636692619, 636392975, 635885506, 634982910, 634306183, 633271828, 632825508, 632458992, 631326599, 630503998, 629682579, 629138260, 628952103, 628309021, 627018433, 626189842, 625633621, 624902153, 624310417, 623297386, 622713623, 621733170, 620443954, 619996490, 619151421, 618031120, 616863556, 615900192, 614949303, 613655128, 612519455, 611667938, 611130104, 610572166, 609697304, 608495598, 607691422, 606746750, 605496597, 604502373, 603193512, 602318192, 601350937, 599897232, 598623085, 597016983, 595204277, 593646164, 592367706, 590753860, 589008980, 587594452, 586119766, 584252701]
2848.8E84252701j990624j714821j701850j430436j078376q40493j031532j326332
2856.5E73138237r44214q55064o71463p45888j092186r44977j200142j741638j460991
2865.2E63481674j017532j535225j856995j812553j672936j697235j701584j319084
2872.9E50868530k335586k818985j926079k089157k225723j939202j908836j633186
2880.6E33991776j482583j696014j214142n43442j245079j443405j41372k17476j022148
2889.3E24986115q55599q92601l56979J83334o6605k31056m59366o4468K5864n15519
2898.9E21753120l79028n6724m85383r94339o16912m38691n65261o29883o49834q30879
2908.6E16106186j054001p58552p29599n84565r57298j797981j759568j404266j585350
$$ y = [584252701, 582262077, 580547256, 578845406, 577414970, 576336594, 575496101, 574464569, 573138237, 572194023, 571338959, 570667496, 569921608, 568829422, 567884445, 566684303, 564942665, 563481674, 562464142, 560928917, 559071922, 557259369, 555586433, 553889198, 552187614, 550868530, 548532944, 545713959, 543787880, 541698723, 539473000, 537533798, 535624962, 533991776, 532509193, 530813179, 529599037, 529055595, 527810516, 526367111, 526225739, 526008263, 524986115, 524130516, 523237915, 522880936, 523064270, 522997665, 522766609, 522307243, 522242775, 522268639, 521753120, 521374092, 521317368, 520831985, 519837646, 519220734, 518782043, 518216782, 517586899, 516937065, 516106186, 515052185, 514293633, 513564034, 512979469, 512022171, 510224190, 508464622, 507060356, 505475006]
2917.2E05475006k378006j990204j317939j550065j523323j175270p70149p41272j149902
2925.9D92878876j481667j98479N15671l88870j63498J88980N13802Q37211J009446
2934.6D93711472J090889J310348J886978J325264J608849K539444K389717K059440
2942.3E07922401J907120K030945K070541K250252K041855K141457K252388J629829
2950E24246788K086678K563629K193489K035599K081222K058411K200699K023849K056809
2958.7E43547173K390441J937294J922341J931076J750526J777726J771125J918183
2966.4E58945885J702041J785584J869964J419602J252060K071800K010765Q99468
2974.1E71957169J082573J375503J435394J276207J424561J671676R10607R62639J150284
$$ y = [505475006, 503097000, 501106796, 499788857, 498238792, 496715469, 495540199, 494770050, 494028778, 492878876, 491397209, 491198730, 491714401, 491325531, 491162033, 491351013, 491864815, 492702026, 493711472, 494802361, 496112709, 497999687, 499324951, 500933800, 503473244, 505862961, 507922401, 509829521, 511860466, 513931007, 516181259, 518223114, 520364571, 522616959, 524246788, 526333466, 528897095, 531090584, 533126183, 535207405, 537265816, 539466515, 541490364, 543547173, 545937614, 547874908, 549797249, 551728325, 553478851, 555256577, 557027702, 558945885, 560647926, 562433510, 564303474, 565723076, 566975136, 569046936, 571057701, 571957169, 573039742, 574415245, 575850639, 577126846, 578551407, 580223083, 581133690, 582096329, 583246613]
2982.8E83246613Q67576R28497J219025J351891R05265N47753O37359Q39882Q19970
2991.5E91363831O54983L12729K28386L40881O32668Q10432J34239j75514J75591O84242
3001.1E95162468L00178m98466o62689m66461J57928P0763k47536l50151N9586K9945
3010.8E93555565o77605l59649l71056j20659k29225q00591p63359o12869m73480j476517
3020.4E87670555j149826k80456n25055n75676q04596p96547p90634n37720p84035
3029.1E81426010o24008k15378r86595j177635j112976q67119j281395j482887p10411
3037.8E72967606m38729q26797j369667n14756n16128j067925q29124j157227j302604
3046.5E64944649j584320j234856q19206r97048j167183j170921o56357p67097r29756
$$ y = [583246613, 584114189, 585042686, 586261711, 587613602, 588518867, 589066620, 589703979, 590543861, 591363831, 592018814, 592331543, 592559929, 592900810, 593533478, 594343910, 594478149, 594302635, 594478226, 595162468, 595462646, 594964180, 594301491, 593835030, 593992958, 594063721, 593816185, 593466034, 593525620, 593555565, 592877960, 592518311, 592147255, 592026596, 591797371, 590996780, 590233421, 589620552, 589147072, 587670555, 586520729, 586240273, 585715218, 585139542, 584334946, 583538399, 582747765, 582210045, 581426010, 580802002, 580586624, 579600029, 578422394, 577309418, 576442299, 575160904, 573678017, 572967606, 572528877, 571702080, 570332413, 569817657, 569301529, 568233604, 567404480, 566247253, 564944649, 563360329, 562125473, 561306267, 560309219, 559142036, 557971115, 557314758, 556547661, 555617905]
3055.1E55617905j087380j348419j232376j240387q84895n47066r19838j026611r50203
3063.8E46380730j614457j095848n97839j532249j247254n96084o19736r64661j424408
3072.5E36688194j030159p42378j363907r80568n02357j307411j306839r78623q36334
3081.2E27639618j104240j340561o87104q85887j395225j502381r90715o82831r86137
3089.9E18064537j084290j482048j243629j081505r03740m40941j087150j325188n96580
3098.5E08819466m76227j134491j403313j375885r02710p06062j120758j175347j192779
3107.2D99331894q67386r11140j061821r69239q20236q04748j131936j213340j680146
3115.9D89871902p85598m13628j466865j391182r92241l47596r89837j370850p40394
$$ y = [555617905, 554530525, 553182106, 551949730, 550709343, 549824448, 549277382, 548357544, 547330933, 546380730, 544766273, 543670425, 543072586, 541540337, 540293083, 539696999, 539077263, 538112602, 536688194, 535658035, 534915657, 533551750, 532571182, 532068825, 530761414, 529454575, 528475952, 527639618, 526535378, 525194817, 524507713, 523621826, 522226601, 520724220, 519733505, 519050674, 518064537, 516980247, 515498199, 514254570, 513173065, 512269325, 511828384, 510741234, 509416046, 508819466, 508343239, 507208748, 505805435, 504429550, 503526840, 502820778, 501700020, 500524673, 499331894, 498464508, 497553368, 496491547, 495522308, 494702072, 493897324, 492765388, 491552048, 489871902, 489086304, 488672676, 487205811, 485814629, 484822388, 484474792, 483484955, 482114105, 481373711]
3124.6D81373711p47338r32235j353150p96318q81424j176948j158028j393013j176910
3133.3D71758347q29545l6163p02438j211624o76270n74188q68607j493263j417503
3141.9D63948746j521988n12200k64015j146927p77511j040840q75473r45511j102486
3150.6D55761795n07355m24881j155052j636314m69170k21367p68203j174393j144600
3159.3D48260460r70039j671296r66873l87153r46732j111183p50885l63503o45637
3168D40447159j000366p12891j09482p00683j205330j065445q94509o81076r58824
3176.6D33118553p11555p79496o39991n22919j197853n53246K14806m61731j320419
3185.3D27146149j206284j091003r38721n99747m62646l31803p09304p15943p56836
$$ y = [481373711, 480626373, 479694138, 478340988, 477544670, 476663246, 475486298, 474328270, 472935257, 471758347, 470928802, 470892639, 470190201, 468978577, 468302307, 467728119, 466859512, 465366249, 463948746, 462426758, 461914558, 461650543, 460503616, 459726105, 458685265, 457809792, 456864281, 455761795, 455254440, 454829559, 453674507, 452038193, 451569023, 451347656, 450579453, 449405060, 448260460, 447290421, 445619125, 444652252, 444265099, 443318367, 442207184, 441456299, 441092796, 440447159, 439446793, 438733902, 438624420, 437923737, 436718407, 435652962, 434758453, 434077377, 433118553, 432406998, 431627502, 430987511, 430464592, 429266739, 428713493, 428928299, 428466568, 427146149, 425939865, 424848862, 423910141, 423310394, 422847748, 422515945, 421806641, 421090698, 420333862]
3194D20333862r94835q19511l46298m71459q73947k16598o63834j063728o31295o35948
3203.6D13616409m60968m49829o16264j141358p29408n07660o28662n9090o95838j093674
3213.3D07233658o16875q201l19977p67136l56026o65359j176262r41353k98118o42472
3222.9D01441879n31883M2534l25813k87133k49061p4654q50372j252823l26653k64396
3232.6C97321625l22075o76193q76694p65953k18926k13585j097106n66330J25045
3241.3C92709808k4757p11861o72760k56157p59544n41954k57225n96428o77643l22189
3250.9C87889290m53224n42336k08855m76303n51948m40827l36608n3635P8468n52978
3260.5C84351044j056023m54521P8773m7950o37017l52592r6016l54157k17475l75824
$$ y = [420333862, 419339027, 418519516, 418173218, 417701759, 416827812, 416611214, 415947380, 414883652, 414252357, 413616409, 413155441, 412705612, 412089348, 410947990, 410218582, 409710922, 409082260, 409023170, 408327332, 407233658, 406616783, 406608582, 406288605, 405521469, 405165443, 404500084, 403323822, 402382469, 402084351, 401441879, 400909996, 400952530, 400626717, 400339584, 400090523, 400015869, 399165497, 397912674, 397586021, 397321625, 396999550, 396323357, 395446663, 394680710, 394461784, 394248199, 393151093, 392584763, 392709808, 392685051, 391973190, 391300430, 391044273, 390284729, 389742775, 389485550, 388889122, 388211479, 387889290, 387436066, 386893730, 386684875, 386208572, 385656624, 385215797, 384879189, 384825554, 384904022, 384351044, 383295021, 382840500, 382919273, 382871323, 382234306, 381881714, 381785698, 381431541, 381214066, 380838242]
3270.2C80838242o53801p97196j39046k36625n41802k82364q45718k8229K23580o74362
3279.8C76862679n12581k13242l11050l19939R3002k65846k96860l15094q72421k44560
3289.5C73604088J66015l6125o94046p34901K6932k46621l72581m01497n32722m3984
3299.1C70734558j43776l34587k26631k60506k2735m39797p18269j84212j68533l40080
3308.8C67895432l92380l29972l94477n36004o60743m24690J1329k38151j88523l91960
3318.4C64349861p18002m95529j78376m8446o03829n72891o64940n34591K5787j63727
3328.1C60395317l73802o39649k49137m49028n28069q4610o94389o62995q9836J60332
3337.7C56784134n56336k90832J08414r45702o78062j54381k7123o38847p28798p7209
$$ y = [380838242, 380184441, 379387245, 379248199, 379011574, 378469772, 378187408, 377341690, 377313461, 377537041, 376862679, 376350098, 376136856, 375825806, 375505867, 375598869, 375333023, 375036163, 374721069, 373848648, 373604088, 373770103, 373733978, 373039932, 372305031, 372331963, 372085342, 371712761, 371311264, 370778542, 370734558, 370590782, 370256195, 370029564, 369769058, 369746323, 369306526, 368588257, 368404045, 368235512, 367895432, 367503052, 367173080, 366778603, 366242599, 365581856, 365157166, 365168495, 364930344, 364741821, 364349861, 363631859, 363136330, 362957954, 362909508, 362305679, 361732788, 361067848, 360533257, 360559044, 360395317, 360021515, 359381866, 359132729, 358683701, 358155632, 358071022, 357376633, 356713638, 356623802, 356784134, 356227798, 355936966, 356045380, 355099678, 354421616, 354267235, 354240112, 353601265, 352872467, 352795258]
3347.3C52795258n11971m50630n70145m67377m46014m23393Q964n25627m80652o04553
3357C48323860n13229J04141l18832q02231o30799k07290L2997J41144m72336o48155
3366.6C45009270m55475n51224k89345l94592k71034m17443n33065m81339n23796j21345
3376.3C40970612m46129n54886k01950n5847l26996k41966m3221r09386l62129K88468
3385.9C38116570m01993m40827j15928j04409J0415L72200l90473p82814m42772l87001
3395.6C35432968K12975n684k60430k34069n9433J49421m10537P8811P5646m40255
3405.2C34539413O6720j59379m91981m12102j41372l0632p1946K43073n6305j73798
3414.8C33311691J31951j31874n31693n04646n7411O0043K69356L37066n1498j3924
$$ y = [352795258, 352283287, 351832657, 351262512, 350795135, 350349121, 349925728, 349934692, 349409065, 348928413, 348323860, 347810631, 347914772, 347595940, 346793709, 346162910, 345955620, 345988617, 346129761, 345657425, 345009270, 344553795, 344002571, 343713226, 343318634, 343047600, 342630157, 342097092, 341615753, 341091957, 340970612, 340524483, 339969597, 339767647, 339711800, 339384804, 339142838, 339099617, 338190231, 337828102, 338116570, 337714577, 337273750, 337157822, 337053413, 337063828, 337436028, 337045555, 336262741, 335819969, 335432968, 335645943, 335640259, 335379829, 335145760, 335086327, 335235748, 334825211, 334904022, 334979668, 334539413, 334606133, 334446754, 333954773, 333542671, 333401299, 333370667, 333298721, 333541794, 333485489, 333311691, 333443642, 333311768, 332780075, 332275429, 332218018, 332278061, 332547417, 332884483, 332832985, 332819061]
3424.5C32819061r8839J91041L88755l81698l50151J30806N76400Q81691r5367l87688
3434.1C33674011Q2398l50609k72865J87912M86640M27247M14199N36995l11622j30921
3443.8C34743385K67525L78189N02205p86438K55089J438865N63202n1879l39699Q8005
3453.4C37058449M93088J98555J57928M57077L87116K93083M48570N87769O66694R5902
3463.1C40844231L09829O61278N07431P12052J15318k80991o7558K15950L10745O43845
3472.7C43972130J118049J89476k58560Q37632J334419M80804k0027M86488P25327
3481.4C48865738J54266k54631O63414O84967K67716P08122M46205M94003P54013K72904
3491C53056717M63829Q82797j37749k32772M70733K70424J167908J229324N09606P87887
$$ y = [332819061, 332720222, 332911263, 333300018, 332918320, 332568169, 332698975, 333275375, 334157066, 334061699, 333674011, 333756409, 333405800, 333132935, 333320847, 333807487, 334234734, 334648933, 335185928, 334874306, 334743385, 335010910, 335389099, 335891304, 335104866, 335359955, 336798820, 337362022, 337310143, 336970444, 337058449, 337551537, 337750092, 337908020, 338365097, 338752213, 339045296, 339493866, 340081635, 340748329, 340844231, 341154060, 341815338, 342322769, 343034821, 343150139, 342869148, 342801590, 343017540, 343328285, 343972130, 345090179, 345279655, 345021095, 345858727, 347193146, 347673950, 347653923, 348140411, 348865738, 349020004, 348765373, 349428787, 350113754, 350381470, 351089592, 351535797, 352029800, 352783813, 353056717, 353520546, 354403343, 354265594, 354032822, 354503555, 354773979, 355941887, 357171211, 357680817, 358468704]
3500.7C58468704J138230O19964n48515K20718J062203J36871j5640J476517Q33740
3509.4C63392792p78771O17676Q26378M92592Q50525R62791O51474K80113R59549R68666
3519C69223785N15595P02858Q94050J73111m49371N40848J410408J356811N21431K73362
3528.6C75162888k15836O06728J139297M88625J017189P86094J417046L40462p08237
3537.3C80034256J066132R20028J224404R33532J106034R94491K52495N48706O42967
3546C87723045J332474m24042Q97789J406441P45010J469384j11275J448402Q78487
3554.7C95365715J484756K237130m66957N88111J064339Q71277N02358J768875J446228
3563.4D04861832J135521M454956j32523j104927K47993l19061L477669J610870J550598
$$ y = [358468704, 359606934, 360226898, 359678383, 359899101, 360961304, 361098175, 361082535, 362559052, 363392792, 362614021, 363231697, 364058075, 364550667, 365401192, 366363983, 367015457, 367295570, 368255119, 369223785, 369739380, 370442238, 371336288, 371509399, 371060028, 371600876, 373011284, 374368095, 374889526, 375162888, 374947052, 375553780, 376693077, 377181702, 378198891, 378984985, 380402031, 380742493, 380034256, 381100388, 382020416, 383244820, 384178352, 385284386, 386278877, 386531372, 387080078, 387723045, 389055519, 388631477, 389529266, 390935707, 391680717, 393150101, 393038826, 394487228, 395365715, 396850471, 399087601, 398620644, 399208755, 400273094, 401144371, 401646729, 403415604, 404861832, 405997353, 410452309, 410319786, 409214859, 409462852, 409143791, 412621460, 414232330, 415782928]
3572D15782928J893960J543769J491280J288147J386642K30942K280998J380272M6845
3580.7D27325783J690483K240867J878052R18350L444558J640434n72929J403274q81653
3589.4D39087219L155747L411293K955322J078873M94537L530121j473160J532059
3597.1D53772011L757973J033592L047714J116562Q94127K332077J335792J502457
3604.8D68792305L077698K629165p45811M039421J16501p89757P384110J311988j479492
3613.5D84336128L911972j315536M008293N229645k12403K99225j318435J456718L829002
3622.2E00224609K927857K027893J937904J272888J851578O552086l03612r404297
3629.9E07086906M812432N292587N700493J699486r37271K642211K693253J586189
$$ y = [415782928, 417676888, 419220657, 420711937, 422000084, 423386726, 423617668, 425898666, 427278938, 427325783, 429016266, 431257133, 433135185, 434053535, 437498093, 439138527, 438565598, 439968872, 439087219, 442242966, 445654259, 448609581, 449688454, 450182991, 453713112, 452239952, 453772011, 457529984, 458563576, 461611290, 462727852, 463621979, 465954056, 467289848, 468792305, 471870003, 474499168, 473753357, 477792778, 477909279, 477119522, 484503632, 485815620, 484336128, 488248100, 486932564, 490940857, 496170502, 495958099, 496257324, 494938889, 496395607, 500224609, 503152466, 505180359, 507118263, 508391151, 510242729, 516794815, 516491203, 507086906, 511899338, 517191925, 522892418, 524591904, 523654633, 526296844, 528990097, 530576286]
3637.6E30576286J70327J499633K536660K937812J495552L88566K704582L647537M837494
3646.3E50794449j686859k984238N226212o93016k702752P75681N696869M306755M145813
3655E62878914L518066q755073K778625N264054J188354J375542Q66356K726020J120682
3663.6E72961540J350861J756172N55725M017105J875191j59569M88281o840629L333816
3672.3E79338493Q928376Q978042j755981j6716919L526497P563553M760704j360474
3680E93262291O50063J758880J379929K068634L95126O51016M264183O156006r443817
3688.7F01142311k369079R521484o352692l89976N524406R47037J634445K74925n340
3697.4F09927521J454086Q71735K858848K799645n618935j556015N217476J727905
$$ y = [530576286, 530746613, 532246246, 534782906, 537720718, 539216270, 539604836, 542309418, 545956955, 550794449, 549107590, 546123352, 551349564, 550656548, 547953796, 548729477, 554426346, 558733101, 562878914, 566396980, 557641907, 560420532, 565684586, 566872940, 568248482, 569114838, 571840858, 572961540, 574312401, 576068573, 576624298, 580641403, 582516594, 582357025, 582845306, 576004677, 579338493, 588266869, 597244911, 595488930, 578772011, 582298508, 589862061, 594622765, 593262291, 593912354, 595671234, 597051163, 599119797, 599514923, 600165939, 604430122, 610586128, 601142311, 598773232, 608294716, 601942024, 601552048, 607076454, 608023491, 609657936, 609932861, 609927521, 611381607, 612253342, 615112190, 617911835, 612292900, 610736885, 615954361, 617682266]
3705.1F17682266N25398j564K429276M123383p359810M109344M455109j2519264M912605
3713.8F18356743M877167P39936P65686J885415O81648l072548K055550O172485m159889
3722.5F28302193m571343N225411N93147r30023l030815O71653M867478K126159N705300
3731.2F38959160n148201p309799J1448555J248588j0462951J807861K415085L98330
3738.9F33356628M029198L957253n061875K912026J3049354j2835541j6736908J2041169
3746.6F34711304O200332N427399m368286q661423J1768570n674896n961533O547394
3754.3F39988861N113754K652207o167145K989197O207504q006897j067047M838409
3762F46548843J199570K67792L421020l163147m136963M678956N674362q07495j0094223
$$ y = [617682266, 618207664, 618206100, 620635376, 624758759, 617398949, 621508293, 625963402, 613444138, 618356743, 623233910, 623973846, 624739532, 626624947, 627306595, 624234047, 626289597, 632462082, 628302193, 623730850, 628956261, 629549408, 628619385, 625588570, 626260223, 631127701, 633253860, 638959160, 633810959, 626501160, 637949715, 639198303, 628735352, 630543213, 632958298, 633356628, 637385826, 641343079, 636281204, 639193230, 652242584, 639407043, 622670135, 634711304, 640911636, 646339035, 641970749, 633309326, 645077896, 639403000, 633441467, 639988861, 645102615, 647754822, 641587677, 644576874, 650784378, 642777481, 641710434, 646548843, 647748413, 648016205, 651437225, 648274078, 644137115, 648816071, 654490433, 653682938, 643588715]
3770.7F43588715K596130M523926M19616J23291o7901J581344P09687K847900o36902
3779.4F55685806q479614L459778L034897J124267K245331l430786q69751J748276
3787.1F54518204R43603L07846l12576R25598q6441L43552N50384J601792K953872
3795.8F61745834m206772l641281K423554M980240O720504p817230j1172256L887329
3803.5F52919922L521805N954818O842270j0321579n005188N355988K429275N55497
3811.2F62252808J65252j38550J431046N400543k649383j4092102O075897O038589
3818.9F64484100M122620J503296j6957016K649155O585235K697373K829132M06799
3826.6F68320694m975739j39694K536469L502350J711654q124695L032761O727066
$$ y = [643588715, 646184845, 650708771, 651128387, 651251678, 651183777, 652765121, 653474808, 656322708, 655685806, 647206192, 650665970, 653700867, 654825134, 657070465, 653639679, 652769928, 654518204, 655461807, 655769653, 655457077, 656382675, 656296234, 656639786, 657190170, 658791962, 661745834, 657539062, 653897781, 656321335, 661301575, 668022079, 660204849, 649032593, 652919922, 656441727, 662396545, 669238815, 658917236, 653912048, 659268036, 661697311, 662252808, 662418060, 662279510, 663710556, 669111099, 666461716, 652369614, 658445511, 664484100, 668606720, 670110016, 653153000, 655802155, 662387390, 665084763, 667913895, 668320694, 663344955, 663205261, 665741730, 669244080, 670955734, 662831039, 665863800, 672590866]
3834.3F72590866o944199k49862P065506r794541j736602Q695678n746841P24716P114716
3843F71719437l762207l771058L519364J797867K89612J613082j668396K073975O822510
3851.7F78634186n190354R85337j6885300J452255J1686096l88031j610107K458954
3859.4F71143036K089996K123337o236191o0959P858277o379319o219482M934387O356812
3868.1F75609894P633362p949448j1211700L632278P376862M763412j0841446P86362
3875.8F69799576M209518k67410K335281M305573o885452p500611P719422K259369
3883.5F75975266J496124M568481j3565826K159424M239044K35519L811646j542282
3891.2F77377396p569962K143173M282608p94830O73065Q66928K660370K404785r924926
$$ y = [672590866, 665646667, 665396805, 672462311, 662667770, 660931168, 669626846, 663880005, 664604721, 671719437, 667957230, 664186172, 667705536, 669503403, 669793015, 671406097, 669737701, 671811676, 678634186, 673443832, 674429169, 657543869, 658996124, 670682220, 670294189, 668684082, 671143036, 673233032, 675356369, 669120178, 669059219, 676917496, 670538177, 664318695, 669253082, 675609894, 683243256, 675293808, 664082108, 667714386, 675091248, 679854660, 669013214, 669799576, 674009094, 673741684, 676076965, 680382538, 673497086, 665996475, 673715897, 675975266, 677471390, 682039871, 668474045, 670633469, 674872513, 675108032, 678919678, 677377396, 669807434, 671950607, 676233215, 675438385, 676111450, 676978378, 679638748, 682043533, 672118607]
3899.9F72118607M816207J921082n356445N826950k960510k275086L23029R33303K607956
3908.6F77955093l64456n08117m75159M01840J93176j06201J991730K085571l623657
3917.3F77549820l277512M648896k45209l851471K833557K061920R82437k555618k757034
3926F75389786J879425J534118J148987j530304l92837K457809j947784j220093J174622
3934.6F78493729L80020P53326J69525p32650L9825J02081J378327J215057m302597
3943.3F77496643r06906K210159J666870J036377k381744J287384M74548k587280J579437
3952F79875488M36707j27335m5089J84860P53631p75375J40610J98517J002655L5705
3961.6F81680374j854324K62756O86035J23902m37546M43725R78318p01065n53360
$$ y = [672118607, 676934814, 678855896, 673499451, 679326401, 676365891, 674090805, 674413834, 675347137, 677955093, 677590637, 677082520, 676607361, 677009201, 677202377, 677096176, 679087906, 681173477, 677549820, 674272308, 678921204, 678675995, 674824524, 677658081, 679720001, 680702438, 678146820, 675389786, 677269211, 678803329, 679952316, 678422012, 678029175, 680486984, 678539200, 677319107, 678493729, 678873749, 679627075, 679796600, 679063950, 679103775, 679205856, 680584183, 681799240, 677496643, 676589737, 678799896, 680466766, 681503143, 679121399, 680408783, 680883331, 678296051, 679875488, 680312195, 680184860, 680139771, 680324631, 681078262, 680302887, 680443497, 680642014, 681644669, 681680374, 679826050, 680088806, 680774841, 680898743, 680461197, 680904922, 681883240, 681182175, 680628815]
3970.3F80628815R01565O09665l13949L92913J8311j092606o13403P02057O74515j21384
3980F81786499K10114J20544J92795l09830o08749K94723N10254l67203o28280J176681
3989.6F82377548M61350o03257J82801Q7127M35639r04923q24890R65500M49524J39389
3999.2F82765808P06024
4000.2F83471832
$$ y = [680628815, 681530380, 682140045, 681826096, 682219009, 682237320, 681144714, 680531311, 681233368, 681907883, 681786499, 681996613, 682117157, 682309952, 682000122, 681391373, 681686096, 682196350, 681829147, 681200867, 682377548, 682838898, 682235641, 682418442, 682505569, 682941208, 682036285, 681211395, 682176895, 682626419, 682765808, 683471832]
##END=$$ End of the data block
