##TITLE=$$ Begin of the data block
##JCAMP-DX=5.00 $$ ACD/SpecManager v 10.08
##SPECTROMETER/DATA SYSTEM=Varian
##DATE=20 Nov 2012 13:28:22
##DATA TYPE=INFRARED SPECTRUM
##DATA CLASS=XYDATA
##ORIGIN=
##OWNER=
##NPOINTS=3735
##FIRSTX=399.26403809
##LASTX=4000.35498047
##MAXX=4000.35498047
##MINX=399.26403809
##MAXY=76.30413055
##MINY=26.99922371
##XFACTOR=1.0000000000
##YFACTOR=0.000000100000000
##FIRSTY=56.11574173
##DELTAX=0.96440572
##XUNITS=1/CM
##YUNITS=TRANSMITTANCE
##XYDATA=(X++(Y..Y))
399.3E61157417k7414512k1254425J701507L152428J181030k155723q42476Q90197
$$ 561157417 533742905 512488480 514189987 517342415 518523445 516367722 515525246 516415443
407E16415443M585953k319984O008415O371422o065560l308029k513237K532387m60167
$$ 516415443 521001396 518681412 524689827 531061249 524995689 521687660 519174423 521706810 521246643
415.7E21246643L80402K059211M457436P848892j2712211m69857J422577L226586L355980
$$ 521246643 521627045 523686256 528143692 535992584 523280373 522810516 524233093 527459679 530815659
424.3E30815659l50266m345550m864159j636963n357437q2092o58684n393105k696953
$$ 530815659 530465393 526119843 521255684 519618721 514261284 514179192 513520508 508127403 505430450
433E05430450j374397L290024J554756M505501M452782o27098n494805l744316K819328
$$ 505430450 504056053 507346077 508900833 513406334 517859116 517232018 511737213 507992897 510812225
441.7E10812225J679764M518204J207771m64706m43840j040764O410637N385284Q67996
$$ 510812225 512491989 517010193 518217964 517753258 517309418 516268654 522679291 528064575 528932571
450.4E28932571k97889J948585j782760l165741N18646l089600j821594J014862R10988
$$ 528932571 528634682 530583267 528800507 525634766 526153412 523063812 521242218 522257080 523168068
459.1E23168068j009140Q42628L640633j892395k156410J60637J11503l367691m190330
$$ 523168068 522158928 523001556 526642189 524749794 522593384 522754021 522865524 519497833 515307503
467.7E15307503p09992l86734j290130j023827n239639q289795L134460M158516J81313
$$ 515307503 514597511 514210777 512920647 511896820 506657181 498367386 501501846 505660362 505841675
476.4E05841675r67865j390038k37121k829895k236824k662011m73365Q21418j286544
$$ 505841675 504873810 503483772 503246651 500416756 498179932 495517921 495044556 495865974 494579430
485.1D94579430P26890p84416l10059l14025J637725N977745M459839k988853j607247
$$ 494579430 495306320 494521904 494211845 493897820 495535545 501513290 505973129 502984276 501377029
493.8E01377029R90677l066673j236763k329483l144875k560005l102722K0561o30798
$$ 501377029 502367706 499301033 498064270 495734787 492589912 490029907 486927185 486947746 486316948
502.5D86316948K228241K124519r66186l184929n33867n32494m856224m97589n07469
$$ 486316948 488545189 490669708 489703522 486518593 485984726 485452232 480596008 480098419 479590950
511.1D79590950j752090l079377k605285j39199k873191r99756k117844j947441j016693
$$ 479590950 477838860 474759483 472154198 472014999 469141808 468142052 466024208 464076767 463060074
519.8D63060074L24097N05180r03435p87430n129585k191925O72722o38466j019630
$$ 463060074 463384171 463889351 462985916 462198486 457068901 454876976 455549698 454911232 453891602
528.5D53891602o72379K286797L54614J387443J710205J350861Q91762N57823L552132
$$ 453891602 453219223 455506020 455860634 457248077 458958282 460309143 461200905 461758728 465310860
537.2D65310860K784691L023986P58095q89931K007714K346611J826439J085777J549492
$$ 465310860 468095551 471119537 471877632 470987701 472995415 475342026 477168465 478254242 479803734
545.9D79803734J561317Q91533Q39424Q76580n15023k261047k695847l200111n27840
$$ 479803734 481365051 482256584 483096008 483972588 483457565 481196518 478500671 475300560 474772720
554.5D74772720J00518j316948k731438j291771K326050q47817k332725j175041j109581
$$ 474772720 474873238 473556290 470824852 469533081 471859131 471011314 468678589 467503548 466393967
563.2D66393967j669846k454796k821769m372750m234276m521904k158775k226524
$$ 466393967 464724121 462269325 459447556 455074806 450840530 446318626 444159851 441933327
570.9D41933327k085877n30243r09576K046852Q89664j97678O00395J740532K569351
$$ 441933327 439847450 439317207 438407631 440454483 441344147 441146469 441746864 443487396 446056747
579.6D46056747Q69065J027488K397080L263435K074242K893410L813057L138084K103539
$$ 446056747 446925812 447953300 450350380 453613815 455688057 458581467 462394524 465532608 467636147
588.3D67636147K732391N160866L056678m34875r71756J32294l04756q99621K17209
$$ 467636147 470368538 475529404 478586082 478151207 477179451 477311745 477006989 476107368 476324577
597D76324577k54364r71794j442833m09927J134376K051735J178856m52766R15527
$$ 476324577 476070213 475098419 473655586 473245659 474380035 476431770 477610626 477157860 478073387
605.6D78073387M10042m63333K09923n24865j739692j6976J013909m42047J595039
$$ 478073387 478483429 478020096 478230019 477705154 475965462 475948486 476962395 476520348 478115387
614.3D78115387J383400J236877L016510K278977J946106J906814K048035M65317N64346
$$ 478115387 479498787 480735664 483752174 486031151 487977257 489884071 491932106 492397423 492961769
623D92961769J435280N20325N52520Q16803J124192O13517J548615K250061J905785
$$ 492961769 494397049 494917374 495469894 496286697 497410889 498024406 499573021 501823082 503728867
631.7E03728867K383728K158775J301079O6642P69959O6185j665039k89879O00052
$$ 503728867 506112595 508271370 509572449 509639091 510409050 510475235 508810196 508520317 509120369
640.4E09120369K20299N28526J166649J071663J076660Q96606K159920K192040R3536
$$ 509120369 509340668 509869194 511035843 512107506 513184166 514080772 516240692 518432732 518526268
649E18526268J83754r07364j220779j90659m41093l25127L86086J633529J420632J369781
$$ 518526268 518710022 517802658 516581879 516391220 515950127 515625000 516011086 517644615 519065247 520435028
658.7E20435028J498718J226426L38630p63Q44383N9090P8354M33655l260651j2155227
$$ 520435028 521933746 523160172 523498802 523498039 524342422 524401512 524479866 524913521 521652870 509497643
668.3E09497643O700897N787010J876984J224174J692810L234062L224182J037255
$$ 509497643 516198540 521985550 523862534 525086708 526779518 530013580 533237762 534275017
676.1E34275017p4196l18527K72064j070824j446380o12183L25890J269073L43552
$$ 534275017 534200821 533882294 534154358 533083534 531637154 531024971 531350861 532619934 532963486
684.7E32963486Q24699J444512J654510J358490J245308J366920N66712M95453j258698
$$ 532963486 533788185 535232697 536887207 538245697 539491005 540857925 541424637 541920090 540661392
693.4E40661392k825889k062073j283722j918793j821708j90506n78118N5390N55572
$$ 540661392 537835503 535773430 534489708 532570915 530749207 530558701 529980583 530035973 530591545
702.1E30591545M06151L21388j541977j194954k38876j265564k450829j263198K67067
$$ 530591545 530997696 531319084 529777107 528582153 528343277 527077713 524626884 523363686 523630753
710.8E23630753k74735J83487J337585K870331M100685L245888K412377L013076K079163
$$ 523630753 523356018 523539505 524877090 527747421 531848106 535093994 537506371 540519447 542598610
719.5E42598610J872902K581940J179771J480789J534004Q11997J682167K438812L551636
$$ 542598610 544471512 547053452 548233223 549714012 551248016 552060013 553742180 556180992 559732628
728.1E59732628L197174K596512L979912L833465K126579J363488O53763k47422o5689
$$ 559732628 562929802 565526314 569506226 573339691 575466270 576829758 577483521 577236099 577170410
736.8E77170410P9003m69017l71628k99759N21660J577263J315078Q39386P44133J199303
$$ 577170410 577249413 576780396 576408768 576109009 576630669 578207932 579523010 580362396 581106529 582305832
746.5E82305832k556k026863j752625k227821l502769k634392k399902l169213k467308
$$ 582305832 582303276 580276413 578523788 576295967 572793198 570158806 567758904 564589691 562122383
755.1E62122383k020721j190453n03425o36445o01425j479034j420784j049729k215576
$$ 562122383 560101662 558911209 558407784 557771339 557169914 555690880 554270096 553220367 551004791
763.8E51004791j574974k19078q54835l93372J237335J958275J754723K221908L741036
$$ 551004791 549429817 549210739 548355904 547962532 549199867 551158142 552912865 555134773 558875809
772.5E58875809M546966M888840M957619M634971L516922K716446K512970J789513
$$ 558875809 563422775 568311615 573269234 577904205 581421127 584137573 586650543 588440056
780.2E88440056O69365R31930L030739L896446L200722L272247L503266L509483L435707
$$ 588440056 589109421 590041351 593072090 596968536 600169258 603441505 606944771 610454254 613889961
788.9F13889961K744026K774277J498261q38814j568947p23190R81292N30777J147576
$$ 613889961 616633987 619408264 620906525 620067711 618498764 617775574 618756866 619287643 620435219
797.6F20435219J912918J312256K631225L863182M249039K907257K406502J883202
$$ 620435219 622348137 623660393 626291618 630154800 634403839 637311096 639717598 641600800
805.3F41600800o76423k017936j690483l85399j055298j346970l0632Q93250P57294
$$ 641600800 640924377 638906441 637215958 636830559 635775261 634428291 634397659 635290909 636048203
814F36048203J193733K641411J699066J544418J032944j339798k210770k253342l082389
$$ 636048203 637241936 639883347 641582413 643126831 644159775 642819977 640609207 638355865 635273476
822.6F35273476k939148j315270k528190k274895M26102L62167q22678m8599P69234
$$ 635273476 632334328 631019058 628490868 626215973 626642075 627004242 626181564 626132965 626902199
831.3F26902199j033821j268769j589965l661843m135780l677940l418847l694229
$$ 626902199 625868378 624599609 623009644 619347801 615212021 611534081 608115234 604421005
839F04421005l115692k203178j185150l91465m04701K63290M54255o47583j411019
$$ 604421005 601305313 599102135 597916985 597525520 597120819 597384109 597838364 597190781 595779762
847.7E95779762r79004j496315l374710l905410l747521l640480k878418k460632j473809
$$ 595779762 594800758 593304443 589929733 586024323 582276802 578636322 575757904 573297272 571823463
856.4E71823463n64765j243134r23004r880L85208R82513K292977K485199K343979
$$ 571823463 571258698 570015564 569092560 569082680 569467888 570450401 572743378 575228577 577572556
865.1E77572556L427162K824211L162842M689369M414520N288773O302452O222915
$$ 577572556 580999718 583823929 586986771 591676140 596090660 601379433 607681885 613904800
872.8F13904800N902100N089798M038963J538773P01828N29175r5482q39691k621613
$$ 613904800 619806900 624896698 628935661 630474434 631176262 631705437 631609955 630770264 628148651
881.5F28148651l716316l362084j079483o71539j195412j424026r90982p06062l170815
$$ 628148651 624432335 621070251 619990768 619319229 618123817 616699791 615708809 615002747 611831932
890.2F11831932l885651l486824l428306l895722m854889m746627l112755j441231
$$ 611831932 607946281 604459457 601031151 597135429 592280540 587533913 584421158 582979927
897.9E82979927j790924j667519j324577j128120j433335k125892j505165k349205
$$ 582979927 581189003 579521484 578196907 577068787 575635452 573509560 572004395 569655190
905.6E69655190l723336l903579m187661n024604n567322n330048m573173l777543
$$ 569655190 565931854 562028275 557840614 552816010 547248688 541918640 537345467 533567924
913.3E33567924l375930l150521k839202k707406l827400m372444l175888k397347
$$ 533567924 530191994 527041473 524202271 521494865 517667465 513295021 510119133 507721786
921E07721786l218688k949639j899528j633950p18345k30065O66275J035157Q71200
$$ 507721786 504503098 501553459 499653931 498019981 497301636 497071571 497737846 498773003 499644203
929.7D99644203P87010Q81310J677170J402282J466866Q97179J96113O09322N78232
$$ 499644203 500431213 501312523 502989693 504391975 505858841 506756020 506952133 507561455 508139687
938.4E08139687O29615O06537J928025L334236K376136J427575J867561J519051q0910
$$ 508139687 508769302 509375839 511303864 514638100 517014236 518441811 520309372 521828423 521747513
947.1E21747513j517868k365303l675156n755768o393089o234322o671753o517562
$$ 521747513 520229645 517864342 514189186 508433418 502040329 495806007 489134254 482616692
954.8D82616692o351929n617180n913773n948524n668182o705285o616363p084732
$$ 482616692 476264763 470647583 464733810 458785286 453117104 446411819 439795456 432710724
962.5D32710724p787590q855324q533058p975998p777596p187156q685417q299714
$$ 432710724 424923134 416067810 407534752 399558754 391781158 384594002 375908585 367608871
970.2C67608871p680587o491700p286071p810326o799469p918053o137790o600914
$$ 367608871 359928284 353436584 346150513 338340187 331540718 323622665 317484875 310883961
977.9C10883961o705647o532116n690746m231396m556637k822113l539657j752529
$$ 310883961 304178314 297646198 291955452 287724056 283167419 280345306 276805649 275053120
985.6B75053120j285496j391296j25599m39225k23274j036548M10327q10642j59130
$$ 275053120 273767624 272376328 272250729 271811504 271588230 270551682 270962009 270151367 269992237
994.3B69992237N75581J36165Q89263l94802J197987K40478J035157J033516J84383
$$ 269992237 270567818 270703983 271593246 271198444 272396431 272636909 273672066 274705582 274889965
1003B74889965J124134N35641K049236N34077K42805r88674q80852L1262j187611L34969
$$ 274889965 276014099 276549740 278598976 279133053 279375858 278387184 277506332 277537594 276349983 276684952
1012.6B76684952p52449J78299L78227Q56857P79762O52123J586342k38018J476459
$$ 276684952 275932503 276110802 276489029 277345886 278125648 278777771 280364113 280126095 281602554
1021.3B81602554N39875J416397J717244J053218J532918k00348J823101P79934K178917
$$ 281602554 282142429 283558826 285276070 286329288 287862206 287661858 289484959 290264893 292443810
1030B92443810K706165J492367J465664P18536K240009k04963P19070J002464K73094
$$ 292443810 295149975 296642342 298108006 298826542 301066551 300861588 301580658 302583122 302856216
1038.7C02856216m1065r00707J42136j568737N17940M25472O06938O62822J12076J263962
$$ 302856216 302815151 301914444 302056580 300487843 301005783 301431255 302038193 302701015 302813091 304077053
1048.3C04077053k84996J754437J050071J253929Q59642J048546K491169J509419M018192
$$ 304077053 303792057 305546494 306596565 307850494 308710136 309758682 312249851 313759270 317777462
1057C17777462L142109L366928K746048L589287M631309L721237N007744L065911M248352
$$ 317777462 320919571 324286499 327032547 330621834 335253143 338974380 343982124 347048035 351296387
1065.7C51296387K741699Q42323K91825j201592j870651m004784l351936n368385m004899
$$ 351296387 354038086 354880409 355172234 353970642 352099991 348095207 344743271 339374886 335369987
1074.4C35369987k318725k092171j136055k284469J88026p70645K83203K86522N22842
$$ 335369987 333051262 330959091 329823036 327538567 327726593 326955948 327239151 327525673 328048515
1083C28048515J147881J79787K916107J547394K519760J684036K297249M152717L022347
$$ 328048515 329196396 329376183 332292290 333839684 336359444 338043480 340340729 344493446 347515793
1091.7C47515793K920723J413574L381691J635246J720429J838875n0393J423264J23901
$$ 347515793 350436516 351850090 355231781 356867027 358587456 360426331 360375938 361799202 361923103
1100.4C61923103J88866o53877O08864P88040O10923J621323J14479J298332R29680
$$ 361923103 362111969 361458092 362066956 362854996 363465919 365087242 365201721 366500053 367429733
1109.1C67429733J436119J035309J794129J993751O93894J755485R56650K888603K078056
$$ 367429733 368865852 369901161 371695290 373689041 374382935 376138420 377095070 379983673 382061729
1117.7C82061729J307526J601601J244316J722450L03688J234703J72615N68695J002655
$$ 382061729 383369255 384970856 386215172 387937622 388241310 389476013 389648628 390217323 391219978
1126.4C91219978P39670J050568K76527K139015J751099K689247K593651K140808K261620
$$ 391219978 391959648 393010216 393286743 395425758 397176857 399866104 402459755 404600563 406862183
1135.1D06862183P57980j75934k571564j505241j356697j932182k720757l485222k377701
$$ 406862183 407620163 407444229 404872665 403367424 402010727 400078545 397357788 393872566 391494865
1143.8C91494865l613243k451553l009720k492561j924935k316436j456643k375335
$$ 391494865 387881622 385430069 382420349 379927788 378002853 375686417 374229774 371854439
1151.5C71854439n37606j449584j386452j226807j058006l11203j047897J181564L31497
$$ 371854439 371316833 369867249 368480797 367253990 366195984 365884781 364836884 366018448 366349945
1160.2C66349945R85985J109886J511955K348442J908837L444328K614937L953667
$$ 366349945 367335930 368445816 369957771 372306213 374215050 377659378 380274315 384227982
1167.9C84227982L734054M182320M625740L824730N176353M976731N988769N722275
$$ 384227982 387962036 392144356 396770096 400594826 405771179 410747910 416736679 422458954
1175.6D22458954N883598N636254O166267O602669N089950N742760M593468M971237
$$ 422458954 428342552 433978806 440145073 446747742 451837692 457580452 462173920 467145157
1183.3D67145157N507088M451789M186936L721504L957939L929825M291878L666839
$$ 467145157 472652245 477104034 481290970 485012474 488970413 492900238 497192116 500858955
1191E00858955K935830K497329J904793K036057J096191K26250K96325P39670N54466
$$ 500858955 503794785 506292114 508196907 510232964 511329155 511555405 511851730 512591400 513145866
1199.7E13145866K5559j63613K41662J492881J754036J912728J617469J499596J803475
$$ 513145866 513171425 513007812 513249474 514742355 516496391 518409119 520026588 521526184 523329659
1208.4E23329659J334686J574325J665726J264229J267776J516877J442642J553230
$$ 523329659 524664345 526238670 527904396 529168625 530436401 531953278 533395920 534949150
1216.1E34949150K196732K462845K228393J691513J374817J646271J328659K31781
$$ 534949150 537145882 539608727 541837120 543528633 544903450 546549721 547878380 548110161
1223.8E48110161m5471l49770j001091j234589q41331p95288j368294r72481l62396
$$ 548110161 548064690 547714920 546713829 545479240 544637909 543842621 542474327 541501846 541139450
1232.5E41139450P401L61213j24206m27933l66058o29349r35440n52101l28179q41713
$$ 541139450 541146851 541508064 541383858 540955925 540589867 539960518 539025078 538472977 538144798 537303085
1242.2E37303085p80296o34689k95410K80494P44705R98307Q36639J528473J737518
$$ 537303085 536522789 535888100 535592690 535873184 536617889 537616196 538452835 539981308 541718826
1250.8E41718826J151734P12928O58684N31769j55144j26381M72718N15213K49557
$$ 541718826 542870560 543583488 544242172 544773941 544618797 544492416 544965134 545480347 545729904
1259.5E45729904M16260N11818N63431Q22334Q55408P57141N04303P98073R39369Q20312
$$ 545729904 546146164 546657982 547221413 548043747 548899155 549656296 550160599 550958672 551898041 552718353
1269.2E52718353Q85773O35719L45230L48397M67567N97229R95255N84716L01514L32565
$$ 552718353 553604126 554239845 554585075 554933472 555401039 555998268 556993523 557578239 557879753 558212318
1278.8E58212318j23062j36070k19574m55856q43239n81017j69296m90112o62079m85649
$$ 558212318 558089256 557953186 557733612 557277756 556434517 555853500 555684204 555194092 554532013 554046364
1288.4E54046364k21977j57738L33671K66152l08113n02510j374207j631164q49381
$$ 554046364 553824387 553666649 554000320 554266472 553958359 553455849 552081642 550450478 549601097
1297.1E49601097o50902j329307j859246j453743r35554q55637p42988p39784o45142
$$ 549601097 548950195 547620888 545761642 544307899 543372345 542516708 541773720 541033936 540388794
1305.8E40388794o66657q71810r12743q70476p63931j081581j280365j232453j514091
$$ 540388794 539722137 538850327 537937584 537067108 536303177 535221596 533941231 532708778 531194687
1314.5E31194687j207352o06918k79923k46276m78592k67907R6817l66706p47300j158142
$$ 531194687 529987335 529380417 529100494 528854218 528375626 528107719 528204536 527837830 527090530 525932388
1324.1E25932388j890831j827774k284546l080406k788620k266197k231712j905098
$$ 525932388 524041557 522213783 519929237 516848831 514060211 511794014 509562302 507657204
1331.8E07657204j443634j447182r06410j070710j146545o76994n64308o85463q21152
$$ 507657204 506213570 504766388 503859978 502789268 501642723 500965729 500401421 499715958 498894806
1340.5D98894806m31023l37867l7423j60827K8343K05879O06804N89638r2888P44362
$$ 498894806 498463783 498125916 498088493 497927666 497956009 498161888 498768692 499358330 499265442 500009804
1350.2E00009804M95415M501j03035n2796m72793j056099m62799o39839l08647m77334
$$ 500009804 500505219 500509720 500406685 500353889 499881096 498824997 498362198 497722359 497413712 496936378
1359.8D96936378n30204j28098k83546J69792l5935J95389n62973J39427K03438o27250
$$ 496936378 496406174 496278076 495994530 496164322 496128387 496323776 495760803 495900230 496103668 495476418
1369.4D95476418L62358l02430P630k25411L34397R32121N48286J013947K16408P58667
$$ 495476418 495838776 495536346 495543976 495318565 495652962 496585083 497133369 498147316 498363724 499122391
1379.1D99122391N54352P99026L83339k16866Q26836O98242J261711J074906J328316
$$ 499122391 499676743 500475769 500859108 500642242 501469078 502167320 503429031 504503937 505832253
1387.8E05832253J755218J816521J718101J151009J011200O73866O3438j338729K75688
$$ 505832253 507587471 509403992 511122093 512273102 513284302 513958168 514021606 512682877 512958565
1396.4E12958565k2888p80144j423149q26531O20766o09093p32879m51813o18439k36015
$$ 512958565 512935677 512155533 510732384 509905853 510526619 509917526 509184647 508732834 508114395 507878380
1406.1E07878380j31378j71814j247635j005364r84153r53217j198730q12798l97491
$$ 507878380 507747002 507575188 506327553 505322189 504338036 503384819 502186089 501373291 500975800
1414.8E00975800j061326l58810q52699j03569j417923K07596J726303K44293Q34503
$$ 500975800 499914474 499555664 498702965 498599396 497181473 497389069 499115372 499359665 500194168
1423.4E00194168n39665L56674O57196m95682M10996K31247M65126j86501Q12302O07414
$$ 500194168 499654503 500011177 500668373 500172691 500583687 500814934 501280060 501093559 501905861 502513275
1433.1E02513275J024895J761741P05262Q64525J74560K288780P09114J47629Q16078
$$ 502513275 503538170 505299911 506005173 506869698 507044258 509333038 510042152 510189781 511005859
1441.8E11005859j50833O04096j62278O74019J65062M07639K823J76735J601982j37596
$$ 511005859 510855026 511459122 511296844 511970863 512135925 512543564 512546387 512723122 514325104 514187508
1451.4E14187508K50663p65113L36723k52762k625694j947785l785972K530823m07410
$$ 514187508 514438171 513673058 514009781 513757019 511131325 509183540 505397568 507928391 507520981
1460.1E07520981J302528M50287J92566J434250n93605L455009K002411K989388K086067
$$ 507520981 508823509 509273796 509466362 510900612 510307007 513762016 515764427 518753815 520839882
1468.8E20839882K879524L842240K120094L843574J093483N742722L580971L857612
$$ 520839882 523719406 527561646 529681740 533525314 534618797 540361519 543942490 547800102
1476.5E47800102L611260L041458M238891L084183M310150K562218L483620K864761
$$ 547800102 551411362 554452820 558691711 561775894 566086044 568648262 572131882 574996643
1484.2E74996643K112427K887802J153831L021698J475068J669731N88798L063622
$$ 574996643 577109070 579996872 581150703 584172401 585647469 587317200 587905998 590969620
1491.9E90969620L554764J624984K777367J882324R04389J206131J479492O13823J712722
$$ 590969620 594524384 596149368 598926735 600809059 601713448 602919579 604399071 605012894 606725616
1500.6F06725616J991425L20511J675949J157494K119827l572312m540176O622772
$$ 606725616 608717041 609037552 610713501 611870995 613990822 610418510 605878334 612501106
1508.3F12501106K269402L388481J330528J482964j66588R22394J079063l54233J098290
$$ 612501106 614770508 618158989 619489517 620972481 620805893 621728287 622807350 622453117 623551407
1517F23551407k167854K950019J874161n18608K44522L39089L821296J947060P09572
$$ 623551407 621383553 624333572 626207733 625689125 625933647 626272736 630094032 632041092 632750664
1525.7F32750664n20401J351318P05948M0398J086959m80537P58858q50754o15387
$$ 632750664 632230263 633581581 634287529 634327927 635414886 634934349 635693207 634842453 634227066
1534.3F34227066K278328J574020J754189P45315k752037m753570P166252J693268
$$ 634227066 636505394 638079414 639833603 640578918 637826881 633073311 640239563 641932831
1542.1F41932831j586151J653366k53754j256332M30603J350479R79614j61438q93020
$$ 641932831 640346680 642000046 641746292 640489960 640920563 642271042 643250656 643089218 642196198
1550.7F42196198J186141K199479Q69445k071151o54602K942047K402115p384491o293335
$$ 642196198 643382339 645581818 646451263 644380112 643725510 646667557 649069672 641685181 635391846
1559.4F35391846J832924M266853J022873Q9874j30691o08597N87082P56225J067276
$$ 635391846 637224770 641491623 642514496 642604370 642473679 641865082 642452164 643208389 644275665
1568.1F44275665m00314m464417Q05207R75189r45358j039086J15471j334534n214347
$$ 644275665 643875351 639410934 640216141 641191330 640245972 639206886 639322357 637987823 632773476
1576.8F32773476J439476J087761k68670o47621m71534Q9759k25753m15688q37173
$$ 632773476 634212952 635300713 635032043 634384422 633912888 634002647 633776894 633361206 632524033
1585.5F32524033j207428r08165j277619j429710j636849j444053j637459q17108l51448
$$ 632524033 631316605 630408440 629130821 627701111 626064262 624620209 622982750 622165642 621814194
1594.1F21814194j196480r60045o62918n98259j187248q60634j243363j474227j329079
$$ 621814194 620617714 619657669 618994751 618396492 617209244 616348610 615105247 613631020 612301941
1602.8F12301941k472839k076836j906776j353570k036094j281929j379738k256241
$$ 612301941 609829102 607752266 605845490 604491920 602455826 601173897 599794159 597537918
1610.5E97537918q45642j848831j583748k134209m02336l85933p819595j44882j133919
$$ 597537918 596692276 594843445 593259697 591125488 590723152 590337219 582517624 582372742 581238823
1619.2E81238823j373253k042313r32807j712800l829879O26831m71077l33824k827225
$$ 581238823 579865570 577823257 576890450 575177650 571347771 571974602 571503525 571169701 568342476
1627.9E68342476j836891k09656q62122p96699j672630n6572j60981l008842q68759
$$ 568342476 566505585 566295929 565433807 564637108 562964478 562907906 562746925 559738083 558869324
1636.6E58869324J022491R1896N40467Q13064m48913Q94012l20091Q32748J256638
$$ 558869324 559891815 559983711 560524178 561337242 560888329 561782341 561462250 562294998 563551636
1645.3E63551636j829224K12021p1678J868439J547279K681808K309647k782745n83191
$$ 563551636 561722412 561934433 561862755 563731194 565278473 567960281 570269928 567487183 566903992
1653.9E66903992K660026K966614J606789J404686O14547R69010J211395J500397J187973
$$ 566903992 569564018 572530632 574137421 575542107 576156654 577125664 578337059 579837456 581025429
1662.6E81025429J7853K576141J727562J497726J838684K134667J068992J525841L325119
$$ 581025429 581043282 583619423 585346985 586844711 588683395 590818062 591887054 593412895 596738014
1671.3E96738014P48291K162476K920685J400833O64100K598534K712593J837883J903267
$$ 596738014 597486305 599648781 602569466 603970299 604634399 607232933 609945526 611783409 613686676
1680F13686676J889534L962364M119530R14421L84254L480301L972474L148765K252731
$$ 613686676 615576210 619538574 623658104 624572525 624956779 628437080 632409554 635558319 637811050
1688.6F37811050K367478J699371J891632K161789J719895K693634K674026p33261
$$ 637811050 640178528 641877899 643769531 645931320 647651215 650344849 653018875 652285614
1696.4F52285614L152237L363419L666534q25958j430741N160828L442764J871872
$$ 652285614 655437851 658801270 662467804 661641846 660211105 665371933 668814697 670686569
1704.1F70686569J28937J193542L70331J124497J787796P83615O83136J545029J671295
$$ 670686569 670815506 672009048 672379379 673503876 675291672 676075287 676758423 678303452 679974747
1712.8F79974747J309128N99136m3030K799301K933960l673324K39334J226501Q26798
$$ 679974747 681283875 681883011 681839981 684639282 687573242 683899918 684139252 685365753 686192551
1721.4F86192551L60260L92608J15509O56433J072617R56726J167221Q49152o1035
$$ 686192551 686552811 686945419 687060928 687717361 688789978 689746704 690913925 691763077 691702042
1730.1F91702042j96762K124404K270203k158966l508987K579345K643891O88553J705322
$$ 691702042 691505280 693629684 695899887 693740921 690231934 692811279 695455170 696143723 697849045
1738.8F97849045J85470j661377K302781J135101j66092J58005J858978J539688N40695
$$ 697849045 698034515 696373138 698675919 699811020 699644928 699802933 701661911 703201599 703742294
1747.5G03742294O92444l2883K860260M14277o03562K627869J680450J467514J486664
$$ 703742294 704434738 704401855 707262115 707676392 707072830 709700699 711381149 712848663 714335327
1756.2G14335327J2512Q14591J627579J024780J661682q50067n07050K121659R09195
$$ 714335327 714347839 715162430 716790009 717814789 719476471 718626404 718119354 720241013 721150208
1764.8G21150208P41500R97696J448288p77664R92432K602920j96838p55081j282425
$$ 721150208 721891708 722889404 724337692 723560028 724552460 727155380 726958542 726203461 724921036
1773.5G24921036K482223J760483q28018Q94470Q240N55725L28674k31170O12411Q76312
$$ 724921036 727403259 729163742 728335724 729230194 729238434 729794159 730122833 729891663 730504074 731380386
1783.2G31380386J529084M57458K9068N63126M74853n1040N20935P2937n8976o42776
$$ 731380386 732909470 733366928 733395996 733959122 734433975 734382935 734903870 734976807 734917831 734275055
1792.8G34275055j012726J750260M74243j29547J061248J409989R02099o99920R91516
$$ 734275055 733262329 735012589 735486832 735357285 736418533 737828522 738730621 738030701 739022217
1801.5G39022217N0812J96380O39496k26746R1782r3231n417K56729N27878q57697
$$ 739022217 739073029 739269409 739908905 739682159 739773941 739680710 739675293 739932022 740459900 739602203
1811.1G39602203M51355J310044M13971J025467N87081P78275j63116k84043J86844
$$ 739602203 740053558 741363602 741777573 742803040 743390121 744168396 744005280 743721237 743908081
1819.8G43908081l16696J07345o50634P74765J024933j601639k45514J232529J271133
$$ 743908081 743591385 743698730 743048096 743822861 744847794 743246155 743000641 744233170 745504303
1828.5G45504303K58331j130905M91333J306687m6921Q7585L10593P3395l27683j185837
$$ 745504303 745762634 744631729 745123062 746429749 746382828 746470413 746781006 746854401 746526718 745340881
1838.1G45340881N28336N73883L07083j37405P62710J170502l233414J382828J770783
$$ 745340881 745869217 746443100 746750183 746612778 747375488 748545990 745312576 746695404 748466187
1846.8G48466187j7319m28238M5700L62091m90799K0447j00250K32849J73492j43051
$$ 748466187 748448868 748020630 748066330 748428421 747937622 747958069 747857819 748090668 748264160 748121109
1856.4G48121109K56500Q1177L17993K92435P22275l43933m73023j49994k10419L62549
$$ 748121109 748377609 748458786 748776779 749069214 749791489 749447556 748974533 748824539 748614120 748976669
1866.1G48976669p76367K10037j03912l57132R23767O02799P50045J93558P8507M7454
$$ 748976669 748200302 748410339 748306427 747949295 748873062 749475861 750225906 750419464 750497971 750545425
1875.7G50545425N1651o45217m64097K43836J3199K60925k65655O27288N48478J48086
$$ 750545425 750597076 749951859 749487762 749731598 749744797 750005722 749740067 750367355 750915833 751063919
1885.4G51063919M85230N1345J080323J19094j610107j09177P57904L38974J32370
$$ 751063919 751549149 751600494 752680817 752799911 751189804 751080627 751838531 752177505 752309875
1894.1G52309875l18222q47320N50537M33807M36325K78626J44501O34308k7466r079
$$ 752309875 751991653 751144333 751694870 752128677 752565002 752843628 752988129 753622437 753594971 753585892
1903.7G53585892k70310k02713k49252k64664j84250j09787o713o80161K10724M6158
$$ 753585892 753315582 753112869 752863617 752598953 752414703 752304916 752298203 751618042 751828766 751874924
1913.3G51874924M05578P89261O70700J334458q69446n88074J70059k81982K31781
$$ 751874924 752280502 753069763 753740463 755074921 754205475 753617401 753787460 753505478 753737259
1922G53737259n57938o29883m3640J26877k96478J98364P09534N01709M31824K92129
$$ 753737259 753179321 752549438 752505798 752632675 752336197 752534561 753244095 753745804 754177628 754469757
1931.7G54469757M78745o9352j21154m21448o49338l63693p935o8893o75125O51245
$$ 754469757 754948502 754879150 754757996 754336548 753687210 753323517 753315582 753246689 752571564 753222809
1941.3G53222809J33819j047592O56433R92279N59159K42309L62320j20849j62506
$$ 753222809 753356628 752309036 752965469 753957748 754516907 754759216 755121536 755000687 754838181
1950G54838181m57917m93393q6822k51389K8076k16598J77231L32260L09601M38385
$$ 754838181 754380264 753886871 753800049 753548660 753576736 753360138 753537369 753869629 754179230 754617615
1959.6G54617615K96631M59365R9183L81927J7700j1062J63192p73620o55594l4332
$$ 754617615 754914246 755373611 755472794 755854721 755872421 755861359 756024551 755250931 754595337 754561005
1969.3G54561005J22757l44315J64795L93066J83030K87857J50528M63638J93939R6893
$$ 754561005 754683762 754339447 754504242 754897308 755080338 755368195 755518723 755982361 756176300 756273193
1978.9G56273193l62243m31290l77655k98462K33688k12020K49176K11486L17307J03531
$$ 756273193 755910950 755479660 755102005 754803543 755037231 754825211 755074387 755285873 755603180 755706711
1988.6G55706711m10614O33011N8822m55703p5226K59170K11945l81241m17480l40653
$$ 755706711 755296097 755929108 755987930 755532227 755457001 755716171 755928116 755546875 755129395 754788742
1998.2G54788742n5695L1281L84827O4621J9912L07923p1411J13906r4223r1476l10135
$$ 754788742 754733047 754764328 755149155 755213776 755233688 755541611 755470200 755584106 755489883 755398407 755088272
2008.8G55088272m24576k73895k04086j4115k62069l3417M196R7580o4850J90354K20794
$$ 755088272 754663696 754389801 754185715 754171600 753909531 753876114 753880310 753977890 753913040 754103394 754324188
2019.4G54324188n46493k10495l21884m69742k63138J27792k46505m44794J27258j70135
$$ 754324188 753777695 753567200 753245316 752775574 752512436 752640228 752393723 751948929 752076187 751906052
2029.1G51906052r079k41166K58637K84042j79290J86843k95333k71836o78863m06952
$$ 751906052 751896973 751655807 751914444 752198486 752019196 752206039 751910706 751638870 750960007 750553055
2038.7G50553055m31977m46701j4572l32107N93109m5166j83945L12805J3810O4544
$$ 750553055 750121078 749674377 749659805 749327698 749920807 749875641 749691696 750004501 750018311 750082855
2048.4G50082855j61667K24152j96610k04086m00467k95791J9302n14450J9989K1133
$$ 750082855 749921188 750145340 749948730 749744644 749344177 749048386 749067688 748553238 748573227 748594360
2058G48594360K05384J80816N31006M48532n1880N82734k02637l20664j22375m3793
$$ 748594360 748799744 748980560 749511566 749960098 749908218 750490952 750288315 749967651 749845276 749801483
2067.6G49801483j34582m55780l57514n52673L57590K14538J83716M21524J65787M57382
$$ 749801483 749666901 749211121 748853607 748300934 748658524 748873062 749056778 749478302 749644089 750101471
2077.3G50101471J94473J82419r1248j831m02908m64172j67008j97143L68652m46091
$$ 750101471 750295944 750478363 750387115 750385284 749982376 749518204 749351196 749154053 749522705 749076614
2086.9G49076614j20620N50995L93142K03018l204M19922Q7357J85089j16959k52304
$$ 749076614 748955994 749506989 749900131 750103149 750099945 750519867 750607224 750792313 750675354 750423050
2096.6G50423050k54059l88412J49841k28958L2806M74930O11725J83029n0735K98385
$$ 750423050 750168991 749780579 749930420 749701462 749734268 750209198 750820923 751003952 750953217 751251602
2106.2G51251602j10092j27640J9150O00281J89743m36096j90735k93045k56119j51520
$$ 751251602 751141510 751013870 751033020 751633301 751823044 751386948 751196213 750903168 750647049 750495529
2115.9G50495529M87671L11966O7596j64337j55639N03158J79367J21155n72205o03637
$$ 750495529 750983200 751295166 751362762 751198425 751042786 751545944 751725311 751846466 751274261 750670624
2125.5G50670624J1291J03379M16107R4375j1520j77917K30560L43933L509K33536
$$ 750670624 750681915 750785294 751201401 751295776 751284256 751106339 751336899 751680832 751684341 751917877
2135.1G51917877L1281k0523j61744k76565m23966k66037k0294R7275K58713J81656
$$ 751917877 751949158 751928635 751766891 751490326 751066360 750800323 750780029 750877304 751136017 751317673
2144.8G51317673J86004k42309j49002Q5144L13034R15l63617M01307K91748l6087
$$ 751317673 751503677 751261368 751112366 751197510 751510544 751511459 751147842 751549149 751840897 751804810
2154.4G51804810k70081J25198R92n14984n1880l3340N44586M42886K79694J85318
$$ 751804810 751534729 751659927 751660919 751145935 751094055 751060715 751605301 752048187 752327881 752513199
2164.1G52513199L3111L33786l8375L29055J33591J67770j03073n17807K33689L49121
$$ 752513199 752546310 752880096 752841721 753170776 753304367 753472137 753369064 752851257 753084946 753434067
2173.7G53434067N50003J39694L23334K78702j56403L11127K61917J79748k97775r9640
$$ 753434067 753984070 754123764 754447098 754725800 754569397 754880524 755142441 755322189 755024414 754924774
2183.4G54924774M2572K32697M15420K0905K05993O7521N51986L03650j12228J49002
$$ 754924774 754967346 755200043 755615463 755636368 755842361 755909882 756461868 756765518 756653290 756802292
2193G56802292K26593L59573q8882j0071k00958M5852J54190j35192J38168r5978J04370
$$ 756802292 757028885 757388458 757299576 757289505 757088547 757134399 757288589 757153397 757291565 757195587 757299957
2203.6G57299957J48087L10592K76566L15781K95639L0441M54788P5684K33459K0523
$$ 757299957 757448044 757758636 758035202 758350983 758646622 758677063 759131851 759207535 759440994 759461517
2213.3G59461517n19943m2877L88031L30887j55182L18298M33502K70768J92489P0801
$$ 759461517 758941574 758898697 759286728 759617615 759462433 759780731 760214233 760485001 760677490 760748291
2222.9G60748291j57166l87573L57056K19955o2408k14386l0136K30713N4779J66626
$$ 760748291 760591125 760203552 760560608 760780563 760718155 760503769 760473633 760704346 760759125 760925751
2232.5G60925751j33057J35651l6011J74408K23465j09711M08554M6158r689j73645
$$ 760925751 760792694 760928345 760892334 761066742 761290207 761180496 761589050 761635208 761625519 761451874
2242.2G61451874Q2855j10626l11585M32511O0653J52207j05820o8207K0142k27661
$$ 761451874 761534729 761424103 761112518 761545029 761605682 761757889 761652069 761583862 761604004 761376343
2251.8G61376343j49155l1662N74646P6J16272O1036k04850M8218j68610K70920o0730
$$ 761376343 761227188 761195526 761770172 761770248 761886520 761947556 761742706 761790924 761622314 761893234 761832504
2262.4G61832504K7466O6452j61362m6081L5858j57928m23050N77316K32162P4616
$$ 761832504 761859970 761926422 761765060 761718979 761754837 761596909 761173859 761751175 761983337 762057953
2272.1G62057953K12555J95770N75028j24436P4387j82724j59989m6463k30026K86408
$$ 762057953 762270508 762466278 763041306 762916870 762991257 762808533 762648544 762602081 762372055 762658463
2281.7G62658463K62451q4915p33948j95236R6817K60543J16349R842N00183k88315
$$ 762658463 762920914 762835999 762102051 761906815 762003632 762264175 762380524 762390366 762890549 762602234
2291.4G62602234J34430k47193p16629m43191j93710M6997q82340m32129p23495o7520
$$ 762602234 762736664 762489471 761772842 761329651 761135941 761182938 760300598 759868469 759144974 759077454
2301G59077454J39618l9673Q21762n56488k11258m86222o04782m62799r82589n13993
$$ 759077454 759217072 759177399 759999161 759442673 759231415 758745193 758140411 757677612 756695023 756181030
2310.7G56181030j202469j73645n06820l24402k57492r92432r003l24401P4234j354447
$$ 756181030 754978561 754804916 754298096 753973694 753716202 752723770 752714767 752390366 752464600 751110153
2320.3G51110153j436767P1182L44238q69980j791382M16871l08915l36303j463623
$$ 751110153 749673386 749744568 750088806 749218826 747427444 747844315 747535400 747199097 745735474
2329G45735474j450272J30081p74154L07388m75845J299209R74808q59299p31659j946029
$$ 745735474 744285202 744415283 743641129 743948517 743472672 744771881 745746689 744887390 744155731 742209702
2338.6G42209702j517334j170578R47494R13620O51321l33557l42559K765274K352523
$$ 742209702 740692368 739521790 740469284 741382904 742034225 741700668 741358109 744123383 746475906
2347.3G46475906K130051N59006j037140j568680k262421k537384l049621k087708
$$ 746475906 748605957 749164963 748127823 746559143 744296722 741759338 738709717 736622009
2355G36622009j496200j126709j661988o90841p401p63397K028351J524658R19190
$$ 736622009 735125809 733999100 732337112 731646271 731638870 730875473 732903824 734428482 735347672
2363.7G35347672P20520J59225p2784O86874J530991Q92334K108612Q71505J57776
$$ 735347672 736068192 736227417 736154633 736841507 738372498 739264832 741373444 742244949 742402725
2372.4G42402725J595535K076111J515122J534576J849289M39301O70089J470261J299973
$$ 742402725 743998260 746074371 747589493 749124069 750973358 751412659 752082748 753553009 754852982
2381.1G54852982M39605J1444M44641J38703M79507O37207K66343k15378j68076K78092
$$ 754852982 755292587 755304031 755748672 755887375 756366882 757004089 757270432 757055054 756886978 757165070
2390.7G57165070J60064M13208M9439j4954k35367q53500n71365j16806J9455l19596
$$ 757165070 757325134 757738342 757787781 757772827 757537460 756683960 756112595 755995789 756015244 755695648
2400.3G55695648j18713l34091j80893K90146P9727O714j3810N54276k6245n36804
$$ 755695648 755576935 755242844 755061951 755352097 755431824 755438538 755424728 755979004 755952759 755415955
2410G55415955m50440p02438m21753l76587l08685o26984l73917R2240K18506J75476
$$ 755415955 754965515 754263077 753841324 753464737 753156052 752529068 752155151 752247391 752465897 752641373
2419.6G52641373J5030M51126j68534k07748l1357o60858o62766m57687k40021l83682
$$ 752641373 752656403 753107529 752938995 752731247 752699890 752039032 751376266 750918579 750678558 750294876
2429.3G50294876m13360p50275l59192N05829K40555J8310K66113L41416n03693p50885
$$ 750294876 749881516 749131241 748772049 749277878 749518433 749536743 749802856 750144272 749640579 748889694
2438.9G48889694n45425l68042m78134r31702m66385m75540j73187K77786Q4915o7444
$$ 748889694 748344269 747976227 747498093 746566391 746100006 745624466 745451279 745729065 745813980 745746536
2448.6G45746536j50451L0136N7525j24893p13425k19345k01645p74536j49688k40479
$$ 745746536 745596085 745626221 745683746 745558853 744845428 744626083 744424438 743649902 743500214 743259735
2458.2G43259735m74777m53034Q3237j907k53296J95312j00937p8887j34201J0528
$$ 743259735 742784958 742331924 742415161 742413254 742159958 742355270 742254333 742175446 742041245 742051773
2467.8G42051773k33078l32870n68924j523362n50918m9362j44959Q1558J63117L19214
$$ 742051773 741818695 741485825 740916901 739393539 738842621 738793259 738648300 738729858 738892975 739212189
2477.5G39212189q6670j49079l6850J34736n07355r27582l51181m8065l6545m30222
$$ 739212189 739125519 738976440 738939590 739074326 738566971 737639389 737288208 737240143 737203598 736773376
2487.1G36773376m26025r1553J67771j64032L8376K36892k78854k747k45971l33481
$$ 736773376 736347351 736255798 736423569 736259537 736297913 736534805 736255951 736253204 736007233 735673752
2496.8G35673752m52805l93600j20316m37088j25732q3161J7090k02713o4697J64261
$$ 735673752 735220947 734827347 734707031 734269943 734144211 734061050 734078140 733875427 733810730 733974991
2506.4G33974991j58539J57242j80741j19400J68915m9667o82983q19550l42560m08401
$$ 733974991 733816452 733973694 733792953 733673553 733842468 733792801 733109818 732290268 731947708 731539307
2516.1G31539307L1356j12381J39390K35290j69449L49045J55640j11542l53088k21329
$$ 731539307 731570663 731458282 731597672 731832962 731663513 732012558 732168198 732056656 731703568 731482239
2525.7G31482239o71082j019897k78244m38843k19727N1575j44577m04739L5171L46146
$$ 731482239 730811157 729791260 729513016 729074173 728854446 728906021 728761444 728356705 728391876 728738022
2535.4G28738022k72980Q4839K2125l79333m30680l96270l20816n37110o06613p30667
$$ 728738022 728465042 728549881 728572006 728192673 727761993 727365723 727044907 726507797 725901184 725170517
2545G25170517n12848k07672J68304q3999m76074J03302M15954J80512l02124k82441
$$ 725170517 724657669 724449997 724618301 724534302 724058228 724161530 724577484 724757996 724455872 724173431
2554.6G24173431n02929n74799l94058q69980o76269l66135j21918N0354Q3313J64185
$$ 724173431 723670502 723095703 722701645 721831665 721155396 720789261 720667343 720717697 720801010 720965195
2564.3G20965195L7613q4153k82669j98288k83508l80402l86810m13666o25610p09763
$$ 720965195 721002808 720918655 720635986 720437698 720154190 719773788 719386978 718973312 718347702 717637939
2573.9G17637939k55355l36838j39694J37787J45645J0223m10843l98865k96554n1041
$$ 717637939 717382584 717045746 716906052 717043839 717189484 717199707 716788864 716389999 716093445 716042404
2583.6G16042404p5836j43967m40063n55802q3847j55944k02179l25013l50952l94897
$$ 716042404 715966568 715822601 715382538 714826736 714742889 714586945 714384766 714059753 713708801 713313904
2593.2G13313904n8823J99204j76773p8431l49884k15759k88467n31082m06189n25589
$$ 713313904 713255081 713454285 713277512 713199081 712849197 712633438 712344971 711813889 711407700 710882111
2602.9G10882111r1858j00251J89743q773m07410J53275L6850k07825m91181l58734
$$ 710882111 710790253 710690002 710879745 710870972 710463562 710616837 710653687 710445862 709954681 709595947
2612.5G09595947k93350m70505n45196m33884R995o29654p62863l48664j61819J03378
$$ 709595947 709302597 708832092 708286896 707853012 707863007 707233353 706470490 706121826 705960007 706063385
2622.1G06063385j35269k65503m15268l27225n62668o65588j31149p00455j258163
$$ 706063385 705928116 705662613 705247345 704920120 704357452 703691864 703560715 702860260 701602097
2630.8G01602097n67322j26953m15192l37143k13242n65948m68445K85034J72882o16531
$$ 701602097 701034775 700907822 700492630 700155487 699942245 699376297 698907852 699192886 699365768 698749237
2640.5F98749237o20575o86111q80661o37284n71441q03376o64138n15137l35236J39695
$$ 698749237 698128662 697442551 696561890 695924606 695353165 694549789 693885651 693370514 693035278 693174973
2650.1F93174973r5215k20185l01513l60565k20337n78843p68356r08203o94122n95932
$$ 693174973 693079758 692859573 692558060 692197495 691977158 691398315 690629959 689721756 689027634 688431702
2659.8F88431702n09339n13382m41208Q8349l63846j32980Q8424j5182q4763r23233
$$ 688431702 687922363 687408981 686967773 687056122 686692276 686559296 686647720 686632538 686547775 685624542
2669.4F85624542o04324l11737j57776o01349j332092n33295k5558j22605n11780l58505
$$ 685624542 685020218 684708481 684550705 683949356 682617264 682083969 682058411 681935806 681424026 681065521
2679F81065521r4299l22189o1112J57623k19955o28052l60565m66156o56280p96052
$$ 681065521 680971222 680649033 680587921 680745544 680525589 679897537 679536972 679070816 678414536 677618484
2688.7F77618484p64770n58548r82971l41797M32205L13111k48490m72870l6392l71933
$$ 677618484 676853714 676295166 675312195 674970398 675402603 675715714 675467224 674994354 674957962 674586029
2698.3F74586029o46973p22885o02417m46930m79431l95584o76727k82059J4572m94842
$$ 674586029 673939056 673216171 672613754 672166824 671687393 671291809 670615082 670333023 670347595 669852753
2708F69852753n09262k14692m82711n57709k4185k4567l25546o18057q48542p61413
$$ 669852753 669343491 669128799 668646088 668088379 668064194 668039627 667714081 667096024 666247482 665486069
2717.6F65486069n63202n76325l82080m9667j01090K8916j51520l80325n76248o86188
$$ 665486069 664922867 664346542 663964462 663914795 663813705 663842621 663691101 663310776 662734528 662048340
2727.3F62048340m60587n88073n53818n56717j23901j42212n44968N493o5765k89688
$$ 662048340 661587753 660999680 660445862 659889145 659765244 659623032 659078064 659083557 659017792 658728104
2736.9F58728104l25013r5748j14899o69480j87149Q3542m53949m77676j13449l73688
$$ 658728104 658403091 658307343 658192444 657522964 657335815 657419357 656965408 656487732 656374283 656000595
2746.5F56000595m23584j83563l70712m05045n28564l45231o4315J68991J84021k77634
$$ 656000595 655577011 655393448 655022736 654617691 654089127 653743896 653679581 653848572 654032593 653754959
2756.2F53754959o17523o37512j66931l23716n84640k03171P935j26191n4626N4398
$$ 653754959 653137436 652499924 652332993 652009277 651424637 651221466 651229401 651103210 651048584 651102982
2765.8F51102982m60587k33536k4872k16980j59378k77710k70309n44586k30179k48947
$$ 651102982 650642395 650408859 650383987 650167007 650007629 649729919 649459610 648915024 648684845 648435898
2775.5F48435898q69522n17655j91955l00217l30582k30789j85013k21862n69992m81339
$$ 648435898 647566376 647048721 646856766 646556549 646225967 645995178 645810165 645588303 645018311 644536972
2785.1F44536972m26865m55398j55029p99027p15485l23638k41547k47345p63702o20232
$$ 644536972 644110107 643654709 643499680 642700653 641985168 641661530 641419983 641172638 640408936 639788704
2794.8F39788704n11170m00810n50651l92990m95339j120758p09419o64597n06782
$$ 639788704 639277534 638876724 638326073 637933083 637437744 636316986 635607567 634942970 634436188
2803.4F34436188p40471r22661p74765j009064l33824l44314p43218r80873q52394
$$ 634436188 633695717 632773056 631998291 630989227 630655403 630311089 629567871 628586998 627734604
2812.1F27734604k58026l30467j024170j432801n19485l93257r35250j182327j392021
$$ 627734604 627476578 627146111 626121941 624689140 624169655 623776398 622841148 621658821 620266800
2820.8F20266800j103211o75773m24194j182290j373024j103859q47778m01306r02672
$$ 620266800 619163589 618487816 618063622 616881332 615508308 614404449 613556671 613155365 612252693
2829.5F12252693j030464r30252r20219r75914j191979j457634j286354o07262r01413
$$ 612252693 611222229 610291977 609371758 608395844 607203865 605746231 604459877 603852615 602951202
2838.2F02951202j334838j555481j554871j657715j453361j037102j812935k082367
$$ 602951202 601616364 600060883 598506012 596848297 595394936 594357834 592544899 590462532
2845.9E90462532j725845j192246j546936k072487j570549j483841j240997j761322
$$ 590462532 588736687 587544441 585997505 583925018 582354469 580870628 579629631 577868309
2853.6E77868309j715660p90711q22181j080780q57010L0327o30608j439857j092492
$$ 577868309 576152649 575361938 574539757 573458977 572601967 572632294 572001686 570561829 569469337
2862.3E69469337j207656j394616j436729j166039j243629k023697k489166j860314
$$ 569469337 568261681 566867065 565430336 564264297 563020668 560996971 558507805 556647491
2870E56647491j772651j845322j302643k088699k421112k063828k188224k172966j906243
$$ 556647491 554874840 553029518 551726875 549638176 547217064 545153236 542965012 540792046 538885803
2878.7E38885803j725921j768876j397933j402092j221467r44557j352730j343345
$$ 538885803 537159882 535391006 533993073 532590981 531369514 530424957 529072227 527728882
2886.4E27728882q28171m49638o69327o58379p70187m34189K94151L8224k0562n88302
$$ 527728882 526900711 526451073 525781746 525123367 524353180 523918991 524213142 524251366 524230804 523642502
2896E23642502o28700J48658k72216n89486l79715l19366l17726k23885m00505p41386
$$ 523642502 523013802 523162460 522890244 522300758 521921043 521601677 521283951 521060066 520659561 519918175
2905.7E19918175j031304j158142q60176o13441n78919p50236j004525j369056j376152
$$ 519918175 518886871 517728729 516868553 516255112 515676193 514925957 513921432 512552376 511176224
2914.3E11176224j333428j667823j767998j797981j958580j922837j036491j088448
$$ 511176224 509842796 508174973 506406975 504608994 502650414 500727577 499691086 498602638
2922.1D98602638j717720j279564j227913j124382q11729q6556K78664m0131K21138
$$ 498602638 496884918 495605354 494377441 493253059 492441330 492354774 492633438 492593307 492814445
2930.7D92814445L41797L55225K45857P97806J385651J328239J385040J431694J933632
$$ 492814445 493156242 493511467 493757324 494555130 495940781 497269020 498654060 500085754 502019386
2939.4E02019386K032395K141990K184067K285729K550010J750412J963692K582512
$$ 502019386 504051781 506193771 508377838 510663567 513213577 514963989 516927681 519510193
2947.1E19510193J896782J693535K434768K251396K121659K532997J935959J771164
$$ 519510193 521406975 523100510 525535278 527786674 529908333 532441330 534377289 536148453
2954.8E36148453J950721K175675K085800K251663K566643K147789K281418J599541
$$ 536148453 538099174 540274849 542360649 544612312 547178955 549326744 551608162 553207703
2962.6E53207703J595878J759606J296844J707420J713067K033577J877555J716271
$$ 553207703 554803581 556563187 557860031 559567451 561280518 563314095 565191650 566907921
2970.3E66907921J486435J659851K311134J237183J096458J524468J491775J200371
$$ 566907921 568394356 570054207 572365341 573602524 574698982 576223450 577715225 578915596
2978E78915596J008034J300544R85070J460457J660041J082001R42726J104164J100197
$$ 578915596 579923630 581224174 582209244 583669701 585329742 586411743 587354469 588458633 589558830
2986.7E89558830Q60710Q02308O41937O71806M19731L64456M02756M89502Q53691M89235
$$ 589558830 590419540 591221848 591863785 592535591 592955322 593319778 593722534 594212036 595065727 595554962
2996.3E95554962L89214M54178K61230m9248K22283K80037p8240K35863m57192m92630
$$ 595554962 595944176 596398354 596659584 596610336 596832619 597112656 597034416 597270279 596813087 596320457
3006E96320457J09101k16484l24288m58603l37143j678j68686n25780o0539k77672
$$ 596320457 596429558 596213074 595888786 595430183 595093040 595091362 594922676 594396896 594336357 594058685
3015.6E94058685r10377n06172n71938o48231r69658j381684j005592m41971k81029
$$ 594058685 593148308 592642136 592070198 591421967 590452309 589070625 588065033 587623062 587342033
3024.3E87342033p46383q51822m33655n67551j075821n65567l46031p45849p70150
$$ 587342033 586595650 585743828 585310173 584742622 583666801 583101234 582755203 582009354 581239204
3033E81239204r89494j022644j227341j166877j084099p53327n61981j091881j023330
$$ 581239204 580249710 579227066 577999725 576832848 575748749 574995422 574433441 573341560 572318230
3041.6E72318230j139794n37529o68945j666069j147766q19740r53255j285172r75036
$$ 572318230 571178436 570640907 569971962 568305893 567158127 566338387 565385132 564099960 563124924
3050.3E63124924q90923j323433q84132q64639j072693r29146r44100j197853j167907
$$ 563124924 562234001 560910568 560026436 559161797 558089104 557159958 556215858 555018005 553850098
3059E53850098j185150r02367r48105j246109n50079j133957j246720p25326j367073
$$ 553850098 552664948 551762581 550814476 549568367 549018288 547884331 546637611 545912285 544545212
3067.7E44545212j410179r11866n74073j377869j257973o74438j031494r37844r05914
$$ 544545212 543135033 542223167 541649094 540271225 539013252 538338814 537307320 536369476 535463562
3076.4E35463562p73773j173973j241913q81958p84493r68742j371498r19151r91784
$$ 535463562 534689789 533515816 532273903 531391945 530607452 529638710 528267212 527348061 526356277
3085E26356277j026268j143798j573220j328582j004754j075096j503830p76863o64634
$$ 526356277 525330009 524186211 522612991 521284409 520279655 519204559 517700729 516923866 516259232
3093.7E16259232r84040q57467j279908p43827n61104q75168j260529j529426j318321
$$ 516259232 515275192 514417725 513137817 512393990 511832886 510957718 509697189 508167763 506849442
3102.4E06849442j067391o05469q85200j161728j080513p80525q70476j436234j289634
$$ 506849442 505782051 505176582 504291382 503129654 502049141 501268616 500398140 498961906 497672272
3111.1D97672272j165428r00689n72395r08699j363640p66754o78329j529923j142311
$$ 497672272 496506844 495606155 495033760 494125061 492761421 491994667 491316338 489786415 488644104
3119.8D88644104q93593j103248j118813j042404q48198p67593q59337r36432n13077
$$ 488644104 487750511 486647263 485528450 484486046 483637848 482870255 482010918 481074486 480561409
3128.4D80561409j039543j639748j195068p36160j071206j574516p60460p04651j126442
$$ 480561409 479521866 477882118 476687050 475950890 474879684 473305168 472544708 471840057 470713615
3137.1D70713615j035118p83500l89710j002197j265831r53178p99904j000290j066551
$$ 470713615 469678497 468894997 468505287 467503090 466237259 465284081 464484177 463483887 462417336
3145.8D62417336p42531r65233p89948o55899p29637o59523j218529j621437j026725
$$ 462417336 461674805 460709572 459919624 459263725 458534088 457874565 456656036 455034599 454007874
3154.5D54007874l67508o37017j005783r32007p44934r67483j227188j162072p13005
$$ 454007874 453640366 453003349 451997566 451065559 450320625 449353142 448125954 446963882 446250877
3163.1D46250877n70869j186142q21686o10428p93914p51877p57294l68919r59893
$$ 446250877 445680008 444493866 443672180 443061752 442267838 441515961 440758667 440389748 439429855
3171.8D39429855j234817r70078j049385q83636l95012l00369j145211o94999n93758
$$ 439429855 438195038 437224960 436175575 435291939 434896927 434596558 433451347 432756348 432162590
3180.5D32162590r56459m30489q27064q72154q53577j071129o01692l13988p71904
$$ 432162590 431206131 430775642 429948578 429076424 428222847 427151718 426550026 426236038 425464134
3189.2D25464134j064110m97245m92363q11005o75926o34766o96220n23796p61032
$$ 425464134 424400024 423902779 423410416 422599411 421923485 421288719 420592499 420068703 419307671
3197.9D19307671r12285p19795q32940j03798j27754j105995j335754q24776l85323
$$ 419307671 418395386 417675591 416842651 416738853 416611099 415505104 414169350 413344574 412959251
3206.5D12959251r71336p97424m10347l82653k87666l47710l31039q21495n32646n40581
$$ 412959251 411987915 411190491 410780144 410397491 410109825 409762115 409431076 408609581 408076935 407536354
3216.2D07536354p51343l24783r99184j337204p01446k58637j78489k33345n17579
$$ 407536354 406785011 406460228 405461044 404123840 403422394 403163757 402985268 402751923 402234344
3224.9D02234344m03976n4359o32782j024933o52848k56843n70068q40722p78236n01366
$$ 402234344 401830368 401776009 401143227 400118294 399465446 399208603 398638535 397797813 397019577 396518211
3234.5C96518211n3634l27950n93452o74401n13763p24297p29141k10953m52728j03302
$$ 396518211 396464577 396136627 395543175 394868774 394355011 393630714 392901573 392690620 392237892 392134590
3244.2C92134590k38380o52504l16429o56891j138916o58646J21155k79389j91650
$$ 392134590 391896210 391243706 390927277 390270386 389131470 388472824 388593979 388314590 388122940
3252.8C88122940k20489n22690L6773m78248q50907o11534m97169l66554j98632l58467
$$ 388122940 387902451 387379761 387416534 386938286 386087379 385475845 384978676 384612122 384413490 384055023
3262.5C84055023p17201m56810j97792l59612q11996j2436J14098o27213j73302m13627
$$ 384055023 383337822 382881012 382683220 382323608 381511612 381499176 381613274 380986061 380812759 380399132
3272.1C80399132m14353n97801j36757J63117j044960n07355k94380k40174k22816
$$ 380399132 379984779 379386978 379250221 379413338 378368378 377861023 377566643 377326469 377103653
3280.8C77103653p51534o942Q6746m41628o26678k99149O562m07639o13251n2642M3296
$$ 377103653 376352119 376345177 376431923 375990295 375363617 375064468 375071030 374663391 374050140 373997498 374040794
3291.4C74040794o66427l43361j70899l28903J56517l8223m61693k78549m73290q01124
$$ 374040794 373374367 373031006 372860107 372531204 372687721 372649498 372187805 371909256 371435966 370634842
3301C70634842l28293k69966l80135l78685l66478Q0414k02255n89027p16973o10962
$$ 370634842 370306549 370036583 369656448 369277763 368911285 368991699 368789444 368200417 367483444 366872482
3310.7C66872482j58310k15377m47846k61154j36070l47748k46468l06167l74680n82466
$$ 366872482 366714172 366498795 366050949 365789795 365653725 365305977 365059509 364753342 364378662 363796196
3320.3C63796196o57005k78588o12869l13148k44370o92177k15683n111m27895p65152
$$ 363796196 363139191 362860603 362247734 361934586 361690216 360998039 360782356 360777245 360349350 359584198
3330C59584198l91464o29273m57267J75399n88531m86641k6436l70865m40559n73082
$$ 359584198 359192734 358563461 358106194 358281593 357693062 357206421 357179985 356809120 356368561 355795479
3339.6C55795479o16837k14386l12385m89884j64947m24156o03867n27229l28217j65367
$$ 355795479 355178642 354964256 354651871 354161987 353997040 353572884 352969017 352441788 352113571 351948204
3349.3C51948204m04816n46226n51033k82135k55013j60217p49550p62710N03654m6844
$$ 351948204 351543388 350997162 350446129 350163994 349908981 349748764 348999214 348236504 348740158 348693314
3358.9C48693314o19126m25949l96957p98302r87968k01950k80877l41491m42505k76146
$$ 348693314 348074188 347648239 347251282 346452980 345465012 345263062 344982185 344640694 344198189 343922043
3368.6C43922043n9738n63927k62299m12864l78876j85432k52037j82915q14476p76215
$$ 343922043 343862305 343298378 343036079 342623215 342244339 342058907 341806870 341623955 340809479 340033264
3378.2C40033264l59688j28479q2855m96940r16977l73497N32531j14288m54063k12708
$$ 340033264 339673576 339545097 339462242 338965302 338048325 337674828 338207359 338093071 337639008 337426300
3387.8C37426300j56288J88560q7089l35312m22554p16019l73687J22756m1351m80118
$$ 337426300 337270012 337458572 337371483 337036171 336613617 335897598 335523911 335646667 335605316 335125198
3397.5C35125198k99453L21235N4474l74565K34070m845m32510J4648k22244l88031
$$ 335125198 334825745 335146980 335201454 334826889 335060959 335056114 334623604 334638252 334416008 334027977
3407.1C34027977j28403j11046n2490k47879j90239J51406j25313m05846m93774k44904
$$ 334027977 333899574 333788528 333736038 333488159 333297920 333449326 333324013 332918167 332424393 332179489
3416.8C32179489J57623M83170M99306n60723l32489L27950k58522Q6822N00222Q3770
$$ 332179489 332337112 332820282 333319588 332758865 332426376 332754326 332495804 332582626 333082848 333166618
3426.4C33166618k63328N8708K69546K58751K25907r7962K1515p3738J49231J64909
$$ 333166618 332903290 332961998 333231544 333490295 333716202 333618240 333639755 333566017 333715248 333880157
3436.1C33880157l52287L4676N03387M39873j7204l08686k98004O02913Q09899L87458
$$ 333880157 333527870 333562546 334065933 334505806 334488602 334179916 333881912 334484825 335294724 335682182
3445.7C35682182L60337j006012L4217Q90160j58958L66935N16701N96161O52161N0697
$$ 335682182 336042519 335036507 335070724 335960884 335801926 336168861 336685562 337281723 337933884 337984581
3455.3C37984581m4441K16598O02265M37431O1417J93786O54106M84734K01836r9183
$$ 337984581 337940140 338156738 338759003 339196434 339257851 339451637 340105743 340590477 340792313 340693130
3465C40693130K18964J073036M55895L57704P0839l63007O69823P88574K60964J16958
$$ 340693130 340912094 341985130 342441025 342798729 342869568 342506561 343176384 343964958 344225922 344342880
3474.6C44342880M70162R62906Q52432J17645n7335N69153P72934P88841L52326K27737
$$ 344342880 344813042 345775948 346628380 346746025 346688690 347257843 348030777 348819618 349171944 349399681
3484.3C49399681M01306K38419K18658K31629P09800Q48771N36193O87905N44052K8915
$$ 349399681 349800987 350039406 350258064 350489693 351199493 352048264 352584457 353272362 353816414 353845329
3493.9C53845329N04837O27785O8741O85615R88198N76401M51965R54361L94630p14454
$$ 353845329 354350166 354977951 355046692 355732307 356720505 357296906 357748871 358703232 359097862 358383408
3503.6C58383408M24728J230926Q05398M61158J121865N93986j85623J072273Q02613
$$ 358383408 358808136 360039062 360844460 361305618 362427483 363021469 362835846 363908119 364710732
3512.2C64710732J08985P7248Q66470O55480J28975J443023R73893o8779M03785J497879
$$ 364710732 364819717 364896965 365763435 366418915 366547890 367990913 368964806 368896027 369299812 370797691
3521.9C70797691Q55790j46904R68437Q80546R39598L08838O7139N17273P52029O77719
$$ 370797691 371653481 371506577 372475014 373355560 374295158 374603996 374671135 375188408 375940437 376618156
3531.5C76618156L17955J284218R56002J258506J68038n25933J534195L96042M27399
$$ 376618156 376936111 378220329 379176331 380434837 380602875 380076942 381611137 382007179 382434578
3540.2C82434578P20596J380196J922951J083412Q76388m67529O38771l3760O19354
$$ 382434578 383155174 384535370 386458321 387541733 388418121 387950592 388589363 388555603 389174957
3548.9C89174957J831970J652222J457596j160049J192932J370620R42612J984215
$$ 389174957 391006927 392659149 394116745 392956696 394149628 395520248 396462860 398447075
3556.6C98447075O66466J465721J062011O09131J54686J447068J064415N83114N097428
$$ 398447075 399113541 400579262 401641273 402250404 402405090 403852158 404916573 405499687 410597115
3565.3D10597115J149787p58857P2860j302452L551712J574517J022186K069626J589470
$$ 410597115 411746902 410988045 411060905 409758453 413310165 414884682 415906868 417976494 419565964
3574D19565964J072120J067162J690598N14183K090377J401787O98586K347107J914482
$$ 419565964 420638084 421705246 423395844 423910027 426000404 427402191 428100777 430447884 432362366
3582.6D32362366O24962M83741M506951K397079j153869K080040p16782K303390L232460
$$ 432362366 432987328 433471069 437978020 440375099 439221230 441301270 440584488 442887878 446120338
3591.3D46120338L027001R11445J059151M037171j613007J255493L132515J077423
$$ 446120338 449147339 450058784 451117935 455155106 453542099 454797592 457930107 459007530
3599D59007530L037720Q22334J217270K202339J968727K171555K972221K778855j241532
$$ 459007530 462045250 462867584 464084854 466287193 468255920 470427475 473399696 476178551 474937019
3607.7D74937019L682824L62396q70476O837158N92804o29043M800453j203423L391915
$$ 474937019 478619843 478982239 478111763 484948921 485541725 484912682 489713135 488509712 491901627
3616.4D91901627M224319k41432J706924r30938M50630L802719L207435J843682K381820
$$ 491901627 496125946 495884514 497591438 496660500 497111130 500913849 504121284 505964966 508346786
3625.1E08346786K523118K758598O342621j712799j0234909N157356N509872N517578
$$ 508346786 510869904 513628502 519971123 518258324 508023415 513180771 518690643 524208221
3632.8E24208221J722489o71921K401466K676468J436348J48506K345810K722741K367172
$$ 524208221 525930710 525258789 527660255 530336723 531773071 531921577 534267387 536990128 539357300
3641.5E39357300Q73489O8474K911873L870125M883232j995163k850914N277099r70192
$$ 539357300 540230789 540299263 543211136 547081261 551964493 549969330 547118416 552395515 551425323
3650.1E51425323l078002K35977O221847M352761L919868N157356p662468J608353
$$ 551425323 548347321 548583298 554805145 559157906 563077774 568235130 560572662 562181015
3657.9E62181015N011559J369552J797791R28344J978226P97691J046143J228943J275597
$$ 562181015 567192574 568562126 570359917 571288261 573266487 574064178 575110321 576339264 577614861
3666.5E77614861M733390J835823m40712o0043o514664L415795Q673515Q893623q66127
$$ 577614861 582348251 584184074 583743362 583683319 577168655 580584450 589257965 598151588 597285461
3675.2E97285461j6745796K558747P479934M814720j652221N36613K628403J673660
$$ 597285461 580539665 583098412 590578346 595393066 593740845 594277458 596905861 598579521
3682.9E98579521J388245O24809R34296M348182O124154j0918847k267150J0884971
$$ 598579521 599967766 600592575 601526871 605875053 611999207 601080360 598813210 609698181
3690.6F09698181n072784j059037N166321R08051J163406K91481M44069J275368M97169
$$ 609698181 604625397 603566360 608732681 609640732 610804138 611095619 611539688 612815056 613312225
3699.3F13312225L295060L414955o307259k381058M980049J666756R16100P37152K574463
$$ 613312225 616607285 620022240 613714981 611333923 616313972 617980728 618896828 619633980 622208443
3708F22208443L480949p675857M490966M449349j2606621N260048M548530J3352R47533
$$ 622208443 625689392 618013535 622504501 626953850 614347229 619607277 624155807 624169159 625116692
3716.7F25116692K747688J510315k670098J885911N773963m459419m985275M965248
$$ 625116692 627864380 629374695 626704597 628590508 634364471 629905052 624919777 629885025
3724.4F29885025J078873k08321k564545N82619M250755Q38700N082702l110809p210655
$$ 629885025 630963898 630755577 628191032 628773651 633024406 633863106 638945808 635834999 628624344
3733.1F28624344R341545R96857r352112J300316K666549K20070L122864M094582l657875
$$ 628624344 637965889 638962746 629610634 630910950 633577499 633797569 636920433 641015015 637357140
3741.8F37357140L507347J3856277j0083160j9393120J0975456O505737N169449n573578
$$ 637357140 640864487 654720764 644637604 625244484 636219940 642725677 647895126 642321548
3749.5F42321548p855796J2283287o460419n899429O239395M773178L943329n262070
$$ 642321548 634465752 646749039 640288620 634389191 640628586 645401764 649345093 644083023
3757.2F44083023J858368N564270q048325q13217M933167J157684Q01163M028702l269196
$$ 644083023 645941391 651505661 643457336 642644119 647577286 648734970 649536133 653564835 650295639
3765.9F50295639m848785M260406N885391L09372j0040283J446686L846893K68402
$$ 650295639 645446854 649707260 655592651 655902023 645861740 647308426 651155319 651423721
3773.6F51423721N92652J19857J348420J152877L068619m83856q449173K822571L303680
$$ 651423721 652016373 652136230 653484650 654637527 657706146 657222290 648773117 651595688 654899368
3782.3F54899368J220932J368027l520126J69754K336883P62863L39585n78156O03409
$$ 654899368 656120300 657488327 653968201 654137955 656474838 657237701 657577286 656999130 657602539
3790.9F57602539Q09555N36194q69598P51876L932724k710189l844452K331390M569702
$$ 657602539 658412094 658948288 658078690 658830566 662763290 660053101 656208649 658540039 663109741
3799.6F63109741N583039q035660j0083771M369736L910980N825119O081314j0217361
$$ 663109741 668692780 660657120 650573349 654943085 658854065 664679184 670760498 660543137
3807.3F60543137m842759M741211K014923L43552N54504J46180J108474O171723j066361
$$ 660543137 655700378 660441589 662456512 662800064 663354568 663500748 664609222 670780945 669714584
3816F69714584j5307769N190277O004944M996261K785034j7702636J768035O319428
$$ 669714584 654406815 659597092 665602036 670598297 673383331 655680695 657448730 663768158
3823.7F63768158K531967K219544K98843m114609j94320K366714L396988J418152q166275
$$ 663768158 666300125 668519669 668818512 664703903 664509583 666876297 670273285 671691437 663525162
3832.4F63525162L130951P720260o180954r28726Q090744r939804m141006R494705
$$ 663525162 666656113 674376373 668195419 667266693 675357437 665417633 661276627 670771332
3840.1F70771332m915772L00980P619247l159713m554367K485733J822128P48367J463623
$$ 670771332 665855560 666156540 673775787 670616074 666061707 668547440 670369568 671117935 672581558
3848.8F72581558j355057J616669N298844l952027L069153j6983337R35592J1075974
$$ 672581558 671226501 672843170 678142014 674189987 677259140 660275803 661211395 672287369
3856.5F72287369j201248k032319K563859K235412K296600n592269J00326P264176
$$ 672287369 671086121 669053802 671617661 673853073 676149673 670557404 670657730 677921906
3864.2F77921906o797333n247574N155258N623932P128448q344574j1510086M666977
$$ 677921906 671124573 665876999 671032257 676656189 683784637 675440063 663929977 668596954
3871.9F68596954P669754M230805j0624085Q35953M347992k40707K181320M935531
$$ 668596954 676266708 680497513 669873428 670709381 675057373 674816666 676997986 681933517
3879.7F81933517n650558p772675O865540K028427J433945M846954j3100204M47540
$$ 681933517 676282959 668510284 675375824 677404251 678838196 683685150 670584946 671032486
3887.4F71032486L982010J409225M033509j135025p043305J642761L628769r87930
$$ 671032486 675014496 676423721 680457230 679322205 672278900 673921661 677550430 676562500
3895.1F76562500R04999Q27560K810288J629791j1027756N278549J743927n060958
$$ 676562500 677467499 678295059 681105347 682735138 671707382 676985931 678729858 673668900
3902.8F73668900N950164l820572j875534J348038J342011K786560O103n21164k55813
$$ 673668900 679619064 675798492 673922958 675270996 676613007 679399567 679405670 678884506 678628693
3911.5F78628693O83288k95791n27649J316299J498184l041153k966842M582367k21787
$$ 678628693 679311981 679016190 678488541 679804840 681303024 678261871 675295029 679877396 679655609
3920.2F79655609l593445K845078K013168J496582k641983l268204J919938J413650
$$ 679655609 676062164 678907242 680920410 682416992 679775009 676506805 678426743 679840393
3927.9F79840393J130219j072846n66788J718293k183533q44650K004242O37283J64795
$$ 679840393 680970612 679897766 679330978 681049271 678865738 678021088 680025330 680662613 680827408
3936.6F80827408K66952k80227k08664j59455J483155R91974m052353j41144J819458
$$ 680827408 681094360 680814133 680605469 680446014 681929169 682921143 678868790 678727646 680547104
3945.2F80547104P75680P57752k266541J492997J039123k633362J167908L04413n00717
$$ 680547104 681322784 682080536 679813995 681306992 682346115 679712753 680880661 681185074 680684357
3953.9F80684357P44323R35593K36740j043320l27987L47366J429520j89743j567993
$$ 680684357 681428680 682364273 682601013 681557693 681229706 681577072 683006592 682816849 681248856
3962.6F81248856K00576r0637K0065J14518l3722K49023k86636O6757R49173J88828
$$ 681248856 681449432 681358795 681378860 681493378 681459656 681708679 681422043 681488800 682437973 682626801
3972.2F82626801m44565L03421L69491J5641p3471M05502J42898k90374N5923K33994
$$ 682626801 682182236 682485657 682855148 682870789 682797318 683202820 683345718 683055344 683111267 683345261
3981.9F83345261J29852o16074j96380J05972K51312O4774p79495J24511M57917P23953
$$ 683345261 683475113 682859039 682662659 682768631 683019943 683084717 682305222 682429733 682887650 683611603
3991.5F83611603M78134M5776j18713j108017l49197J23901P56836J083908m4785
$$ 683611603 684089737 684135513 684016800 682908783 682559586 682683487 683440323 684524231 684479446
4000.2F84479446
$$ 684479446
##END=$$ End of the data block
