##TITLE=$$ Begin of the data block
##JCAMP-DX=5.00 $$ ACD/SpecManager v 10.08
##SPECTROMETER/DATA SYSTEM=16PC
##DATE=Mon Sep 02 15:47:54 2013
##DATA TYPE=INFRARED SPECTRUM
##DATA CLASS=XYDATA
##ORIGIN=
##OWNER=
##NPOINTS=3601
##FIRSTX=400.00000000
##LASTX=4000.00000000
##MAXX=4000.00000000
##MINX=400.00000000
##MAXY=38.59257126
##MINY=13.77259636
##XFACTOR=1.0000000000
##YFACTOR=0.000000100000000
##FIRSTY=21.67960739
##DELTAX=1.00000000
##XUNITS=1/CM
##YUNITS=TRANSMITTANCE
##XYDATA=(X++(Y..Y))
400 216796074 268052063 304130993 322266350 325493469 320601311 314775867 312711506 315469723
408 315469723 321240616 327151299 330938797 331718102 329822044 326220284 322049179 318435059 316428223
417 316428223 316793900 319640331 324144173 328695602 331533051 331578827 328989334 325075226 321631927
426 321631927 320076294 320875854 323534393 327038536 330423927 333128891 335017967 336192818 336803932
435 336803932 336993370 336941833 336901283 337126427 337729645 338570824 339277496 339402504 338621864 336859779
445 336859779 334285431 331214600 328001289 324978600 322448730 320674248 319832363 319941387 320814896
454 320814896 322098503 323397102 324437866 325185013 325841408 326733932 328137169 330124092 332511330
463 332511330 334923782 336946564 338294182 338921585 339031296 338973732 339095383 339607239 340539436 341794205
473 341794205 343255348 344878616 346700554 348759346 350987587 353157578 354937668 356042099 356389465
482 356389465 356167679 355749550 355492325 355530090 355680046 355523682 354622421 352750359 350014725 346803589
492 346803589 343598785 340770569 338470230 336667976 335289841 334346390 333960876 334280472 335334663
501 335334663 336944847 338747749 340317459 341303406 341496735 340798492 339141579 336455345 332731819
510 332731819 328164864 323263092 318831177 315779972 314836369 316284275 319865093 324876213 330409470
519 330409470 335613594 339876938 342892151 344629555 345271988 345147133 344660187 344215240 344124527 344535751
529 344535751 345409546 346566315 347778969 348862114 349715004 350307808 350640411 350714569 350541687 350174026
539 350174026 349723282 349337387 349140472 349169540 349351158 349538345 349588089 349436569 349126663 348775291
549 348775291 348503380 348370361 348351707 348367233 348335381 348213692 347997513 347674942 347173843 346341934 344991531
560 344991531 343000031 340418167 337523956 334776077 332670860 331558342 331501427 332249641 333343811
569 333343811 334306259 334830055 334880028 334666100 334510155 334676437 335246544 336091537 336942329 337517967
579 337517967 337646408 337329483 336730042 336098480 335676537 335617790 335951118 336591759 337385788 338165855
589 338165855 338798599 339208679 339377861 339323387 339068222 338617668 337956963 337072182 335986748 334789162
599 334789162 333630066 332677383 332047462 331749191 331680679 331690483 331678467 331676178 331853867 332437859 333576393
610 333576393 335231934 337164383 339025307 340516396 341527977 342184677 342775536 343607330 344857788
619 344857788 346494980 348290634 349909172 351023979 351417923 351039772 350012093 348598251 347140503
628 347140503 345980225 345377502 345448570 346141205 347258034 348522377 349665451 350504189 350982971 351165199
638 351165199 351179237 351145134 351116867 351067734 350928230 350650635 350258636 349844627 349508820 349277763 349056778
649 349056778 348655548 347874489 346593895 344804115 342557945 339893951 336812248 333352699 329735680
658 329735680 326450996 324178391 323518906 324655304 327150459 330045166 332256966 333089790 332571869
667 332571869 331421471 330646210 331000366 332603455 334922142 337099152 338414268 338612328 337941170
676 337941170 336933365 336103477 335743484 335891914 336426201 337166824 337917480 338452797 338515968 337871857
686 337871857 336390152 334086227 331065941 327401505 323039055 317836990 311744595 305014267 298284645
695 298284645 292435284 288256855 286117535 285832081 286827908 288520489 290675735 293535309 297627468
704 297627468 303373661 310727539 319060764 327359772 334619446 340215340 344066238 346531296 348135529
713 348135529 349292107 350164337 350705910 350814362 350483208 349863625 349217453 348805008 348779945 349140549
723 349140549 349749107 350394135 350864983 351009674 350767899 350174484 349335518 348382378 347415733 346462135
733 346462135 345466156 344323921 342944069 341300888 339445114 337463989 335413437 333268623 330931168
742 330931168 328296432 325342903 322182579 319031315 316100960 313469830 311006832 308404160 305314941
751 305314941 301533298 297127953 292460155 288075447 284521236 282172012 281137028 281274910 282289505
760 282289505 283848534 285669079 287543507 289316826 290847855 291990604 292608795 292617321 292024097
769 292024097 290945854 289586010 288178406 286921577 285929508 285219479 284738598 284414616 284202328
778 284202328 284105721 284166412 284431362 284922180 285625744 286512585 287569351 288824863 290351238 292238159
788 292238159 294550648 297291431 300381107 303662605 306926422 309949455 312541561 314591446 316101971
797 316101971 317199554 318106804 319080296 320333099 321972198 323978577 326237411 328599777 330943336
806 330943336 333203087 335365028 337437019 339421501 341304855 343061905 344658203 346041451 347125206
815 347125206 347786026 347892113 347362289 346230621 344678154 343007088 341563950 340646057 340436325
824 340436325 340991516 342276459 344211998 346701736 349624176 352807999 356018867 358985481 361459427
833 361459427 363283920 364436798 365024948 365234947 365264168 365262375 365304642 365399284 365517769 365631294 365737610
844 365737610 365870399 366090469 366460762 367017517 367747917 368587761 369440842 370213776 370849609 371343231
854 371343231 371732521 372071533 372402458 372741661 373084335 373419952 373743210 374054146 374346123 374596024
864 374596024 374765167 374812584 374713020 374463921 374077225 373560791 372903099 372076950 371064072 369889870
874 369889870 368650436 367513504 366689034 366377258 366712646 367722816 369316635 371304436 373444176
883 373444176 375500870 377299995 378761406 379900665 380801010 381565514 382270660 382939148 383542595
892 383542595 384028969 384360237 384539757 384615669 384661407 384743347 384893837 385102577 385328560 385523872 385655441
903 385655441 385712814 385701294 385627518 385489922 385282211 385007133 384690018 384379234 384128151 383967667 383885612
914 383885612 383829689 383737106 383576775 383379097 383232765 383245697 383488770 383953209 384546776 385131760 385584183
925 385584183 385843506 385925713 385897446 385828934 385753403 385655022 385487633 385207939 384803772 384300919 383748360
936 383748360 383193741 382662697 382152443 381640091 381099968 380520363 379913254 379311104 378752823 378261375
946 378261375 377824211 377387276 376869431 376197395 375346718 374368706 373387909 372565117 372041969 371891632
956 371891632 372098274 372573776 373199921 373873672 374533691 375159492 375750542 376302109 376792107 377184868
966 377184868 377446899 377564850 377555580 377465401 377357521 377293739 377313156 377417107 377564545 377683487 377695541
977 377695541 377544746 377216110 376735229 376148491 375496750 374798393 374053574 373265724 372463570 371707230
987 371707230 371068497 370595474 370282478 370063133 369832573 369485741 368950500 368201447 367251854 366137161
997 366137161 364904137 363611298 362334366 361162682 360180283 359435959 358919792 358560715 358251381
1006 358251381 357887573 357404404 356788940 356067467 355275078 354426270 353501282 352453499 351233292 349812698
1016 349812698 348201180 346442451 344594421 342702026 340778618 338811378 336794205 334779739 332922745
1025 332922745 331485939 330788918 331110573 332580070 335106888 338385201 341977921 345444450 348457451
1034 348457451 350861244 352657928 353941154 354821320 355379868 355664864 355714073 355578575 355327148 355030136
1044 355030136 354736290 354460106 354185982 353883018 353519516 353068428 352507477 351820030 351002731 350076065
1054 350076065 349086304 348092117 347137184 346221657 345291443 344252014 343002968 341474304 339644585
1063 339644585 337532997 335170860 332571907 329718361 326569672 323086433 319252815 315082188 310601959
1072 310601959 305825043 300724850 295230045 289243374 282680511 275512657 267795963 259674950 251360302
1081 251360302 243089733 235090408 227556648 220649700 214513550 209290123 205118713 202111511 200312843
1090 200312843 199664192 199997864 201075134 202662163 204619904 206969662 209904747 213734112 218773804
1099 218773804 225220757 233054371 242000790 251574039 261182346 270265598 278421497 285481415 291514893
1108 291514893 296764469 301534882 306075287 310493317 314730549 318602886 321889000 324430389 326204529
1117 326204529 327345963 328110809 328804550 329702568 330992126 332751045 334956055 337511559 340278320
1126 340278320 343097420 345808372 348266411 350359268 352020874 353233681 354016724 354404449 354425735
1135 354425735 354095764 353423004 352426834 351155319 349691772 348149185 346654701 345332527 344288216
1144 344288216 343595695 343286171 343340034 343686371 344215164 344802933 345343056 345770988 346072121 346271477
1154 346271477 346410828 346526070 346633263 346726418 346783447 346773720 346663704 346420059 346013336 345424614 344654007
1165 344654007 343729858 342712898 341689758 340753441 339968681 339332695 338748207 338031998 336971207
1174 336971207 335419617 333397102 331142578 329078484 327685432 327328339 328110542 329824524 332024727
1183 332024727 334189606 335899506 336950035 337362289 337301750 336961746 336469269 335851212 335055618 334001198
1193 334001198 332619705 330877037 328771095 326321182 323557129 320510292 317204208 313644085 309807930
1202 309807930 305646210 301089859 296061859 290485573 284283981 277374954 269670448 261089611 251587009
1211 251587009 241189041 230027199 218358631 206565571 195133324 184605827 175520325 168330536
1219 168330536 163331985 160611858 160042400 161325817 164079380 167934589 172616158 177977676 183986568
1228 183986568 190673580 198070450 206162148 214865875 224038086 233496666 243044815 252487125 261636734
1237 261636734 270321941 278398285 285770111 292413692 298387470 303819160 308866940 313667870 318297157
1246 318297157 322755508 326990700 330938263 334557114 337839890 340793266 343404961 345618820 347335510
1255 347335510 348436737 348817558 348407288 347172432 345109367 342242470 338637085 334421883 329802399
1264 329802399 325049438 320463142 316327629 312879238 310298691 308718262 308219128 308801651 310333767
1273 310333767 312509613 314857464 316815567 317857342 317615337 315945625 312908669 308684711 303479118
1282 303479118 297475166 290856457 283879051 276935711 270561714 265360584 261873436 260443726 261129665
1291 261129665 263694096 267668610 272465839 277504120 282312469 286594505 290239716 293283176 295828018
1300 295828018 297955322 299651794 300780582 301103401 300348358 298301601 294901371 290311508 284957294
1309 284957294 279506607 274786530 271639671 270747395 272468338 276747169 283128071 290871487 299131870
1318 299131870 307136669 314314556 320349922 325171013 328896332 331761436 334041862 335982971 337745934
1327 337745934 339383812 340850525 342033348 342787933 342958031 342383957 340923691 338512459 335257072
1336 335257072 331523437 327947922 325328064 324402351 325603065 328893471 333772163 339446106 345090866
1345 345090866 350077629 354078445 357032166 359030190 360204620 360677414 360571404 360037727 359250984
1354 359250984 358354111 357377472 356184654 354486961 351934471 348256187 343395920 337592125 331369247
1363 331369247 325436707 320522079 317189102 315693913 315930538 317479382 319739170 322091141 324035683
1372 324035683 325262566 325651283 325226746 324108620 322476311 320547867 318557148 316714478 315158825
1381 315158825 313925247 312954121 312147923 311452351 310916595 310694656 310978432 311891994 313403091 315300808
1391 315300808 317258930 318955402 320189857 320941315 321338005 321561775 321740532 321885872 321903572 321660957
1401 321660957 321063232 320094643 318806305 317270412 315541286 313651199 311638851 309581394 307590790
1410 307590790 305765591 304118748 302531757 300776196 298610573 295915451 292802410 289635315 286939983
1419 286939983 285228558 284808807 285661926 287449017 289650612 291783180 293591785 295123539 296640873
1428 296640873 298415966 300515652 302699490 304495258 305418015 305213947 303994446 302187347 300336952
1437 300336952 298868790 297940216 297436218 297077541 296553612 295610600 294083385 291913471 289190617
1446 289190617 286202049 283420715 281370525 280385704 280383663 280809040 280838585 279780083 277457047 274344711
1456 274344711 271350746 269344215 268700962 269136257 269926033 270381393 270280151 269990711 270214920 271516743
1466 271516743 273936024 276922646 279625931 281355724 281936092 281756477 281514149 281822319 282915707
1475 282915707 284600983 286441956 288039932 289240017 290165081 291089687 292248688 293689175 295236721
1484 295236721 296581287 297439938 297721901 297621994 297586651 298145618 299669437 302172508 305286388 308459778
1494 308459778 311306801 313912830 316886215 321064148 326987801 334429932 342275581 348887177 352807426
1503 352807426 353447304 351388664 348132858 345430870 344547806 345830040 348749161 352323990 355642509
1512 355642509 358201752 359943619 361057320 361729698 362003593 361793785 361003189 359641533 357879219
1521 357879219 356024246 354446297 353474197 353287544 353833694 354814796 355786552 356360092 356420555 356231499
1531 356231499 356323814 357186737 358912430 361005440 362504349 362390862 360089722 355797920 350459633
1540 350459633 345394287 341763611 340135422 340340195 341656494 343205872 344360657 344983864 345412140
1549 345412140 346206055 347780113 350076141 352434807 353755150 352917328 349313049 343243713 335965500
1558 335965500 329299431 324936562 323741608 325391998 328545227 331467133 332814064 332182426 330161858
1567 330161858 327894020 326399269 326038132 326383209 326532097 325654945 323458595 320322800 317067528
1576 317067528 314515343 313104076 312749329 312992287 313307648 313380070 313205051 312994537 312979488 313241272
1586 313241272 313660049 313982124 313941536 313357124 312165165 310397530 308143387 305527363 302710323
1595 302710323 299892483 297299576 295143280 293564777 292581139 292054977 291705036 291171131 290126610
1604 290126610 288409214 286110973 283565483 281207771 279351273 277991085 276754398 275052967 272378979
1613 272378979 268592033 264030075 259371758 255316124 252254333 250109329 248420391 246608791 244267311
1622 244267311 241325436 238031025 234795189 232000618 229859676 228348351 227202053 225955372 224028740
1631 224028740 220877686 216187286 210043392 202983150 195855789 189520779 184506149 180795078 177860489
1640 177860489 174943943 171447678 167249241 162780991 158839207 156222429 155381937 156261644 158403540
1649 158403540 161258335 164527950 168344631 173172512 179472713 187314568 196164322 204999313 212710819
1658 212710819 218588238 222610607 225379601 227735653 230286694 233129177 235910664 238159981 239645176
1667 239645176 240517101 241161518 241893005 242735100 243460045 243860035 244038258 244475060 245774364 248225765
1677 248225765 251468239 254501934 256085892 255316448 252062912 247015476 241328449 236065845 231745682
1686 231745682 228197689 224750977 220601387 215145397 208144531 199708405 190185108 180059166
1694 180059166 169900417 160336151 151996441 145407772 140871630 138394833 137725964 138494864 140393658
1703 140393658 143311625 147358408 152763529 159697342 168085823 177490845 187099514 195831261 202541218
1712 202541218 206268711 206467438 203144207 196854877 188548527 179309540 170098457 161596317 154209757
1721 154209757 148209982 143902597 141704311 142059107 145229149 151083612 159030037 168158169 177544956
1730 177544956 186569519 195072212 203277092 211530724 220013943 228591957 236880283 244472561 251181526
1739 251181526 257144089 262727776 268299694 273996239 279631252 284793854 289077682 292312012 294668789
1748 294668789 296593342 298605080 301077709 304110680 307541656 311070347 314411087 317390823 319961414
1757 319961414 322155418 324042702 325728607 327382507 329243164 331553841 334428329 337720604 340992088
1766 340992088 343635750 345125542 345271759 344345665 342994690 341984558 341895981 342923241 344854851
1775 344854851 347217293 349485703 351259270 352349167 352788315 352796593 352724419 352965050 353825569 355382271
1785 355382271 357389908 359322548 360570068 360720139 359786873 358247070 356844597 356246376 356726151
1794 356726151 358044739 359587021 360681992 360933228 360392227 359497757 358831596 358826675 359577065 360829811
1804 360829811 362139816 363093758 363485298 363366928 362974243 362583961 362387314 362440529 362698059 363088531
1814 363088531 363574753 364164276 364876289 365701332 366589394 367471962 368292046 369010849 369582481 369924736
1824 369924736 369926910 369510269 368710480 367718849 366834145 366335487 366349030 366799774 367485237 368227310
1834 368227310 368992615 369889259 371031075 372364159 373587494 374250679 373989449 372761993 370931091
1843 370931091 369127083 367959137 367737999 368361778 369418869 370431023 371088524 371352234 371389618
1852 371389618 371414299 371542053 371746902 371927490 372018471 372066917 372220116 372632675 373349419 374236259
1862 374236259 375003815 375321960 374972305 373965034 372558708 371165810 370184669 369838066 370094070
1871 370094070 370708046 371355705 371784515 371903954 371780205 371556778 371361198 371254425 371236649 371285095
1881 371285095 371381187 371507301 371625900 371671829 371578102 371319122 370938797 370534592 370203323 369986649
1891 369986649 369854584 369739304 369592934 369422951 369281807 369221001 369249611 369331245 369419746 369499245 369592018
1902 369592018 369724083 369879723 369988976 369970169 369802284 369572144 369448547 369589424 370033340 370652046
1912 370652046 371199226 371433945 371245499 370705566 370019951 369416084 369035187 368889351 368897934 368964577
1922 368964577 369041634 369143143 369308929 369552040 369828377 370048218 370120773 370003853 369731445 369404449
1932 369404449 369150276 369068336 369184837 369435425 369686050 369784164 369622536 369187698 368570442 367930298
1942 367930298 367430458 367171326 367155075 367294540 367460480 367539330 367474747 367277336 367003784 366722984
1952 366722984 366488686 366327896 366246910 366243286 366315384 366461449 366671524 366917114 367148247 367302856 367326851
1963 367326851 367197075 366935539 366605988 366290703 366058960 365940819 365920601 365952911 365990906 366010628 366018028
1974 366018028 366035652 366080780 366150742 366225014 366282616 366321182 366362076 366437263 366562653 366718330 366846962
1985 366846962 366876678 366756248 366483955 366114464 365737991 365443916 365284843 365261002 365328293 365425072 365502052
1996 365502052 365540924 365553932 365567894 365602493 365655479 365701332 365702934 365631523 365483322 365287247 365097809
2007 365097809 364975891 364963112 365060654 365222511 365368462 365414505 365309677 365060997 364734459 364428139
2017 364428139 364228706 364171829 364227066 364314423 364344254 364259796 364060593 363796539 363538895 363344994 363235512
2028 363235512 363193398 363181953 363167419 363135567 363093605 363061142 363056259 363085213 363139267 363198662 363240776 363247681
2040 363247681 363212128 363138771 363041573 362937965 362842445 362763367 362701797 362654457 362616158 362579994 362536316 362471848
2052 362471848 362372818 362231827 362054214 361860924 361681938 361544228 361459541 361419792 361403847 361390114 361367989
2063 361367989 361338921 361308098 361271706 361210327 361096268 360910263 360659409 360382767 360139809 359986267 359948311
2074 359948311 360011482 360128059 360240784 360308800 360323143 360304527 360285759 360290298 360317879 360344467 360336304 360268593
2086 360268593 360141029 359980392 359831429 359738731 359728470 359797249 359912949 360027924 360097618 360099335 360040474
2097 360040474 359953613 359879951 359847412 359854660 359869461 359842834 359733696 359532051 359268265 359004288 358808556
2108 358808556 358726425 358761139 358872261 358993454 359060822 359037666 358926277 358762245 358595963 358470688 358407478
2119 358407478 358401146 358427811 358456993 358464050 358436317 358374825 358290901 358201141 358122673 358068085 358042374 358041534 358054695
2132 358054695 358069496 358078728 358084221 358095169 358121147 358162956 358206940 358228149 358201332 358114204 357975349 357812004
2144 357812004 357658119 357538261 357458801 357407455 357364197 357313881 357254410 357196121 357153168 357133484 357133713 357140808
2156 357140808 357139053 357118416 357077713 357024155 356968307 356918793 356879616 356849899 356825371 356800423 356769333 356725845
2168 356725845 356663055 356573677 356451187 356292038 356099167 355884285 355667610 355474854 355330887 355252724
2178 355252724 355243721 355292053 355373993 355459480 355519447 355530701 355480194 355366325 355199928 355003662 354808540
2189 354808540 354646721 354542427 354502335 354512444 354542427 354557991 354536591 354477844 354404144 354349899 354343681 354392433
2201 354392433 354475555 354552193 354578743 354527283 354398079 354219017 354033890 353885536 353801041 353784409 353818817
2212 353818817 353874588 353920326 353931351 353894577 353810310 353689613 353551025 353415298 353300552 353217850 353168983
2223 353168983 353146667 353136978 353123283 353090515 353028908 352935486 352814255 352674294 352527580 352387238 352267189
2234 352267189 352182770 352149734 352179871 352274246 352414894 352562981 352666245 352675514 352565117 352346191 352066650
2245 352066650 351793175 351586151 351476135 351454735 351483002 351512032 351505318 351453171 351373825 351302376 351274490
2256 351274490 351310959 351409111 351542816 351671333 351752129 351756248 351677589 351534119 351359825 351190643 351052094
2267 351052094 350952530 350885468 350836220 350789642 350733795 350660896 350567780 350459251 350351601 350274239 350263519
2278 350263519 350349731 350542259 350820923 351140251 351444588 351688385 351851654 351943054 351990547 352025757 352070694
2289 352070694 352132950 352211342 352306252 352426720 352590103 352812119 353094711 353421249 353763695 354100952
2299 354100952 354436607 354802628 355242310 355776405 356373177 356941490 357358398 357523880 357416840 357126198
2309 357126198 356835747 356766968 357098122 357889023 359039078 360296249 361321831 361797905 361546288 360611763
2319 360611763 359263802 357898674 356868820 356316032 356098976 355866776 355254173 354095573 352534637
2328 352534637 350958099 349787140 349250908 349275589 349549828 349705315 349477425 348733368 347369461 345194206
2338 345194206 341951714 337542839 332342873 327388000 324229660 324425812 328867226 337276039 348159752
2347 348159752 359280930 368434258 374164963 376111794 374871254 371527977 367135735 362397499
2355 362397499 357628593 352914505 348293839 343842201 339642487 335718880 332021027 328485336 325124283
2364 325124283 322069130 319524765 317662735 316524963 316000309 315886230 315992107 316219215 316577435
2373 316577435 317142239 317991734 319163666 320648880 322408524 324390793 326533394 328755112 330954285
2382 330954285 333021660 334866295 336438904 337737923 338794708 339648666 340326538 340837517 341183167
2391 341183167 341373940 341440926 341434288 341409912 341409836 341446381 341498795 341525078 341484413 341361313 341176987 340983887
2403 340983887 340842628 340795288 340847397 340969124 341113701 341241837 341338120 341411934 341485329 341575012 341681061
2414 341681061 341784630 341854820 341859169 341774788 341596642 341343956 341059074 340798798 340615311 340535049 340544128
2425 340544128 340590858 340607529 340541496 340379524 340152550 339916916 339723167 339590454 339498482 339402046 339256821
2436 339256821 339042435 338770866 338478889 338209305 337994576 337847252 337761803 337722397 337712402 337720108 337739754
2447 337739754 337768822 337803764 337837105 337857018 337850685 337809677 337734871 337637672 337537270 337453537 337398796 337373772
2459 337373772 337367439 337361755 337339325 337288933 337208328 337103539 336984787 336862679 336744003 336630440 336518745
2470 336518745 336403160 336278572 336143074 335998878 335851173 335705643 335566292 335434914 335311737 335195885
2480 335195885 335085335 334976158 334860992 334731216 334579659 334405136 334213638 334016304 333824272 333643074
2490 333643074 333472481 333309860 333155975 333018913 332910233 332837372 332795258 332764282 332717476 332633781 332510490
2501 332510490 332366447 332233772 332141991 332103195 332106323 332123032 332121506 332079582 331991463 331865120 331714325
2512 331714325 331551132 331382980 331214638 331052818 330906792 330786438 330697479 330637894 330598831 330569038 330540657
2523 330540657 330513153 330491486 330482216 330488663 330508423 330535202 330562210 330584908 330601273 330608826 330601311 330568390 330499268
2536 330499268 330388832 330243721 330083199 329934273 329821091 329754868 329729042 329722214 329708824 329671402 329608269
2547 329608269 329533005 329465523 329419746 329396210 329381752 329358177 329313011 329247932 329177475 329120636 329090462 329085426
2559 329085426 329090614 329084396 329048538 328975449 328868332 328736801 328590240 328433151 328266373 328090591 327910614
2570 327910614 327736130 327578773 327446022 327337761 327245216 327155075 327055969 326942749 326817284 326684723
2580 326684723 326548615 326407814 326258125 326097488 325931435 325774498 325645523 325558853 325515785 325502090
2590 325502090 325493126 325463486 325397148 325291481 325155106 325000954 324841194 324686279 324547462 324439468 324378242
2601 324378242 324372749 324415627 324479332 324521103 324498520 324386330 324187546 323932686 323666840 323432999 323258438
2612 323258438 323150711 323102112 323098145 323123589 323163376 323199768 323211479 323176651 323080444 322923965 322728195
2623 322728195 322529564 322368011 322271919 322246552 322271347 322307167 322311134 322252693 322124825 321945915 321751862
2634 321751862 321582031 321464806 321408730 321402626 321423302 321446877 321458092 321454582 321443672 321435471 321436348 321446075 321458549
2647 321458549 321465530 321459579 321434708 321385956 321308098 321196823 321052742 320885048 320712624 320560455 320451393
2658 320451393 320397491 320393982 320420761 320450401 320458565 320433502 320378075 320305939 320233269 320171318 320122757 320084343
2670 320084343 320051651 320023804 320004578 319999466 320010834 320034561 320060043 320073624 320063972 320026054 319962444 319880276
2682 319880276 319787693 319689407 319585762 319475136 319358368 319242744 319143047 319076595 319055176 319076023 319118767
2693 319118767 319150543 319138832 319066448 318939724 318785172 318634682 318507710 318399601 318285294 318135090
2703 318135090 317934170 317694416 317450237 317241440 317092762 317003288 316949997 316903381 316843796 316768265 316685162
2714 316685162 316601925 316515732 316413441 316281281 316116104 315930710 315748959 315594749 315481014 315405235
2724 315405235 315352592 315302563 315235329 315135384 314993229 314807987 314589539 314358940 314142494 313961296 313820057
2735 313820057 313704147 313586578 313444176 313272114 313088684 312925930 312811832 312753944 312735157 312722225
2745 312722225 312681980 312595558 312462864 312298031 312120857 311948833 311794453 311664104 311556301 311459255
2755 311459255 311350613 311203156 310996590 310730476 310429325 310134850 309887581 309706097 309576988 309460201
2765 309460201 309308224 309087791 308793507 308447227 308085823 307745247 307449417 307206841 307014561 306863079
2775 306863079 306741657 306640015 306549606 306464977 306383457 306303844 306224117 306138878 306039886 305919952 305777798
2786 305777798 305621128 305464306 305321999 305202045 305101509 305008698 304908333 304788151 304642086 304471474
2796 304471474 304283772 304090748 303906250 303742390 303604221 303486710 303375454 303254871 303118973 302978630
2806 302978630 302858315 302782192 302755508 302754898 302734566 302648621 302476120 302236652 301983395 301778984 301666298
2817 301666298 301649990 301699333 301766338 301809540 301808739 301765175 301691666 301600895 301499290 301387691 301265526 301132641
2829 301132641 300989075 300832825 300660553 300471134 300268917 300063000 299862480 299669800 299478512 299277191
2839 299277191 299058094 298823948 298586769 298358879 298140812 297915382 297652512 297323284 296915874 296444130
2849 296444130 295943356 295455666 295012321 294622078 294269733 293924961 293556633 293144894 292688446 292203846
2859 292203846 291718502 291259460 290842304 290463314 290098763 289711552 289264889 288737755 288135147 287488689
2869 287488689 286846638 286255951 285745583 285317516 284948940 284605236 284255466 283882809 283486252 283072281
2879 283072281 282644863 282198429 281718712 281190128 280603848 279961624 279273491 278551579 277804413 277035751
2889 277035751 276246815 275439091 274613953 273769264 272898102 271990204 271040058 270055141 269059601 268088188
2899 268088188 267174683 266340485 265591869 264926739 264345226 263855362 263467770 263182583 262977676 262808285
2909 262808285 262621155 262374554 262053661 261669445 261243973 260791721 260308990 259779625 259191704 258553104
2919 258553104 257895603 257263718 256695423 256207485 255792351 255427227 255087872 254757824 254429741 254101543
2929 254101543 253773670 253451309 253149242 252894096 252719288 252651863 252699127 252842751 253043785 253258648
2939 253258648 253455372 253622990 253770103 253913517 254064980 254223003 254372158 254490223 254557705 254565525
2949 254565525 254518280 254431915 254327526 254222660 254123154 254018383 253883438 253688068 253410244 253048744
2959 253048744 252626839 252185688 251767235 251395741 251066494 250748615 250398769 249981041 249480267 248905315
2969 248905315 248280659 247635403 246995907 246386051 245833817 245376358 245058594 244923706 245000286 245293388
2979 245293388 245784283 246439209 247220974 248098640 249049187 250053158 251087990 252124958 253132210
2988 253132210 254083176 254965572 255787010 256572495 257355042 258162384 259004879 259870052 260725269 261528301
2998 261528301 262240620 262838593 263318138 263693428 263991470 264246006 264492092 264762421 265081062 265457077
3008 265457077 265878048 266308746 266698627 266996269 267165890 267198334 267110443 266935291 266707840 266455307
3018 266455307 266194935 265939503 265701923 265495434 265326328 265185127 265043201 264859562 264595814 264233570
3028 264233570 263783665 263283749 262783699 262327404 261938629 261616364 261341267 261087284 260833054 260568390
3038 260568390 260293484 260013351 259731197 259444141 259143124 258816643 258454132 258048820 257597103 257096100
3048 257096100 256541481 255927315 255248852 254506454 253707943 252868443 252006378 251139374 250281010 249440060
3058 249440060 248621311 247827091 247056847 246306782 245570087 244839687 244112473 243393402 242696209 242038326
3068 242038326 241432381 240878067 240358143 239841652 239293137 238682842 237994938 237228279 236392651 235501823
3078 235501823 234568558 233603973 232621346 231640167 230687828 229795475 228989429 228282108 227667141 227121658
3088 227121658 226615639 226122723 225627041 225123024 224607811 224072990 223501606 222873116 222175941 221418705
3098 221418705 220634232 219870682 219173889 218569107 218051529 217591705 217152710 216710091 216264915 215842113
3108 215842113 215476131 215192375 214993649 214859829 214759254 214665298 214568958 214480915 214422607 214413013 214458790
3119 214458790 214552937 214682865 214840755 215030670 215266762 215564613 215930653 216356659 216822720 217307358
3129 217307358 217798023 218296986 218817844 219375057 219973240 220600853 221233788 221845779 222420006 222956200
3139 222956200 223468380 223975964 224491863 225015354 225533199 226027622 226486664 226910095 227307739 227690792
3149 227690792 228061485 228408184 228708420 228939953 229093189 229177589 229219227 229248829 229287300 229335403 229372864
3160 229372864 229366856 229286079 229114037 228855762 228535938 228190041 227851162 227538891 227253418 226976395
3170 226976395 226680031 226337929 225935936 225475750 224971409 224440155 223893642 223334198 222759209 222169704
3180 222169704 221577435 221005096 220477428 220009136 219596233 219216728 218840523 218443222 218014393 217557774
3190 217557774 217081947 216590729 216077538 215529404 214937115 214303493 213646278 212991848 212363739 211771870
3200 211771870 211207829 210647659 210061398 209424362 208726635 207977047 207199879 206426353 205682411 204979057
3210 204979057 204309464 203654613 202994900 202321930 201642284 200971870 200323353 199695168 199068947 198418427
3220 198418427 197724133 196984425 196216145 195444736 194689617 193954620 193229237 192498436 191753941 191000519
3230 191000519 190254097 189533749 188855534 188229733 187662640 187158318 186717682 186335106 185996361 185682106
3240 185682106 185377369 185081978 184816933 184620972 184538689 184605465 184835682 185219135 185726032 186317081
3250 186317081 186954231 187610054 188272457 188946896 189653721 190422726 191284885 192263889 193370037 194598675
3260 194598675 195932121 197344818 198807507 200290890 201768379 203218632 204628525 205995255 207325954
3269 207325954 208633118 209927845 211213341 212481823 213716984 214900475 216020069 217075386 218079338
3278 218079338 219054031 220023060 221002731 221995926 222989540 223959389 224877892 225724010 226489601 227179756
3288 227179756 227807541 228385487 228920364 229413071 229863529 230277767 230669117 231052837 231435852 231806946
3298 231806946 232136879 232388783 232536392 232579803 232548618 232490005 232445755 232430840 232425709 232386456 232268600
3309 232268600 232050304 231742630 231381226 231005344 230638580 230281277 229920864 229549484 229178314 228835335
3319 228835335 228548794 228325310 228139114 227939224 227672749 227310524 226861248 226364689 225871811 225421772
3329 225421772 225030365 224693890 224400482 224142056 223914909 223712959 223520126 223310661 223060074 222760353
3339 222760353 222429523 222107086 221836681 221644516 221526089 221448135 221364803 221237812 221051292 220813255
3349 220813255 220546513 220275211 220015678 219774990 219554386 219354229 219174919 219014263 218864765 218713722
3359 218713722 218548641 218364220 218166370 217971363 217799511 217668533 217589684 217568245 217605915 217701149 217845516
3370 217845516 218019104 218189545 218318520 218375130 218348579 218253155 218121433 217988396 217875519 217783470 217697601
3381 217697601 217601147 217487411 217363644 217244473 217140579 217051773 216967564 216875420 216770515 216659222 216554852
3392 216554852 216469326 216404915 216353588 216301498 216237221 216156769 216063328 215962906 215858631 215748482 215627480
3403 215627480 215492611 215347099 215201397 215068836 214958496 214869099 214787121 214690819 214558792 214378891
3413 214378891 214152775 213894043 213621445 213350906 213091259 212845478 212614651 212401466 212209988 212040997
3423 212040997 211888542 211741066 211587391 211424847 211262360 211115303 210994015 210894318 210797386 210682526
3433 210682526 210544930 210407085 210313740 210309696 210411530 210590382 210778198 210897598 210900097 210792885 210638504
3444 210638504 210526714 210533619 210689392 210970402 211318226 211671772 211994667 212282867 212552795 212821198
3454 212821198 213090286 213348083 213581219 213789368 213991108 214216404 214492149 214829063 215218010 215636387
3464 215636387 216059170 216467209 216851387 217212200 217558975 217908859 218284073 218705387 219183941 219715157
3474 219715157 220281086 220860519 221440697 222021141 222605705 223188496 223746090 224245586 224668350 225032959
3484 225032959 225398636 225841808 226414433 227111645 227871361 228610191 229275398 229878025 230484066 231165543
3494 231165543 231943016 232758408 233499184 234061565 234415493 234629345 234838886 235178146 235713768 236419449
3504 236419449 237202225 237959194 238628693 239208241 239734859 240249252 240769634 241291161 241805420 242319870
3514 242319870 242860737 243455639 244108143 244784603 245421124 245949707 246326962 246551399 246662693 246727486
3524 246727486 246821232 247011108 247342415 247825546 248428478 249080315 249694157 250205822 250610542 250974236
3534 250974236 251402969 251979713 252700539 253452415 254053631 254344864 254280128 253965588 253616047 253452187
3544 253452187 253594646 254016895 254582577 255138111 255600643 255988998 256384411 256861897 257446194 258123283
3554 258123283 258890400 259789848 260881481 262157841 263459835 264469738 264817791 264265041 262862873
3563 262862873 260988903 259221611 258109951 257955246 258714428 260063648 261571751 262883911 263831482
3572 263831482 264439735 264867535 265329189 266028519 267102852 268564816 270252953 271830254 272871151
3581 272871151 273031750 272231979 270746861 269131927 267998066 267745247 268394890 269612274 270897732
3590 270897732 271832619 272246304 272231159 272032223 271905403 272031116 272507095 273379421 274650288 276240768
3600 276240768 277945957 279443150 280386238 280555496 279981270 278966293 277983952 277497845 277783127
3609 277783127 278820210 280292416 281682758 282444572 282211361 280988693 279247227 277834816 277678261
3618 277678261 279358063 282741146 286886921 290336704 291701431 290282288 286408939 281312084 276590557
3627 276590557 273547611 272725391 273837185 276066380 278520164 280592899 282102718 283223152 284320431
3636 284320431 285794830 287949200 290859909 294252415 297451324 299504108 299510860 297049561 292477837
3645 292477837 286908169 281811676 278424244 277255383 277953262 279580116 281123714 281961212 282053280
3654 282053280 281827202 281880093 282690125 284460640 287106781 290317326 293632832 296531353 298544617
3663 298544617 299399090 299120522 298018723 296520824 294928551 293246307 291207218 288503494 285088825
3672 285088825 281359921 278091240 276149521 276144333 278198948 281934967 286628952 291421185 295474415
3681 295474415 298067360 298678169 297105198 293598061 288901920 284121170 280403709 278565102 278829021
3690 278829021 280808392 283718548 286694469 289055138 290425549 290734062 290163708 289111805 288139477
3699 288139477 287850094 288668270 290591927 293064232 295098038 295656757 294136124 290701714 286288242
3708 286288242 282243176 279784927 279539032 281362362 284501266 287960033 290881271 292773018 293537674
3717 293537674 293359146 292555180 291473351 290449409 289797745 289787121 290577354 292126217 294110851
3726 294110851 295923939 296794701 296043758 293403854 289270992 284727612 281247444 280141373 281967964
3735 281967964 286204414 291389198 295717888 297823257 297341881 294967442 291968269 289450340 287792091
3744 287792091 286568146 284978352 282491894 279293880 276256084 274458942 274568405 276451015 279249611
3753 279249611 281855373 283480511 284000187 283896255 283881817 284456692 285646858 287038918 288039837
3762 288039837 288185997 287341442 285722294 283787556 282077160 281061459 281023483 281977978 283644371
3771 283644371 285504875 286962757 287562828 287178688 286064796 284730053 283689480 283227596 283304348
3780 283304348 283647957 283965664 284134541 284256248 284557858 285222855 286273594 287578659 288957672
3789 288957672 290289154 291529617 292635155 293461418 293745270 293212109 291751804 289537277 286988087
3798 286988087 284581337 282629623 281174679 280075092 279226723 278752003 279005661 280366268 282935219
3807 282935219 286345062 289821033 292479992 293701077 293353081 291760426 289454498 286888294 284295712
3816 284295712 281758003 279390736 277479591 276441708 276621685 278061504 280411739 283062458 285425434
3825 285425434 287195358 288428459 289394283 290300941 291078243 291361618 290693893 288820190 285894279
3834 285894279 282467365 279266891 276899853 275660801 275547848 276453304 278370514 281440487 285765610
3843 285765610 291081848 296514778 300637798 301907501 299326496 293017731 284387283 275732727 269426708
3852 269426708 267031937 268751316 273455467 279249897 284288406 287447052 288576088 288285027 287440720
3861 287440720 286673393 286127415 285534496 284507771 282860394 280772495 278735161 277326412 276951408
3870 276951408 277679195 279241428 281171532 282995090 284378147 285177097 285401402 285139866 284509068
3879 284509068 283642540 282699223 281851177 281231995 280872421 280677147 280482960 280183868 279849758 279751358
3889 279751358 280248642 281585255 283696957 286150017 288258610 289331112 288930702 287028999 283996944
3898 283996944 280460072 277097988 274472141 272928543 272575359 273313503 274892960 276979904 279222755
3907 279222755 281307087 282988853 284105473 284576569 284407406 283698406 282644405 281502495 280523338
3916 280523338 279870434 279572506 279540062 279640236 279781799 279953289 280188618 280490265 280772419 280876637
3926 280876637 280660706 280103645 279355164 278686237 278363819 278518982 279082832 279823895 280460339 280786324
3936 280786324 280748692 280444775 280053501 279739285 279576073 279523277 279461060 279266396 278890305 278394966
3946 278394966 277928028 277646370 277630367 277841988 278150635 278409863 278535709 278536949 278484859 278452873 278471203
3957 278471203 278527489 278598289 278678379 278778324 278896847 279001236 279040279 278983364 278850708 278701839 278588085
3968 278588085 278511257 278428192 278302383 278153801 278053474 278054161 278113976 278090267 277832260 277310429 276672802
3979 276672802 276160011 275925999 275905495 275852737 275541782 274974365 274398594 274086590 274029179 273827343
3989 273827343 272947426 271210117 269114094 267597752 267184830 266957226 264089088 254498291 234552822
3998 234552822 203061275 162453747
4000 162453747
##END=$$ End of the data block
