##TITLE=$$ Begin of the data block
##JCAMP-DX=5.00 $$ ACD/SpecManager v 10.08
##SPECTROMETER/DATA SYSTEM=16PC
##DATE=Mon Sep 02 17:11:02 2013
##DATA TYPE=INFRARED SPECTRUM
##DATA CLASS=XYDATA
##ORIGIN=
##OWNER=
##NPOINTS=3601
##FIRSTX=400.00000000
##LASTX=4000.00000000
##MAXX=4000.00000000
##MINX=400.00000000
##MAXY=41.26091385
##MINY=9.67653561
##XFACTOR=1.0000000000
##YFACTOR=0.000000100000000
##FIRSTY=20.71462440
##DELTAX=1.00000000
##XUNITS=1/CM
##YUNITS=TRANSMITTANCE
##XYDATA=(X++(Y..Y))
$$ plain form
400 207146244 263878021 309418602 339441986 354540405 358894196 357717209 354999542 352617035
408 352617035 350863838 349608231 349096565 349933128 352483864 356353188 360430031 363490944 364908905
417 364908905 364961090 364548645 364560585 365325203 366473351 367232704 366906357 365233459 362467270 359201889
427 359201889 356095467 353634949 352016869 351151085 350762787 350553665 350362587 350256615 350492210 351354294
437 351354294 352951736 355086479 357276535 358923569 359531784 358869057 357007713 354259415 351059837
446 351059837 347854958 345003510 342697296 340909081 339405098 337848778 335979233 333785133 331574326
455 331574326 329880753 329241867 329958611 331963425 334862366 338115883 341254196 344015923 346359711
464 346359711 348374825 350171623 351822701 353379135 354926720 356618462 358640251 361116066 364010963
$$ packed form
400B07146244N6731777M5540581L0023384J5098419M353791j176987k717667k382507
408C52617035j753197j255607n11666Q36563K550736L869324M076843L060913J417961
417C64908905N2185m12445J1940P64618J148148P59353l26347j672898k766189l265381
427C59201889l106422k460518j618080q65784l88298k09122j91078j05972K35595Q62084
437C51354294J597442K134743K190056J647034O08215o62727j861344k748298l199578
446C51059837l204879k851448k306214j788215j503983j556320j869545k194100k210807
455C31574326j693573o38886P16744K004814K898941L253517L138313K761727K343788
464C46359711K015114J796798J651078J556434J547585J691742K021789K475815K894897
$$ plain form
473 364010963 367102127 370052795 372558289 374481277 375890198 376974449 377891769 378651276 379117165
482 379117165 379135590 378694458 377995567 377370605 377080002 377122078 377184296 376784477 375529823 373346748
492 373346748 370548859 367708473 365405045 363987389 363462448 363550491 363858643 364083176 364147568 364224815
502 364224815 364633713 365647049 367278938 369140015 370439224 370166321 367419853 361770744 353519707
511 353519707 343733101 334023132 326139832 321511307 320883751 324168777 330526199 338637619 347068596
520 347068596 354611168 360511665 364537468 366889992 368017845 368411407 368451233 368353310 368203011 368037491
530 368037491 367920837 367970848 368326340 369075699 370188141 371487656 372693100 373520012 373804512 373597908
540 373597908 373177986 372959557 373327065 374457741 376214905 378167992 379742203 380438232 380028954
$$ packed form
473C64010963L091164K950668K505494J922988J408921J084251R17320P59507M65889
482C79117165J8425m41132o98891o24962k90603M2076O2218l99819j254654k183075
492C73346748k797889k840386k303428j417656n24941Q8043L08152K24533O4392P7247
502C64224815M08898J013336J631889J861077J299209k72903k746468n649109q251037
511C53519707r786606r709969p883300m628525o27556L285026O357422Q111420Q430977
520C47068596P542572N900497M025803K352524J127853L93562L9826r7923j50299j65520
530C68037491j16654N0011L55492P49359J112442J299515J205444Q26912K84500k06604
540C73597908m19922k18429L67508J130676J757164J953087J574211O96029m09278
$$ plain form
549 380028954 378646889 376723137 374806976 373344421 372511101 372166481 371937256 371385574 370182304
558 370182304 368215141 365601311 362617302 359594345 356831055 354550285 352898140 351961823 351776924
567 351776924 352317467 353474960 355048218 356758194 358294563 359379082 359828835 359598770 358792343
576 358792343 357637329 356434402 355492973 355066414 355301437 356206055 357641792 359344254 360975571
585 360975571 362206421 362812767 362753563 362192116 361435471 360804214 360484886 360435677 360401039 360036011
595 360036011 359084854 357523651 355591888 353693352 352213936 351346130 351010399 350912514 350712013 350220833
605 350220833 349532051 349009857 349134140 350267143 352452927 355355186 358372231 360884171 362512550
614 362512550 363265877 363504715 363750916 364445572 365773010 367618599 369648933 371450043 372653656
$$ packed form
549C80028954j382065j923752j916161j462555q33320l44620k29225n51682j203270
558C70182304j967163k613830k984009l022957k763290k280770j652145r36317j84899
567C51776924N40543J157493J573258J709976J536369J084519M49753k30065q06427
576C58792343j155014j202927r41429m26559K35023R04618J435737J702462J631317
585C60975571J230850O06346n9204n61447p56645o31257l19328m9209l4638l65028
595C60036011r51157j561203j931763j898536j479416q67806l35731r7885k00501m91180
605C50220833o88782n22194J24283J133003K185784K902259L017045K511940J628379
614C62512550P53327K38838K46201O94656J327438J845589K030334J801110J203613
$$ plain form
623 372653656 373020172 372485123 371186981 369469681 367834244 366818199 366822624 367954826 369967461
632 369967461 372337112 374458275 375866814 376394882 376196823 375647545 375166397 375041847 375320625 375801468
642 375801468 376133728 375985947 375214233 373948975 372545662 371411743 370791016 370620537 370536118 370017548
652 370017548 368584175 365937195 362002373 356913376 351005859 344852180 339271965 335214500 333464775
661 333464775 334271011 337110977 340799446 343962517 345669098 345869675 345371132 345342484 346630554
670 346630554 349287987 352581215 355446587 357094612 357394028 356838608 356173477 355954590 356308479
679 356308479 356987534 357612267 357901917 357759132 357210808 356306458 355063095 353461075 351429901 348782043
689 348782043 345140724 339973412 332806778 323568153 312861118 301963863 292469006 285706749
$$ packed form
623C72653656L66516n35049j298142j717300j635437j016045M425J132202K012635
632C69967461K369651K121163J408539N28068j98059n49278m81148j24550K78778M80843
642C75801468L32260j47781p71714j265258j403313j133919o20727j70479q4419n18570
652C70017548j433373k646980l934822n088997n907517o153679n580215m057465j749725
661C33464775Q06236K839966L688469L163071J706581K00577m98543k8648J288070
670C46630554K657433L293228K865372J648025K99416n55420o65131k18887L53889
679C56308479O79055O24733K89650j42785n48324r04350j243363j602020k031174k647858
689C48782043l641319n167312p166634r238625j0707035j0897255r494857o762257
$$ plain form
697 285706749 282250729 281785107 283414841 286238785 289851398 294487858 300748482 309087067 319378643
706 319378643 330811653 342146645 352175903 360125580 365814209 369539070 371811295 373109703
714 373109703 373763962 373972664 373881264 373634529 373366547 373154411 372985382 372776184 372433167 371916275
724 371916275 371264076 370568085 369913788 369327049 368753319 368078957 367179985 365974693 364458542 362710190
734 362710190 360866547 359072151 357414703 355868492 354268990 352341156 349784355 346392822 342164345
743 342164345 337345428 332375107 327734451 323754120 320461197 317542534 314454880 310647240 305805569
752 305805569 300011978 293748779 287744656 282734375 279237080 277441978 277227497 278276691 280210037
761 280210037 282669621 285332470 287881432 289985657 291328163 291677647 290967236 289330330 287068958
$$ packed form
697B85706749l456020m65622J629734K823944L612613M636460O260624Q338585J0291576
706C19378643J1433010J1334992J0029258P949677N688629L724861K272225J298408
714C73109703O54259K08702r1400k46735k67982k12136j69029k09198l43017n16892
724C71916275o52199o95991o54297n86739n73730o74362q98972j205292j516151j748352
734C62710190j843643j794396j657448j546211j599502j927834k556801l391533m228477
743C42164345m818917m970321m640656l980331l292923k918663l087654l807640m841671
752C05805569n793591o263199o004123n010281l497295j795102k14481J049194J933346
761B80210037K459584K662849K548962K104225J342506L49484p10411j636906k261372
$$ plain form
770 287068958 284562683 282158394 280085964 278426723 277134323 276088009 275154324 274237423 273313637
779 273313637 272446747 271783047 271522198 271866035 272957630 274830761 277394314 280461941 283817062
788 283817062 287285576 290781460 294305592 297900105 301585579 305316067 308974075 312406311 315479679
797 315479679 318128433 320375710 322328415 324155617 326062889 328259850 330918083 334116440 337792206
806 337792206 341724930 345580559 349012260 351782875 353850670 355369682 356598320 357755775 358898659
815 358898659 359878731 360403290 360168762 359005699 356974258 354379044 351707916 349522285 348337631
824 348337631 348518333 350206757 353296394 357454300 362193756 366980896 371350479 374994888 377800598
833 377800598 379824524 381226921 382190666 382859344 383313255 383582840 383683395 383649025 383545380 383458595
$$ packed form
770B87068958k506275k404289k072430j659241j292400j046314r33685r16901r23786
779B73313637q66890o63700k60849L43837J091595J873131K563553L067627L355121
788B83817062L468514L495884L524132L594513L685474L730488L658008L432236L073368
797C15479679K648754K247277J952705J827202J907272K196961K658233L198357L675766
806C37792206L932724L855629L431701K770615K067795J519012J228638J157455J142884
815C58898659R80072N24559k34528j163063k031441k595214k671128k185631j184654
824C48337631J80702J688424L089637M157906M739456M787140M369583L644409K805710
833C77800598K023926J402397R63745O68678M53911K69585J00555l4370j03645q6785
$$ plain form
843 383458595 383467255 383616829 383912315 384334183 384868507 385529633 386360664 387406464 388674622 390107384
853 390107384 391583672 392952042 394079170 394888687 395375900 395596008 395639725 395610542 395606499 395704765
863 395704765 395940247 396282959 396627541 396811104 396662178 396064987 395008049 393589668 391978531 390347061
873 390347061 388816757 387443047 386244774 385256996 384573021 384348450 384761391 385945435 387925224
882 387925224 390581131 393657532 396814003 399703903 402056541 403739624 404779854 405337334 405642090
891 405642090 405915604 406307068 406862793 407536316 408227997 408831635 409276428 409549294 409697609 409813385
901 409813385 410000687 410331039 410802574 411319466 411712532 411801300 411478462 410777245 409882202 409066658
911 409066658 408580132 408533478 408842812 409263420 409505501 409377060 408887024 408254967 407817421 407873116
$$ packed form
843C83458595Q660J49574K95486M21868N34324O61126Q31031J045800J268158J432762
853C90107384J476288J368370J127128Q09517M87213K20108M3717k9183m043R8266
863C95704765K35482L42712L44582J83563j48926n97191j056938j418381j611137j631470
873C90347061j530304j373710j198273r87778o83975k24571M12941J184044J979789
882C87925224K655907L076401L156471K889900K352638J683083J040230N57480L04756
891D05642090K73514L91464N55725O73523O91681O03638M44793K72866J48315J15776
901D09813385J87302L30352M71535N16892L93066Q8768l22838p01217q95043q15544
911D09066658m86526m6654L09334M20608K42081j28441m90036o32057m37546N5695
$$ plain form
921 407873116 408539085 409686127 410987244 412055740 412609138 412580605 412128372 411544189 411113930 410997314
931 410997314 411182327 411519737 411806908 411869240 411606445 410997772 410086975 408967857 407774048 406661873
941 406661873 405771255 405170517 404812927 404534836 404112816 403356361 402192421 400696220 399054527 397482605
951 397482605 396143074 395105782 394362297 393875122 393626709 393640556 393966179 394642525 395661736 396949768
961 396949768 398372421 399762955 400961914 401859398 402424850 402714195 402849693 402975807 403207359 403589172
971 403589172 404084778 404594917 404999619 405202827 405164757 404908295 404500885 404018402 403506165 402954178
981 402954178 402300072 401461716 400389023 399109917 397746391 396486359 395521049 394974442 394855919
990 394855919 395056496 395385590 395627441 395593796 395158234 394271584 392965546 391348763 389589043 387878838
$$ packed form
921D07873116O65969J147042J301117J068496N53398k8533m52233n84183m30259j16616
931D10997314J85013L37410K87171O2332k62795o08673r10797j119118j193809j112175
941D06661873q90618o00738l57590k78091m22020p56455j163940j496201j641693j571922
951C97482605j339531j037292p43485m87175k48413J3847L25623O76346J019211J288032
961C96949768J422653J390534J198959Q97484N65452K89345J35498J26114K31552L81813
971D03589172M95606N10139M04702K03208l8070k56462m07410m82483n12237n51987
981D02954178o54106q38356j072693j279106j363526j260032r65310n46607j18523
990C94855919K00577L29094K41851l3645m35562q86650j306038j616783j759720j710205
$$ plain form
1000 387878838 386382942 385188637 384280701 383558464 382891083 382183495 381416779 380643120 379936676 379330254
1010 379330254 378773308 378133125 377238083 375940018 374167061 371945496 369385757 366640129 363849144
1019 363849144 361094475 358375587 355624237 352760201 349776573 346820564 344230423 342492523 342116356
1028 342116356 343462524 346590996 351195641 356662407 362234077 367220535 371172295 373957329 375722961
1037 375722961 376775322 377435417 377931595 378358269 378698692 378883247 378849258 378577309 378098488 377478790
1047 377478790 376793861 376104431 375439606 374790688 374116440 373359222 372468300 371419678 370225754 368924713
1057 368924713 367555656 366128502 364605255 362904472 360927887 358596573 355878868 352794685 349392586
1066 349392586 345712433 341749763 337440338 332670479 327308426 321242523 314408913 306798935 298445377
$$ packed form
1000C87878838j495896j194305r07936p22237o67381p07588p66716p73659p06444o06422
1010C79330254n56946o40183q95042j298065j772957k221565k559739k745628k790985
1019C63849144k754669k718888k751350k864036k983628k956009k590141j737900l76167
1028C42116356J346168L128472M604645N466766N571670M986458L951760K785034J765632
1037C75722961J052361O60095M96178M26674L40423J84555l3989k71949m78821o19698
1047C77478790o84929o89430o64825o48918o74248p57218q90922j048622j193924j301041
1057C68924713j369057j427154j523247j700783j976585k331314k717705l084183l402099
1066C49392586l680153l962670m309425m769859n362053o065903o833610p609978q353558
$$ plain form
1075 298445377 289397717 279701347 269395638 258534107 247219257 235633144 224045715 212791748
1083 212791748 202225075 192668171 184376907 177527180 172216587 168464394 166202602 165267353 165411148
1092 165411148 166356831 167888222 169946842 172686863 176451015 181661072 188661137 197571087 208207684
1101 208207684 220100079 232588348 244968300 256634254 267184353 276467571 284569130 291742020
1109 291742020 298302479 304515915 310505562 316213226 321428452 325877609 329341011 331755829 333264580
1118 333264580 334193382 334969330 336009598 337620811 339940834 342932968 346426544 350180702 353948288
1127 353948288 357520905 360748901 363537674 365830803 367590179 368783875 369388046 369400177 368856926
1136 368856926 367842751 366479034 364894905 363193436 361435738 359657249 357910881 356309624 355032959
$$ packed form
1075B98445377r047660r696370j0305709j0861531j1314850j1586113j1587429j1253967
1083B12791748j0566673r556904q291264o849727n310593l752193k261792r35249J43795
1092A65411148R45683J531391K058620K740021L764152N210057P000065Q909950J0636597
1101B08207684J1892395J2488269J2379952J1665954J0550099R283218Q101559P172890
1109B91742020O560459O213436N989647N707664N215226M449157L463402K414818J508751
1118C33264580R28802P75948J040268J611213K320023K992134L493576L754158L767586
1127C53948288L572617L227996K788773K293129J759376J193696O04171J2131n43251
1136C68856926j014175j363717j584129j701469j757698j778489j746368j601257j276665
$$ plain form
1145 355032959 354279709 354181595 354723740 355720558 356871071 357869682 358518486 358783302 358770676 358646965
1155 358646965 358548584 358530159 358565559 358584824 358516502 358311539 357946358 357417831 356739845 355945435 355087242
1166 355087242 354231300 353443871 352773476 352229652 351758652 351223221 350405693 349056664 346997643 344246216
1176 344246216 341100502 338115807 335951233 335132866 335843849 337847061 340586357 343415871 345838966
1185 345838966 347639885 348859253 349656067 350154762 350365448 350205994 349583359 348466301 346899681
1194 346899681 344961395 342700462 340100441 337087364 333566818 329463387 324739456 319390697 313428230
1203 313428230 306858063 299663086 291788139 283132267 273556786 262915535 251104794 238117714
1211 238117714 224084225 209285736 194143791 179191742 165035400 152298985 141554813 133239393
$$ packed form
1145C55032959p53250r8114N42145R96818J150513R98611O48804K64816j2626j23711
1155C58646965r8381j8425L5400J9265o8322k04963l65181n28527o77986p94410q58193
1166C55087242q55942p87429o70395n43824m71000n35431q17528j349029k059021k751427
1176C44246216l145714k984695k164574q18367P10983K003212K739296K829514K423095
1185C45838966J800919J219368P96814M98695K10686j59454o22635j117058j566620
1194C46899681j938286k260933k600021l013077l520546m103431m723931n348759n962467
1203C13428230o570167p194977p874947q655872r575481j0641251j1810741j2987080
1211B38117714j4033489j4798489j5141945j4952049j4156342j2736415j0744172q315420
$$ plain form
1219 133239393 127578163 124549246 123908949 125276079 128245535 132485828 137786551 144049253 151241751
1228 151241751 159348583 168340721 178167706 188760548 200027790 211841335 224017544 236310024
1236 236310024 248423347 260052090 270932255 280891571 289881306 297977047 305346813 312193813
1244 312193813 318694096 324950447 330979042 336730080 342125015 347087936 351555748 355469513 358764229
1253 358764229 361373940 363251762 364387245 364794960 364469986 363334656 361220398 357918968 353297424
1262 353297424 347421951 340621338 333443108 326516953 320394630 315444584 311846104 309657593 308887539
1271 308887539 309504280 311368351 314141331 317248402 319948463 321495514 321317711 319127388 314918709
1280 314918709 308877735 301278515 292432384 282712860 272617683 262803726 254045296 247116241
$$ packed form
1219A33239393n661230l028917o40297J367130K969456M240293N300723O262702P192498
1228A51241751Q106832Q992138R826985J0592842J1267242J1813545J2176209J2292480
1236B36310024J2113323J1628743J0880165R959316Q989735Q095741P369766O847000
1244C12193813O500283O256351O028595N751038N394935M962921M467812L913765L294716
1253C58764229K609711J877822J135483M07715l24974j135330k114258l301430m621544
1262C53297424n875473o800613p178230o926155o122323m950046l598480k188511p70054
1271C08887539O16741J864071K772980L107071K700061J547051j77803k190323m208679
1280C14918709o040974p599220q846131r719524j0095177r813957q758430o929055
$$ plain form
1288 247116241 242637463 240950375 242057648 245639038 251123981 257794838 264899292 271760445 277871323
1297 277871323 282954388 286968727 290052719 292416115 294212990 295438824 295888863 295198212 292959042
1306 292959042 288889198 283007545 275760880 268048401 261110973 256291027 254719372 257022209 263148994
1315 263148994 272383060 283535614 295254269 306340008 315975685 323810616 329906731 334593887
1323 334593887 338298569 341400337 344145813 346627884 348816299 350616455 351922226 352638435 352663956
1332 352663956 351860771 350054131 347103462 343044624 338241692 333452263 329724388 328121185 329365959
1341 329365959 333565674 340147400 348047104 356064224 363218040 368956985 373162193 376000443 377741699
1350 377741699 378639679 378903313 378713417 378222580 377507858 376503868 374972153 372548904 368865814
$$ packed form
1288B47116241m478778j687088J107273L581390N484943O670857P104454O861153O110878
1297B77871323N083065M014339L083992K363396J796875J225834M50039o90651k239170
1306B92959042m069844n881653p246665p712479o937428m819946j571655K302837O126785
1315B63148994R234066J1152554J1718655J1085739R635677P834931O096115M687156
1323C34593887L704682L101768K745476K482071K188415J800156J305771P16209K5521
1332C52663956q03185j806640k950669m058838m802932m789429l727875j603203J244774
1341C29365959M199715O581726P899704Q017120P153816N738945M205208K838250J741256
1350C77741699Q97980K63634j89896m90837p14722j003990j531715k423249l683090
$$ plain form
1359 368865814 363697701 357080574 349362946 341180077 333360825 326779060 322170830 319953690 320104980
1368 320104980 322153244 325303917 328659859 331451378 333186493 333679352 332979965 331272964 328805313
1377 328805313 325858116 322737465 319743023 317110882 314957199 313268852 311958256 310954666 310276413
1386 310276413 310036869 310379829 311385174 312999878 315031853 317204437 319240875 320937691 322200508
1395 322200508 323036308 323511696 323698578 323629646 323283043 322601967 321535263 320073013 318251038 316121540
1405 316121540 313717003 311040211 308098030 304954109 301752491 298673286 295831566 293181572 290502987
1414 290502987 287501698 283987942 280034256 276019592 272524948 270124607 269171982 269675064 271307831
1423 271307831 273544426 275854588 277882919 279543686 280991402 282475586 284141598 285878162 287303848
$$ packed form
1359C68865814n168113o617127p717628q182869p819252o581765m608230k217140J51290
1368C20104980K048264L150673L355942K791519J735115M92859o99387j707001k467651
1377C28805313k947197l120651k994442k632141k153683j688347j310596j003590o78253
1386C10276413k39544L42960J005345J614704K031975K172584K036438J696816J262817
1395C22200508Q35800M75388J86882o8932l46603o81076j066704j462250j821975k129498
1405C16121540k404537k676792k942181l143921l201618l079205k841720k649994k678585
1414B90502987l001289l513756l953686m014664l494644k400341r52625N03082J632767
1423B71307831K236595K310162K028331J660767J447716J484184J666012J736564J425686
$$ plain form
1432 287303848 287921200 287368889 285632477 283085995 280331097 277923145 276142101 274928837 273994312
1441 273994312 273001842 271700039 269952469 267710743 265013065 262040043 259161491 256871357 255571175
1450 255571175 255300655 255604477 255682411 254791508 252682304 249788189 247020397 245269547 244914494
1459 244914494 245644341 246703949 247401485 247551422 247577343 248221569 250057926 253114986 256831703
1468 256831703 260354061 262978821 264484253 265175896 265654125 266462784 267821636 269574375 271349735
1477 271349735 272819920 273901825 274795322 275852089 277360306 279368896 281647243 283798542 285467606
1486 285467606 286537151 287218666 287989254 289401245 291843948 295368710 299669266 304250984 308727417
1495 308727417 313097782 317829990 323647118 331070633 339947395 349251556 357349663 362664642 364424629
$$ packed form
1432B87303848O17352n52311j736412k546482k754898k407952j781044j213264r34525
1441B73994312r92470j301803j747570k241726k697678k973022k878552k290134j300182
1450B55571175k70520L03822P7934q90903k109204k894115k767792j750850l55053
1459B44914494P29847J059608O97536J49937K5921O44226J836357L057060L716717
1468B56831703L522358K624760J505432O91643M78229Q08659J358852J752739J775360
1477B71349735J470185J081905Q93497J056767J508217K008590K278347K151299J669064
1486B85467606J069545O81515P70588J411991K442703L524762M300556M581718M476433
1495C08727417M370365M732208N817128P423515Q876762R304161Q098107N314979J759987
$$ plain form
1504 364424629 363083954 360163116 357570610 356769753 358233719 361444435 365357590 369003487 371866989
1513 371866989 373895378 375245590 376021004 376189003 375684967 374563065 373049049 371462822 370096436
1522 370096436 369148026 368734093 368912506 369647713 370738945 371814728 372482185 372588348 372412224 372590981
1532 372590981 373743706 375985107 378655090 380497284 380243340 377293243 372092285 365979767 360594559
1541 360594559 357168503 356072464 356804390 358357964 359737701 360372620 360281792 359972038 360137177
1550 360137177 361269608 363321571 365561752 366738548 365552292 361273880 354220924 345812912 338105507
1559 338105507 332973557 331322250 332716789 335620842 338126297 338808632 337293472 334281387 331060982
1568 331060982 328786621 327896194 327947731 327925148 326825638 324205437 320397034 316303368 312904892
$$ packed form
1504C64424629j340675k920838k592506q00857J463966L210716L913155L645897K863502
1513C71866989K028389J350212P75414J67999n04036j121902j514016j586227j366386
1522C70096436r48410m13933J78413P35207J091232J075783O67457J06163j76124J78757
1532C72590981J152725K241401K669983J842194k53944k950097n200958o112518n385208
1541C60594559l426056j096039P31926J553574J379737O34919r0828l09754J65139
1550C60137177J132431K051963K240181J176796j186256m278412p052956q408012p707405
1559C38105507n131950j651307J394539K904053K505455O82335j515160l012085l220405
1568C31060982k274361q90427N1537k2583j099510k620201l808403m093666l398476
$$ plain form
1577 312904892 310768738 309831715 309548988 309285507 308687344 307815628 306996117 306523495 306434288 306483402
1587 306483402 306300926 305586586 304204597 302142677 299416122 296025658 292012901 287556610 283010292
1596 283010292 278822269 275374355 272833958 271102390 269869499 268726215 267276134 265223141 262444687
1605 262444687 259048519 255373306 251883488 248958950 246668663 244674034 242358208 239145107 234834003
1614 234834003 229743118 224562931 220000477 216428642 213742390 211485062 209137783 206384544 203214512
1623 203214512 199850407 196596718 193710957 191339417 189487019 187983036 186449184 184331017 181042385
1632 181042385 176199989 169836311 162458286 154885216 147925777 142052879 137241211 133047037 128880091
1641 128880091 124326696 119370804 114420166 110141668 107191191 105963564 106471901 108410807 111369619
$$ packed form
1577C12904892k136154r37023k82727k63481n98163q71716q19511m72622q9207M9114
1587C06483402j82476p14340j381989k061920k726555l390464m012757m456291m546318
1596B83010292m188023l447914k540397j731568j232891j143284j450081k052993k778454
1605B62444687l396168l675213l489818k924538k290287j994629k315826l213101m311104
1614B34834003n090885n180187m562454l571835k686252k257328k347279k753239l170032
1623B03214512l364105l253689k885761k371540j852398j503983j533852k118167l288632
1632A81042385m842396o363678p378025p573070o959439n872898m811668m194174m166946
1641A28880091m553395m955892m950638m278498k950477j227627N08337J938906K958812
$$ plain form
1650 111369619 115086279 119597559 125186710 132136488 140420780 149525499 158534889 166470203 172705078
1659 172705078 177219372 180538521 183390770 186291828 189308071 192128277 194373341 195915546 196987209
1668 196987209 198014164 199309082 200860214 202379379 203579140 204473228 205459919 207093124 209666309
1677 209666309 212884197 215859833 217479324 216938095 214139824 209726830 204731274 200053883 196058598
1686 196058598 192477703 188625374 183756847 177368259 169320393 159801102 149224730 138154354
1694 138154354 127262630 117284384 108913355 102652416 98685627 96853685 96765356 97999706 100302486
1703 100302486 103683519 108376284 114683046 122773199 132505569 143329353 154292536 164166317
1711 164166317 171668320 175739384 175798054 171888809 164662609 155190506 144678593 134195471 124516497
$$ packed form
1650A11369619L716660M511280N589151O949778Q284292R104719R009390P935314O234875
1659A72705078M514294L319149K852249K901058L016243K820206K245064J542205J071663
1668A96987209J026955J294918J551132J519165J199761Q94088R86691J633205K573185
1677B09666309L217888K975636J619491n41229k798271m412994m995556m677391l995285
1686A96058598l580895l852329m868527o388588q047866r519291j0576372j1070376
1694A38154354j0891724r978246q371029o260939l966789j831942q8329J234350K302780
1703A00302486L381033M692765O306762Q090153R732370J0823784J0963183R873781
1711A64166317P502003M071064N8670l909245p226200r472103j0511913j0483122r678974
$$ plain form
1720 124516497 116130714 109372549 104579411 102166128 102559204 106019106 112456312 121361942 131919136
1729 131919136 143261814 154753675 166139870 177490368 188974247 200606194 212123585 223071899
1737 223071899 233042088 241905899 249893990 257460613 265011845 272659683 280146961 286984196 292716961
1746 292716961 297174416 300569668 303412819 306295261 309658260 313651218 318126202 322747726 327151108
1755 327151108 331075668 334425621 337256622 339720230 342009583 344327698 346869392 349785042 353109245
1764 353109245 356680069 360111732 362880936 364526901 364883118 364210434 363135834 362404137 362567024
1773 362567024 363772926 365763626 368056488 370185852 371868362 373029251 373737183 374136963 374432907
1782 374432907 374892311 375795937 377303505 379296722 381327667 382762794 383089561 382220459 380599060
$$ packed form
1720A24516497q385783o758165m793138k413283L93076L459902O437206Q905630J0557194
1729A31919136J1342678J1491861J1386195J1350498J1483879J1631947J1517391J0948314
1737B23071899R970189Q863811P988091P566623P551232P647838P487278O837235N732765
1746B92716961M457455L395252K843151K882442L362999L992958M474984M621524M403382
1755C27151108L924560L349953K831001K463608K289353K318115K541694K915650L324203
1764C53109245L570824L431663K769204J645965L56217o72684j074600p31697J62887
1773C62567024J205902J990700K292862K129364J682510J160889P07932L99780K95944
1782C74432907M59404R03626J507568J993217K030945J435127L26767q69102j621399
$$ plain form
1791 380599060 379017296 378228951 378576546 379842834 381403122 382574997 382960892 382603073 381897888
1800 381897888 381352882 381332893 381921043 382931747 384038277 384933777 385453148 385613441 385568924 385513420
1810 385513420 385581245 385799103 386110954 386452827 386821632 387284050 387917366 388730202 389627495 390455513
1820 390455513 391093063 391516495 391782608 391944695 391975136 391774330 391269341 390526352 389774513 389300003
1830 389300003 389276695 389663544 390257797 390875168 391517067 392378540 393666992 395349503 397028313 398067436
1840 398067436 397926292 396498985 394237099 391961861 390470238 390163879 390907326 392173386 393359756
1849 393359756 394081001 394284096 394165878 393986473 393908501 393949089 394039955 394130554 394259796 394549294 395126305
1860 395126305 396019058 397085228 398020096 398458405 398134689 397027130 395403671 393729897 392472610
$$ packed form
1791C80599060j581764p88345L47595J266288J560288J171875L85895l57819p05185
1800C81897888n45006j9989N88150J010704J106530Q95500N19371J60293m4517n5504
1810C85513420O7825K17858L11851L41873L68805M62418O33316Q12836Q97293Q28018
1820C90455513O37550M23432K66113J62087L0441k00806n04989p42989p51839m74510
1830C89300003k3308L86849N94253O17371O41899Q61473J288452J682511J678810J039123
1840C98067436j41144j427307k261886k275238j491623l06359P43447J266060J186370
1849C93359756P21245K03095j18218j79405p7972M0588R0866R0599J29242K89498N77011
1860C95126305Q92753J066170R34868M38309l23716j107559j623459j673774j257287
$$ plain form
1869 392472610 391897278 391968307 392405777 392858887 393088417 393054657 392875481 392704773 392628098 392637749 392684822
1880 392684822 392744102 392831955 392965355 393108368 393162842 393023605 392656898 392138710 391616974 391221504
1890 391221504 390990143 390864372 390755653 390626221 390518684 390511856 390641975 390855827 391037598 391091728
1900 391091728 391014824 390899391 390862274 390952148 391107750 391201401 391137733 390933990 390721855 390664520 390848389
1911 390848389 391222038 391625099 391883278 391906662 391725044 391448822 391187439 390987816 390830688 390676918
1921 390676918 390524330 390428467 390471268 390701141 391085815 391509666 391820107 391896095 391704330 391315498
1931 391315498 390876045 390549469 390451584 390602798 390915031 391219978 391330490 391115913 390559616 389772644
1941 389772644 388952560 388303757 387954636 387910881 388066940 388264809 388370209 388324394 388152390 387928429
$$ packed form
1869C92472610n75332P1029M37470M53110K29530l3760j79176j70708p6675R651M7073
1880C92684822N9280Q7853J33400J43013N4474j39237l66707n18188n21736l95470
1890C91221504k31361j25771j08719j29432j07537o828J30119K13852J81771N4130
1900C91091728p6904j15433l7117Q9874J55602R3651o3668k03743k12135n7335J83869
1911C90848389L73649M03061K58179K3384j81618k76222k61383j99623j57128j53770
1921C90676918j52588r5863M2801K29873L84674M23851L10441P5988j91765l88832
1931C91315498m39453l26576r7885J51214L12233L04947J10512k14577n56297p86972
1941C89772644q20084o48803l49121m3755J56059J97869J05400m5815j72004k23961
$$ plain form
1951 387928429 387727013 387587395 387507896 387466202 387447014 387456932 387517776 387644768 387825813 388016319 388154449
1962 388154449 388189507 388106880 387936325 387736893 387567902 387461243 387410583 387383080 387346764 387295113 387254562
1973 387254562 387268906 387368813 387547531 387756310 387927132 388009796 388004799 387970810 388001099 388176003 388515396
1984 388515396 388952942 389349861 389545059 389424095 388975639 388309288 387622223 387126617 386967163 387165756
1994 387165756 387616882 388135834 388535957 388698921 388609238 388342209 388017159 387742310 387575760 387516251
2004 387516251 387520599 387534828 387520142 387465515 387382088 387287369 387190247 387085609 386961823 386814651 386657753
2015 386657753 386519928 386428909 386390877 386381798 386357117 386278954 386142693 385984192 385861092 385816193 385846748
2026 385846748 385900002 385900154 385791702 385573540 385302429 385064659 384931641 384926338 385015068 385128250 385194817
$$ packed form
1951C87928429k01416j39618p9499m1694j9188R918O0844J26992J81045J90506J38130
1962C88154449L5058q2627j70555j99432j68991j06659n0660k7503l6316n1651m0551
1973C87254562J4344R9907J78718K08779J70822Q2664m997l3989L0289J74904L39393
1984C88515396M37546L96919J95198j20964m48456o66351o87065m95606j59454J98593
1994C87165756M51126N18952M00123J62964q9683k67029l25050k74849j66550n9509
2004C87516251M348J4229j4686n4627q3427r4719r7122j04638j23786j47172j56898
2015C86657753j37825r1019l8032r079k4681p8163j36261j58501j23100m4899L0555
2026C85846748N3254J52j08452k18162k71111k37770j33018n303Q8730J13182O6567
$$ plain form
2037 385194817 385171356 385054474 384874573 384678802 384512787 384406548 384367943 384381943 384414558 384423561 384372215
2048 384372215 384242783 384044991 383815346 383605156 383462219 383413086 383451500 383538513 383614540 383618889 383511162
2059 383511162 383286476 382979660 382654495 382381859 382214165 382165413 382205582 382273979 382305450 382258911 382135086
2070 382135086 381973343 381829338 381743774 381720009 381721535 381693344 381595459 381428986 381240311 381098709 381059875
2081 381059875 381134071 381278114 381412697 381459007 381373825 381167259 380897713 380647888 380493088 380476837 380597763
2092 380597763 380812378 381049881 381234055 381306610 381245232 381070747 380840187 380627251 380496674 380482178
2102 380482178 380574455 380725708 380866928 380932350 380882759 380719795 380485611 380248146 380076942 380018044 380077209
2113 380077209 380219421 380383339 380505333 380543060 380489044 380369377 380231018 380121689 380071297 380080833 380121574
$$ packed form
2037C85194817k3461j16882j79901j95771j66015j06239l8605J4000L2615R003n1346
2048C84372215j29432j97792k29645k10190j42937m9133L8414Q7013P6027M349j07727
2059C83511162k24686l06816l25165k72636j67694m8752M0169O8397L1471m6539j23825
2070C82135086j61743j44005q5564k3765J526k8191r7885j66473j88675j41602l8834
2081C81059875P4196J44043J34583M6310q5182k06566k69546k49825j54800j6251J20926
2092C80597763K14615K37503J84174P2555o1378j74485k30560k12936j30577j4496
2102C80482178R2277J51253J41220O5422m9591j62964k34184k37465j71204n8898N9165
2113C80077209J42212J63918J21994L7727n4016j19667j38359j09329n0392R536M0741
$$ plain form
2124 380121574 380146294 380107040 379975929 379759941 379501572 379265213 379111099 379069519 379126129 379227104 379301605
2135 379301605 379292450 379180374 378991051 378782387 378618469 378544426 378570213 378672180 378806992 378931198 379016647
2146 379016647 379056435 379061127 379049530 379039497 379040947 379052925 379063988 379054108 378999901 378883820 378705025 378486900
2158 378486900 378275566 378125839 378078308 378137665 378264198 378384514 378419495 378317299 378075180 377742233
2168 377742233 377399254 377127419 376978226 376956406 377022209 377109489 377151756 377106972 376969757 376770172 376559105
2179 376559105 376386070 376281166 376246147 376257591 376278839 376275673 376227798 376135063 376017303 375908012 375843811
2190 375843811 375849533 375925980 376043053 376148148 376186371 376127281 375982819 375805435 375665207 375615158 375665169
2201 375665169 375777130 375884819 375925827 375868874 375723419 375527687 375328484 375160751 375039215 374959564
$$ packed form
2124C80121574K4720l9254j31111k15988k58369k36359j54114m1580N6610J00975P4501
2135C79301605r155j12076j89323k08664j63918p4043K5787J01967J34812J24206Q5449
2146C79016647L9788M692j1597j0033J450J1978J1063r880n4207j16081j78795k18125
2158C78486900k11334j49727m7531N9357J26533J20316L4981j02196k42119l32947
2168C77742233l42979k71835j49193k1820O5803Q7280M2267m4784j37215j99585k11067
2179C76559105j73035j04904l5019J1444K1248l166m7875r2735j17760j09291o4201
2190C75843811N722P6447J17073J05095L8223n9090j44462j77384j40228n0049N0011
2201C75665169J11961J07689M1008n6953j45455j95732j99203j67733j21536p9651
$$ plain form
2211 374959564 374904976 374853783 374785004 374684448 374550972 374400749 374264259 374175186 374153290 374191132 374253197
2222 374253197 374289474 374259071 374150047 373985329 373810654 373671455 373591003 373561897 373554039 373533096 373478699
2233 373478699 373392372 373292770 373203278 373140640 373108978 373101540 373106003 373108253 373095398 373058624 372996025 372917099
2245 372917099 372842522 372797623 372801018 372854767 372941399 373031578 373096428 373118744 373094521 373028641 372928658 372802353
2257 372802353 372661705 372524872 372412949 372337875 372291222 372241402 372146378 371975937 371731186 371448441 371183624
2268 371183624 370985069 370869102 370811844 370761375 370663300 370489044 370253601 370015526 369858742 369861450 370063553
2279 370063553 370447845 370942383 371446152 371866646 372151718 372302094 372359467 372379723 372407494 372461281 372535477
2290 372535477 372609520 372660103 372671852 372646790 372611732 372619972 372739601 373029747 373514404 374167366 374920006
$$ packed form
2211C74959564n4588n1193o8779j00556j33476j50223j36490q9073k1896L7842O2065
2222C74253197L6277l0403j09024j64718j74675j39199q0452k9106p858k0943n4397
2233C73478699q6327r9602q9492o2638l1662p438M463K250j2855l6774o2599p8926
2245C72917099p4577m4899L395N3749Q6632R0179O4850K2316k4223o5880r9983j26305
2257C72802353j40648j36833j11923p5074m6653m9820r5024j70441k44751k82745k64817
2268C71183624j98555j15967n7258n0469r8075j74256k35443k38075j56784K708K02103
2279C70063553L84292M94538N03769M20494K85072J50376N7373K0256K7771N3787P4196
2290C72535477P4043N0583J1749k5062l5058Q240J19629K90146M84657O52962P52640
$$ plain form
2301 374920006 375685768 376386566 376966705 377389488 377632828 377696457 377623405 377519684 377546005 377870178
2311 377870178 378593674 379689102 380983086 382198944 383042564 383297119 382893066 381931229 380654221
2320 380654221 379368401 378334923 377662315 377250099 376827011 376084480 374851074 373209724 371476860
2329 371476860 370043068 369161491 368817787 368761139 368664970 368286324 367498741 366179771 364076538 360828667
2339 360828667 356232605 350635757 345189896 341699638 342014847 347203484 356928978 369393005 381922531
2348 381922531 391931725 397794113 399230347 397097969 392785187 387571144 382253799 377131538
2356 377131538 372215309 367463188 362894363 358571129 354532776 350769157 347258110 344022789 341152458
2365 341152458 338765411 336944618 335695267 334947968 334601364 334564629 334780579 335224571 335897179 336821861
$$ packed form
2301C74920006P65762P00798N80139M22783K43340O3629p3052j03721K6321L24173
2311C77870178P23496J095428J293984J215858Q43620K54555m04053r61837j277008
2320C80654221j285820j033478o72608m12216m23088p42531j233406j641350j732864
2329C71476860j433792q81577l43704n6648r6169l78646p87583j318970k103233l247871
2339C60828667m596062n596848n445861l490258L15209N188637R725494J2464027J2529526
2348C81922531J0009194N862388J436234k132378m312782n214043n317345n122261
2356C77131538m916229m752121m568825m323234m038353l763619l511047l235321k870331
2365C41152458k387047j820793j249351p47299l46604l6735K15950M43992O72608R24682
$$ plain form
2375 336821861 338041573 339603615 341527557 343770676 346216698 348700027 351056824 353174057 355010109
2384 355010109 356579781 357919655 359058495 360008240 360771370 361352806 361762886 362015228 362125320
2393 362125320 362117996 362036743 361943741 361904182 361957741 362096596 362265549 362387695 362403297 362299728 362115707
2404 362115707 361919365 361774521 361714630 361735916 361809502 361900444 361982155 362039680 362065163 362052116 361994400
2415 361994400 361890411 361747780 361583748 361419106 361269836 361140556 361025352 360914192 360800514 360685158
2425 360685158 360572662 360464783 360354462 360227394 360069084 359875259 359658394 359445686 359270554 359159737
2435 359159737 359122810 359146881 359199066 359234695 359210358 359097633 358893852 358624649 358337250 358084145 357905617
2446 357905617 357815857 357801895 357831802 357870216 357892303 357892380 357883797 357892456 357945747 358058243 358220406 358393784
$$ packed form
2375C36821861J219712J562042J923942K243119K446022K483329K356797K117233J836052
2384C55010109J569672J339874J138840R49745P63130N81436M10080K52342J10092
2393C62125320p324q1253r3002l9559N3559J38855J68953J22146J5602j03569j84021
2404C62115707j96342j44844n9891K1286P3586R0942Q1711N7525K5483j3047n7716
2415C61994400j03989j42631j64032j64642j49270j29280j15204j11160j13678j15356
2425C60685158j12496j07879j10321j27068j58310j93825k16865k12708j75132j10817
2435C59159737l6927K4071N2185L5629k4337j12725k03781k69203k87399k53105j78528
2446C57905617q9760j3962K9907L8414K2087P7q583Q659N3291J12496J62163J73378
$$ plain form
2458 358393784 358518219 358533211 358404732 358146935 357823029 357522736 357323990 357256813 357290421 357348137 357345390
2469 357345390 357228470 356996155 356694260 356389313 356136284 355958405 355843735 355759583 355670700 355554161
2479 355554161 355403557 355225677 355033455 354841309 354661827 354505043 354375229 354266548 354160309 354028015
2489 354028015 353842125 353591652 353293228 352991409 352742195 352588921 352540207 352562523 352593689 352569847 352452583
2500 352452583 352243690 351981201 351721191 351516266 351400185 351381493 351446075 351562614 351689796 351784897
2510 351784897 351813393 351760445 351635933 351472282 351311455 351187820 351114197 351077614 351046982 350988770 350883446
2521 350883446 350735931 350575180 350444565 350385132 350418549 350535698 350697594 350847511 350931854 350919724 350812912
2532 350812912 350641556 350449028 350274086 350139771 350051498 350003166 349984131 349983788 349992485 350002594 350011253 350022736
$$ packed form
2458C58393784J24435J4992j28479k57797l23906l00293j98746o7177L3608N7716k747
2469C57345390j16920k32315l01895l04947k53029j77879j14670q4152q8883j16539
2479C55554161j50604j77880j92222j92146j79482j56784j29814j08681j06239j32294
2489C54028015j85890k50473k98424l01819k49214j53274m8714K2316L1166k3842j17264
2500C52452583k08893k62489k60010k04925j16081j8692O4582J16539J27182R5101
2510C51784897K8496n2948j24512j63651j60827j23635p3623l6583l0632n8212j05324
2521C50883446j47515j60751j30615n9433L3417J17149J61896J49917Q4343j2130j06812
2532C50812912j71356j92528j74942j34315q8273m8332j9035l43Q697J0109Q659J1483
$$ plain form
2544 350022736 350046921 350092354 350156441 350220146 350254288 350234642 350158882 350051041 349949341 349882088 349846458
2555 349846458 349805069 349704552 349506454 349212418 348868256 348543205 348298111 348158150 348104668 348088417
2565 348088417 348054008 347962570 347802734 347589226 347353249 347130661 346952477 346836777 346783218 346771469 346766205
2576 346766205 346728630 346630936 346468048 346259689 346041336 345848694 345703812 345607338 345541306 345479393 345398102
2587 345398102 345286064 345147247 344997597 344857521 344741974 344651871 344571724 344475517 344338722 344151459
2597 344151459 343925934 343692589 343487129 343334846 343240623 343189888 343157425 343119431 343060417 342973518 342857323
2608 342857323 342713585 342548866 342377815 342222977 342107697 342045403 342028923 342029953 342008934 341932526 341789818
2619 341789818 341598015 341394691 341220131 341097641 341022835 340965843 340886765 340756607 340574532 340371323
$$ packed form
2544C50022736K4185M5433O4087O3705L4142j9646p5760j07841j01700o7253l5630
2555C49846458m1389j00517j98098k94036l44162l25051k45094j39961n3482j6251
2565C48088417l4409r1438j59836k13508k35977k22588j78184j15700n3559j1749n264
2576C46766205l7575r7694j62888k08359k18353j92642j44882r6474o6032o1913q1291
2587C45398102j12038j38817j49650j40076j15547r0103q0147r6207j36795j87263
2597C44151459k25525k33345k05460j52283r4223n0735l2463l7994n9014q6899j16195
2608C42857323j43738j64719j71051j54838j15280o2294j6480J030k1019p6408j42708
2619C41789818j91803k03324j74560j22490p4806n6992p9078j30158j82075k03209
$$ plain form
2629 340371323 340197792 340101700 340104561 340190125 340309219 340401306 340420265 340352211 340217819 340058670 339916878
2640 339916878 339819870 339775658 339778862 339820099 339890671 339980812 340074654 340148125 340175438 340141029 340050774 339932785
2652 339932785 339826889 339765663 339758263 339786682 339815521 339811325 339759102 339668159 339563828 339472008 339405518 339360275
2664 339360275 339322128 339277306 339221039 339157867 339095917 339040756 338993378 338951950 338915749 338886223 338864250 338845787
2676 338845787 338820839 338776436 338704033 338605309 338491325 338377151 338273697 338181190 338089981 337985115 337853775
2687 337853775 337691727 337505798 337313232 337138023 337004128 336926918 336906776 336925926 336953697 336957703 336917076
2698 336917076 336830597 336714516 336591454 336477814 336375542 336275177 336166725 336050148 335939102 335854645
2708 335854645 335812950 335814362 335841293 335864372 335853920 335790176 335666847 335489006 335268517 335019264 334755516
$$ packed form
2629C40371323j73531r6092K861Q5564J19094R2087J8959o8054j34392j59149j41792
2640C39916878r7008m4212L204M1237P0572R0141R3842P3471K7313l4409r0255j17989
2652C39932785j05896o1226p400K8419K8839m196n2223r0943j04331r1820o6490m5243
2664C39360275l8147m4822n6267o3172o1950n5161m7378m1428l6201k9526k1973j8463
2676C38845787k4948m4403p2403r8724j13984j14174j03454r2507r1209j04866j31340
2687C37853775j62048j85929j92566j75209j33895p7210k0142J9150K7771M006m0627
2698C36917076q6479j16081j23062j13640j02272j00365j08452j16577j11046q4457
2708C35854645m1695J412K6931K3079j0452o3744j23329j77841k20489k49253k63748
$$ plain form
2719 334755516 334492569 334246254 334031944 333860283 333733215 333641014 333562927 333471947 333342552 333160629
2729 333160629 332929916 332672997 332423973 332215042 332061920 331956253 331869392 331767769 331630516 331461411
2739 331461411 331285362 331131363 331011353 330907860 330779495 330582657 330298500 329948082 329587173 329282227
2749 329282227 329079819 328985252 328961754 328947182 328880424 328723717 328472595 328152580 327807541 327485199 327223320
2760 327223320 327039719 326926117 326849899 326763496 326620750 326394272 326085968 325726013 325360527 325032578
2770 325032578 324766731 324560280 324385262 324198189 323954773 323626175 323212585 322748604 322296867 321927490
2780 321927490 321690178 321591263 321588249 321607819 321578369 321462135 321269035 321046219 320849495 320714760 320643120
2791 320643120 320606461 320565453 320488586 320362625 320191231 319988995 319773750 319562492 319367466 319192390
$$ packed form
2719C34755516k62947k46315k14310j71661j27068r2201p8087r0980j29395j81923
2729C33160629k30713k56919k49024k08931j53122j05667q6861j01623j37253j69105
2739C31461411j76049j53999j20010j03493j28365j96838k84157l50418l60909l04946
2749C29282227k02408r4567k3498j4572o6758j56707k51122l20015l45039l22342k61879
2760C27223320j83601j13602p6218q6403j42746k26478l08304l59955l65486l27949
2770C25032578k65847k06451j75018j87073k43416l28598m13590m63981m51737l69377
2780C21927490k37312r8915l014J9570k9450j16234j93100k22816j96724j34735p1640
2791C20643120l6659m1008p6867j25961j71394k02236k15245k11258j95026j75076
$$ plain form
2801 319192390 319030037 318863964 318676739 318461170 318228798 318007736 317830219 317715855 317660618 317637844
2811 317637844 317610779 317549343 317442074 317298508 317143097 317005272 316910305 316872387 316889896 316943531 316999092
2822 316999092 317016029 316961155 316822433 316614513 316373711 316142349 315951424 315808258 315695877 315582466
2832 315582466 315435562 315235176 314981327 314694481 314409904 314165897 313990364 313887291 313830948 313771133
2842 313771133 313648167 313413811 313047371 312560997 311992493 311390133 310797729 310245438 309746227 309296455
2852 309296455 308876362 308453712 307990990 307458344 306848850 306186600 305522156 304912319 304394875 303968582
2862 303968582 303591232 303195858 302718372 302122307 301410694 300621185 299809113 299028492 298316326 297685947
2872 297685947 297127171 296612225 296105156 295571899 294989834 294351215 293661633 292931633 292167130 291363945
$$ packed form
2801C19192390j62353j66073j87225k15569k32372k21062j77517j14364n5237k2774
2811C17637844k7065o1436j07269j43566j55411j37825r4967l7918J7509N3635N5561
2822C16999092J6937n4874j38722k07920k40802k31362j90925j43166j12381j13411
2832C15582466j46904k00386k53849k86846k84577k44007j75533j03073n6343n9815
2842C13771133j22966k34356l66440m86374n68504o02360n92404n52291m99211m49772
2852C09296455m20093m22650m62722n32646o09494o62250o64444o09837n17444m26293
2862C03968582l77350l95374m77486n96065p11613p89509q12072p80621p12166o30379
2872B97685947n58776n14946n07069n33257n82065o38619o89582p30000p64503q03185
$$ plain form
2882 291363945 290510159 289595070 288617935 287591496 286536922 285472298 284403820 283323002 282214355
2891 282214355 281065941 279877586 278659954 277427006 276187267 274940758 273684883 272424889 271180592
2900 271180592 269984665 268871231 267862396 266960430 266151886 265419865 264756832 264168758 263668194
2909 263668194 263258781 262923012 262619400 262292480 261889095 261374435 260739479 259999046 259184418 258333912
2919 258333912 257485409 256670055 255906124 255194340 254517288 253847294 253161106 252456779 251762295 251129627
2929 251129627 250614414 250251026 250036106 249931583 249885235 249857903 249841938 249859543 249943523 250112610 250356369
2940 250356369 250639381 250919247 251167393 251378593 251563072 251729908 251871910 251963177 251971073 251874180 251675072
2951 251675072 251401501 251095142 250796585 250532513 250309315 250114861 249924221 249707909 249442253 249118004
$$ packed form
2882B91363945q53786r15089r77135j026439j054574j064624j068478j080818j108647
2891B82214355j148414j188355j217632j232948j239739j246509j255875j259994j244297
2900B71180592j195927j113434j008835r01966q08544p32021o63033n88074n00564
2909B63668194m09413l35769l03612l26920m03385n14660o34956p40433q14628q50506
2919B58333912q48503q15354p63931p11784o77052o69994o86188p04327o94484o32668
2929B51129627n15213l63388k14920j04523m6348k7332j5965J7605Q3980J69087K43759
2940B50356369K83012K79866K48146K11200J84479J66836J42002R1267P896r6893j99108
2951B51675072k73571l06359k98557k64072k23198j94454j90640k16312k65656l24249
$$ plain form
2961 249118004 248744183 248343430 247939606 247541962 247135620 246686096 246154175 245516472 244777145 243966103
2971 243966103 243126678 242302647 241534634 240866489 240354176 240065918 240067539 240398808 241053963 241979065
2981 241979065 243089199 244298077 245544014 246800976 248070164 249362049 250677032 251997910 253293610
2990 253293610 254532433 255695896 256787052 257829456 258858185 259905243 260985661 262089863 263184528
2999 263184528 264222584 265158653 265964012 266635780 267198105 267694683 268174343 268674488 269206181 269746246
3009 269746246 270242386 270631676 270866756 270939445 270888271 270782681 270690861 270645561 270627117 270574570 270419350
3020 270419350 270123959 269703064 269217701 268744736 268340721 268017883 267744160 267463512 267122765 266693077
3030 266693077 266175861 265597019 264995289 264411774 263883591 263439789 263096943 262853775 262685852 262546139
$$ packed form
2961B49118004l73821m00753m03824l97644m06342m49524n31921o37703p39327q11042
2971B43966103q39425q24031p68013o68145n12313k88258J621L31269O55155R25102
2981B41979065J110134J208878J245937J256962J269188J291885J314983J320878J295700
2990B53293610J238823J163463J091156J042404J028729J047058J080418J104202J094665
2999B63184528J038056R36069Q05359O71768N62325M96578M79660N00145N31693N40065
3009B69746246M96140L89290K35080P2689n1174j05590r1820m5300j8444n2547j55220
3020B70419350k95391m20895m85363m72965m04015l22838k73723k80648l40747m29688
3030B66693077n17216n78842o01730n83515n28183m43802l42846k43168j67923j39713
$$ plain form
3040 262546139 262372246 262101517 261689644 261124401 260429859 259656258 258858624 258073158 257301598 256511860
3050 256511860 255655212 254692039 253614120 252451515 251261635 250106449 249028873 248039780 247118835
3059 247118835 246227055 245322456 244372864 243362122 242290211 241170216 240023613 238874321 237742558
3068 237742558 236639767 235566578 234515133 233473873 232432137 231380692 230309772 229205894 228052120
3077 228052120 226833973 225547638 224206219 222839489 221487083 220188789 218976669 217872982 216890411
3086 216890411 216032467 215291080 214641457 214040604 213433323 212766056 212003384 211137981 210189571 209191837
3096 209191837 208176479 207163010 206159630 205173798 204223824 203342133 202565498 201917095 201390152
3105 201390152 200943012 200512428 200038300 199490604 198884754 198278217 197749462 197369461 197176781 197168179
$$ packed form
3040B62546139j73893k70729m11873n65243o94542p73601p97634p85466p71560p89738
3050B56511860q56648r63173j077919j162605j189880j155186j077576r89093r20945
3059B47118835q91780r04599r49592j010742j071911j119995j146603j149292j131763
3068B37742558j102791j073189j051445j041260j041736j051445j070920j103878j153774
3077B28052120j218147j286335j341419j366730j352406j298294j212120j103687r82571
3086B16890411q57944p41387o49623o00853o07281o67267p62672q65403r48410r97734
3096B09191837j015358j013469j003380r85832r49974q81691p76635o48403n26943
3105B01390152m47140m30584m74128n47696o05850o06537n28755l80001j92680q602
$$ plain form
3115 197168179 197304344 197528267 197785549 198039188 198275051 198500080 198735256 199007339 199341679 199754219
3125 199754219 200246983 200806751 201409912 202033367 202665634 203313274 203998013 204745483 205570011 206464691
3135 206464691 207400341 208334332 209223633 210037479 210764141 211411972 212005444 212577152 213157711 213764954
3145 213764954 214395676 215024166 215610676 216116886 216521587 216829662 217067928 217271137 217465305 217657490
3155 217657490 217837009 217984524 218083420 218125362 218108826 218034000 217898560 217698212 217430401 217099247 216715298
3166 216715298 216292686 215843563 215374355 214884186 214367924 213819275 213235378 212619362 211980839 211333504
3176 211333504 210689812 210053654 209415112 208751297 208034821 207247639 206393909 205504074 204627247 203812733
3186 203812733 203090248 202456818 201877327 201298027 200666676 199949760 199140759 198256874 197328987 196389122
$$ packed form
3115A97168179J36165K23923K57282K53639K35863K25029K35176K72083L34340M12540
3125A99754219M92764N59768O03161O23455O32267O47640O84739P47470Q24528Q94680
3135B06464691R35650R33991Q89301Q13846P26662O47831N93472N71708N80559O07243
3145B13764954O30722O28490N86510N06210M04701L08075K38266K03209J94168J92185
3155B17657490J79519J47515R8896M1942j6536p4826j35440k00348k67811l31154l83949
3166B16715298m22612m49123m69208m90169n16262n48649n83897o16016o38523o47335
3176B11333504o43692o36158o38542o63815p16476p87182q53730q89835q76827q14514
3186B03812733p22485o33430n79491n79300o31351p16916q09001q83885r27887r39865
$$ plain form
3196 196389122 195463181 194568310 193715267 192909718 192151642 191431980 190731068 190021667 189278774 188492126
3206 188492126 187674484 186859055 186086521 185385056 184755135 184166241 183568439 182912006 182165394 181323700
3216 181323700 180403843 179432831 178435421 177428207 176420250 175417233 174425488 173452263 172504597
3225 172504597 171587257 170701752 169846058 169015141 168201275 167396336 166595535 165801888 165027962 164293766
3235 164293766 163618984 163016300 162487450 162028027 161636143 161322250 161110096 161029568 161102104 161327953
3245 161327953 161680984 162116165 162585793 163057995 163529797 164029236 164606609 165318356 166209755 167302513
3255 167302513 168589268 170037899 171601467 173231812 174892311 176567879 178267803 180021687 181867485
3264 181867485 183834229 185925426 188110275 190327282 192501831 194570312 196500607 198299465 200003910
$$ packed form
3196A96389122r25941q94871q53043q05549p58076p19662p00912p09401p42893p86648
3206A88492126q17642q15429p72534p01465o29921n88894n97802o56433p46612q41694
3216A81323700r19857r71012r97410j007214j007957j003017r91745r73225r47666
3225A72504597r17340q85505q55694q30917q13866q04939q00801p93647p73926p34196
3235A64293766o74782o02684n28850m59423l91884l13893k12154q0528P2536K25849
3245A61327953L53031M35181M69628M72202M71802M99439N77373P11747Q91399J092758
3255A67302513J286755J448631J563568J630345J660499J675568J699924J753884J845798
3264A81867485J966744K091197K184849K217007K174549K068481J930295J798858J704445
$$ plain form
3273 200003910 201661205 203309059 204964561 206625595 208279076 209910126 211505165 213049850 214526939
3282 214526939 215918064 217209606 218398666 219494686 220514088 221471844 222375774 223226223 224020767
3291 224020767 224759655 225446701 226085205 226672707 227198429 227646427 228002567 228260765 228425198 228507500
3301 228507500 228521252 228477669 228384399 228248272 228077393 227882175 227671890 227449951 227209797 226935120
3311 226935120 226605988 226208401 225743732 225232258 224707260 224202614 223739567 223319340 222927380 222544632
3321 222544632 222159767 221773968 221394501 221023712 220650749 220254955 219820061 219350033 218876305 218448734
3331 218448734 218113155 217888165 217753868 217660236 217551270 217392597 217187557 216973648 216801834 216710033
3341 216710033 216704292 216757126 216823063 216861458 216854668 216812782 216764011 216738071 216751957 216806412 216890831 216993465
$$ packed form
3273B00003910J657295J647854J655502J661034J653481J631050J595039J544685J477089
3282B14526939J391125J291542J189060J096020J019402R57756R03930Q50449P94544
3291B24020767P38888O87046O38504N87502N25722M47998L56140K58198J64433Q2302
3301B28507500J3752m3583r3270j36127j70879j95218k10285k21939k40154k74677
3311B26935120l29132l97587m64669n11474n24998n04646m63047m20227l91960l82748
3321B22544632l84865l85799l79467l70789l72963l95794m34894m70028m73728m27571
3331B18448734l35579k24990j34297r3632j08966j58673k05040k13909j71814r1801
3341B16710033n741N2834O5937L8395o790m1886m8771k5940J3886N4455Q4419J02634
$$ plain form
3353 216993465 217108402 217235813 217378292 217536793 217710018 217897530 218102875 218333817 218599854 218908501
3363 218908501 219263420 219664421 220108166 220586548 221085072 221583996 222063580 222513943 222942066 223370228
3373 223370228 223823357 224311409 224816761 225296326 225698891 225989494 226166782 226264610 226336651 226433105
3383 226433105 226581497 226780243 227005978 227227879 227420902 227572803 227683163 227759075 227810535 227848587
3393 227848587 227884197 227927322 227983055 228046589 228099957 228114529 228059998 227918587 227694550 227415009 227118759
3404 227118759 226839066 226589909 226365128 226149712 225935802 225730438 225549335 225398731 225259762 225086975
3414 225086975 224825325 224437542 223924370 223327255 222710552 222135353 221639290 221229897 220891628 220597591
3424 220597591 220318756 220029202 219710732 219358730 218988457 218634319 218338737 218134251 218027687 217997532
$$ packed form
3353B16993465J14937J27411J42479J58501J73225J87512K05345K30942K66037L08647
3363B18908501L54919M01001M43745M78382M98524M98924M79584M50363M28123M28162
3373B23370228M53129M88052N05352M79565M02565K90603J77288R7828P2041R6454
3383B26433105J48392J98746K25735K21901J93023J51901J10360P5912N1460L8052
3393B27848587L5610M3125N5733O3534N3368J4572n4531j41411k24037k79541k96250
3404B27118759k79693k49157k24781k15416k13910k05364j81103j50604j38969j72787
3414B25086975k61650l87783n13172n97115o16703n75199m96063m09393l38269k94037
3424B20597591k78835k89554l18470l52002l70273l54138k95582k04486j06564l0155
$$ plain form
3434 217997532 218005962 218018379 218017063 218000813 217973385 217931690 217865696 217771397 217666454 217594757 217611828 217757969
3446 217757969 218035870 218408108 218817673 219219246 219601955 219988842 220415688 220902672 221438236 221983929
3456 221983929 222495251 222945251 223337021 223700218 224078102 224512978 225035725 225659351 226374283 227145805
3466 227145805 227918339 228631878 229246864 229766922 230243797 230757980 231381569 232143917 233020744 233953438
3476 233953438 234885979 235795670 236698856 237628784 238604717 239614906 240625114 241606464 242559433 243516273
3486 243516273 244518261 245586224 246705933 247840900 248962173 250071754 251200027 252376003 253592548
3495 253592548 254793320 255896378 256842175 257635212 258349876 259094219 259950771 260932178 261978283
3504 261978283 262996044 263916378 264732952 265501232 266301422 267191639 268178005 269218216 270248375
$$ packed form
3434B17997532Q430J2417j316j6250k7428m1695o5994r4299j04943p1697J7071J46141
3446B17757969K77901L72238M09565M01573L82709L86887M26846M86984N35564N45693
3456B21983929N11322M50000L91770L63197L77884M34876N22747O23626P14932P71522
3466B27145805P72534P13539O14986N20058M76875N14183O23589P62348Q76827R32694
3476B33953438R32541R09691R03186R29928R75933J010189J010208R81350R52969R56840
3486B43516273J001988J067963J119709J134967J121273J109581J128273J175976J216545
3495B53592548J200772J103058R45797P93037P14664P44343Q56552R81407J046105
3504B61978283J017761R20334Q16574P68280Q00190Q90217R86366J040211J030159
$$ plain form
3513 270248375 271214943 272092476 272880745 273590584 274228783 274791164 275263577 275626869 275865498 275979080
3523 275979080 275995770 275981693 276034317 276254005 276700325 277355270 278118706 278847885 279428425 279837818
3533 279837818 280163536 280556049 281138935 281922894 282778454 283488674 283858490 283822079 283484974 283073788
3543 283073788 282819710 282841148 283094273 283418770 283648605 283718300 283698711 283744736 283996544 284503040 285220318
3554 285220318 286074791 287032452 288107777 289292526 290456581 291309681 291485195 290724564 289061031
3563 289061031 286881618 284809093 283453484 283162766 283904381 285327549 286953144 288375854 289383469
3572 289383469 289969082 290276909 290537796 291013088 291926270 293363609 295173111 296934586 298072052
3581 298072052 298096523 296872635 294750061 292456074 290783482 290232811 290804958 292054386 293354969
$$ packed form
3513B70248375R66568Q77533P88269P09839O38199N62381M72413L63292K38629J13582
3523B75979080J6690j4077N2624K19688M46320O54945P63436P29179N80540M09393
3533B79837818L25718L92513N82886P83959Q55560P10220L69816l6411l37105m11186
3543B83073788k54078K1438K53125L24497K29835O9695j9589M6025K51808N06496P17278
3554B85220318Q54473R57661J075325J184749J164055Q53100J75514p60631j663533
3563B89061031k179413k072525j355609k90718P41615J423168J625595J422710J007615
3572B89383469N85613L07827K60887M75292R13182J437339J809502J761475J137466
3581B98072052K4471j223888k122574k293987j672592n50671N72147J249428J300583
$$ plain form
3590 293354969 294214249 294461098 294233227 293820801 293496513 293435326 293733425 294456081 295637074 297214317
3600 297214317 298960781 300494137 301399612 301415882 300581512 299252834 297977180 297283630 297485428
3609 297485428 298569183 300196247 301804256 302783680 302699146 301503468 299657612 298058949 297732220
3618 297732220 299360981 302861576 307245655 310914078 312303734 310597610 306134243 300288696 294876041
3627 294876041 291382217 290414410 291615086 294016266 296583157 298643932 300035515 300994396 301944141
3636 301944141 303315258 305426006 308370514 311887741 315279045 317507210 317546082 314877281 309870663
3645 309870663 303782024 298293362 294799500 293820953 294865837 296799221 298479996 299292126 299305382
3654 299305382 299057446 299172001 300066586 301869202 304485760 307678070 311077633 314181633 316432343
$$ packed form
3590B93354969Q59280K46849k27871m12426l24288o1187K98099P22656J180993J577243
3600B97214317J746464J533356R05475J6270q34370j328678j275654o93550K01798
3609B97485428J083755J627064J608009R79424q4534j195678j845856j598663l26729
3618B97732220J628761L500595M384079L668423J389656j706124m463367n845547n412655
3627B94876041l493824r67807J200676K401180K566891K060775J391583R58881R49745
3636C01944141J371117K110748K944508L517227L391304K228165L8872k668801n006618
3645C09870663o088639n488662l493862r78547J044884J933384J680775Q12130J3256
3654B99305382k47936J14555Q94585J802616K616558L192310L399563L104000K250710
$$ plain form
3663 316432343 317411900 317050591 315682850 313861942 312022400 310214233 308110027 305303173 301705379
3672 301705379 297769871 294380836 292474136 292626324 294848537 298659477 303323536 308065453 312153854
3681 312153854 314899960 315703201 314223251 310613060 305637646 300529270 296589527 294718800 295116005
3690 295116005 297294350 300370159 303439140 305844917 307259884 307634563 307132759 306112194 305110302
3699 305110302 304742756 305473614 307338428 309791412 311825943 312372684 310806961 307301712 302824554
3708 302824554 298762245 296353874 296212177 298151627 301367111 304831581 307691479 309487820 310158672
3717 310158672 309900589 309015503 307829571 306685200 305949306 305971851 306977673 308929348 311435356
3726 311435356 313770828 315044975 314493618 311815414 307420406 302448273 298469868 296918716 298462715
$$ packed form
3663C16432343R79557l61309j367741j820908j839542j808167k104206k806854l597794
3672C01705379l935508l389035j906700J52188K222213L810940M664059M741917M088401
3681C12153854K746106Q03241j479950l610191m975414n108376l939743j870727L97205
3690B95116005K178345L075809L068981K405777J414967L74679n01804j020565j001892
3699C05110302l67546P30858J864814K452984K034531N46741j565723l505249m477158
3708C02824554m062309k408371j41697J939450L215484L464470K859898J796341O70852
3717C10158672k58083q85086j185932j144371p35894K2545J005822J951675K506008
3726C11435356K335472J274147n51357k678204m395008m972133l978405j551152J543999
$$ plain form
3735 298462715 302620182 307866497 312254696 314281521 313555450 310892200 307769489 305451164 304300137
3744 304300137 303686886 302535343 300140114 296723881 293376026 291420765 291626511 293758755 296738586
3753 296738586 299277420 300574417 300659561 300225754 300116253 300813923 302220192 303789787 304871044
3762 304871044 305024986 304173031 302564411 300648861 298940868 297904758 297847099 298814030 300533047
3771 300533047 302461910 303967381 304575176 304171486 303042278 301719379 300714512 300284977 300356388
3780 300356388 300632648 300815144 300794163 300702858 300814838 301363430 302404099 303802261 305338707 306841393
3790 306841393 308240070 309504032 310521698 311038914 310735245 309414158 307177315 304444199 301772079
3799 301772079 299582863 297982464 296809349 295884304 295275459 295362835 296619225 299235325 302848244
$$ packed form
3735B98462715M157467N246315M388199K026825p26071k663250l122711k318325j151027
3744C04300137o13251j151543k395229l416233l347855j955261K05746K132244K979831
3753B96738586K538834J296997Q5144m33807j09501O97670J406269J569595J081257
3762C04871044J53942q51955j608620j915550j707993j036110n7659R66931J719017
3771C00533047J928863J505471O07795m03690j129208j322899j004867m29535P1411
3780C00356388K76260J82496k0981r1305J11980N48592J040669J398162J536446J502686
3790C06841393J398677J263962J017666N17216l03669j321087k236843k733116k672120
3799C01772079k189216j600399j173115r25045o08845Q7376J256390K616100L612919
$$ plain form
3808 302848244 306583443 309417267 310645199 310167503 308427887 306074295 303589325 301134987 298680878
3817 298680878 296275578 294226246 293033028 293120499 294559364 296981735 299754066 302293186 304320030
3826 304320030 305893936 307224674 308403053 309237080 309302788 308182697 305744457 302292480 298496666
3835 298496666 295134087 292788181 291675797 291698799 292677040 294594193 297659416 302091331 307718334
3844 307718334 313652573 318314476 319917393 317251835 310384884 300872402 291303158 284338188 281689053
3853 281689053 283515968 288513489 294595947 299811668 303044605 304221992 304026680 303347797 302782555
3862 302782555 302416477 301929226 300906410 299164047 296912785 294696503 293152599 292727146 293486271
3871 293486271 295111809 297064495 298819027 300043430 300645981 300700207 300329437 299638939 298727837
$$ packed form
3808C02848244L735199K833824J227932m77696j739616k353592k484970k454338k454109
3817B98680878k405300k049332j193218Q7471J438865K422371K772331K539120K026844
3826C04320030J573906J330738J178379Q34027O5708j120091k438240l451977l795814
3835B98496666l362579k345906j112384K3002R78241J917153L065223M431915N627003
3844C07718334N934239M661903J602917k665558o866951r512482r569244o964970k649135
3853B81689053J826915M997521O082458N215721L232937J177387j95312o78883n65242
3862C02782555l66078m87251j022816j742363k251262k216282j543904m25453P59125
3871B93486271J625538J952686J754532J224403O02551N4226l70770o90498r11102
$$ plain form
3880 298727837 297736435 296855488 296260452 296006947 295978718 295952415 295764751 295475807 295406551 295995502
3890 295995502 297536812 299946899 302703514 305003948 306068172 305438480 303137817 299636536 295669880
3899 295669880 292005424 289252491 287758904 287595978 288603401 290464725 292793007 295207195 297385712
3908 297385712 299089737 300165043 300539455 300233173 299376049 298207054 297028885 296116505 295617123
3917 295617123 295499496 295592136 295695515 295703583 295654087 295673351 295851841 296138191 296335373 296210937 295656815
3928 295656815 294790955 293929043 293433628 293529110 294189739 295160351 296088276 296685619 296835060 296600056
3938 296600056 296156635 295697403 295354271 295162258 295064964 294953251 294724350 294342041 293869057 293448467
3948 293448467 293232594 293297005 293592510 293970566 294268570 294397697 294373837 294276810 294176464 294088230 293989601
$$ packed form
3880B98727837r91402q80947n95036k53505k8229k6303j87664k88944o9256N88951
3890B95995502J541310K410087K756615K300434J064224o29692k300663l501281l966656
3899B95669880l664456k752933j493587j62926J007423J861324K328282K414188K178517
3908B97385712J704025J075306L74412l06282q57124j168995j178169r12380m99382
3917B95617123j17627R2640J03379Q068m9496J9264J78490K86350J97182j24436n54122
3928B95656815q65860q61912m95415R5482O60629R70612R27925N97343J49441k35004
3938B96600056m43421m59232l43132j92013r7294j11713k28901l82309m72984m20590
3948B93448467k15873O4411K95505L78056K98004J29127k3860r7027j00346q8234r8629
$$ plain form
3959 293989601 293874416 293786297 293794270 293929234 294137611 294301243 294312115 294142399 293853760 293540096 293260841
3970 293260841 293022709 292817974 292668705 292617016 292659683 292696037 292562428 292154503 291541042 290952549
3980 290952549 290620461 290582924 290630779 290469322 289982014 289356232 288918514 288777657 288593426 287753735
3990 287753735 285922737 283530025 281660843 281149368 281304035 279165230 270083351 249670830 216242962
3999 216242962 172364826
4000 172364826
$$ packed form
3959B93989601j15185q8119P973J34964K08377J63632J0872j69716k88639l13664k79255
3970B93260841k38132k04735j49269n1689M2667L6354j33609m07925o13461n88493
3980B90952549l32088l7537M7855j61457m87308o25782m37718j40857j84231q39691
3990B87753735j830998k392712j869182n11475J54667k138805r081879k0412521l3427868
3999B16242962m3878136
4000A72364826
##END=$$ End of the data block
