##TITLE=$$ Begin of the data block
##JCAMP-DX=5.00 $$ ACD/SpecManager v 10.08
##SPECTROMETER/DATA SYSTEM=16PC
##DATE=Mon Sep 02 16:49:39 2013
##DATA TYPE=INFRARED SPECTRUM
##DATA CLASS=XYDATA
##ORIGIN=
##OWNER=
##NPOINTS=3601
##FIRSTX=400.00000000
##LASTX=4000.00000000
##MAXX=4000.00000000
##MINX=400.00000000
##MAXY=38.68846893
##MINY=2.81455040
##XFACTOR=1.0000000000
##YFACTOR=0.000000100000000
##FIRSTY=17.82151031
##DELTAX=1.00000000
##XUNITS=1/CM
##YUNITS=TRANSMITTANCE
##XYDATA=(X++(Y..Y))
400A78215103M7182923L9009399K8284721J8504563J1738929Q025933N989418M116668
$$ 178215103 225398026 264407425 292692146 311196709 322935638 330961571 336950989 341067657
408C41067657J792832n14069j879615j781426n39932R14955J696091J512222P44171
$$ 341067657 342860489 342346420 340466805 338685379 338145447 339060402 340756493 342268715 343012886
417C43012886O3705o4163L70560J043625J612892J944580K094650K120438J939049
$$ 343012886 343076591 343012428 343382988 344426613 346039505 347984085 350078735 352199173 354138222
426C54138222J373329L50876r31740k039833k528687k210540j267167j38511P23381
$$ 354138222 355511551 355862427 354930687 352890854 350362167 348151627 346884460 346745949 347469330
435C47469330J058121Q44993K09580o95076j731720k745591l534088l900032l778610
$$ 347469330 348527451 349372444 349582024 348886948 347155228 344409637 340875549 336975517 333196907
444C33196907l337250k940521k961502l545761m488487n320835n563107m987774l725090
$$ 333196907 329859657 326919136 323957634 320411873 315923386 310602551 305039444 300051670 296326580
453B96326580k154655o67019N40561J507607K387714L270016M085636M662609M882241
$$ 296326580 294171925 293504906 294045467 295553074 297940788 301210804 305296440 309959049 314841290
462C14841290M804611M660587M699211M996910N367813N455590M964218L884086K558136
$$ 314841290 319645901 324306488 329005699 334002609 339370422 344826012 349790230 353674316 356232452
471C56232452J531983J261940J857872L012733M162789M781723M628792L817672K686424
$$ 356232452 357764435 359026375 360884247 363896980 368059769 372841492 377470284 381287956 383974380
480C83974380J571808O42853j18904q09784j469078k027855k368851k439994k327424
$$ 383974380 385546188 386189041 386070137 385260353 383791275 381763420 379394569 376954575 374627151
489C74627151k226867k338448k753677l410950m127464m672547m829635m429932l378944
$$ 374627151 372400284 370061836 367308159 363897209 359769745 355097198 350267563 345837631 342458687
498C42458687j701966M02260K550316M254074N084000M835472L590508J625480p80105
$$ 342458687 340756721 341158981 343709297 347963371 353047371 357882843 361473351 363098831 362318726
507C62318726l493920o515884r786148j2946778j5251712j5752850j3711929r033623
$$ 362318726 358824806 352308922 342522774 329575996 314324284 298571434 284859505 275825882
515B75825882k459812M612884J0625801J4423428J5615501J4585534J2191467R351463
$$ 275825882 273366070 277978954 288604755 303028183 318643684 333229218 345420685 354772148
523C54772148O732750M656754L188171K281380J867904J850014K054787K232208K135963
$$ 354772148 361504898 366161652 369349823 371631203 373499107 375349121 377403908 379636116 381772079
532C81772079J647377Q56858L3073n16739o19430l37181O5880K71301Q4877m60167
$$ 381772079 383419456 384276314 384309387 383792648 383173218 382836037 382901917 383173218 383258095 382797928
542C82797928j126785j607895j688462j347465p51610j57814K14119K67944M3488l38707
$$ 382797928 381671143 380063248 378374786 377027321 376275711 376117897 376332016 376599960 376643448 376304741
552C76304741p54509j134071j479645j844483k299118k897682l650551m501571n311852
$$ 376304741 375550232 374416161 372936516 371092033 368792915 365895233 362244682 357743111 352431259
561C52431259n863533n899124n204163l705711j544991R21898L216591M890709N679550
$$ 352431259 346567726 340668602 335464439 331758728 330213737 331135635 334352226 339242935 344922485
570C44922485N580941M828643L772355K728691J876182J233559P19871K47269k07596
$$ 344922485 350503426 355332069 359104424 361833115 363709297 364942856 365662727 365909996 365702400
579C65702400n89447q02765p74917n04532p3700L76243O93589P66144N60569J32103
$$ 365702400 365112953 364310188 363535271 363030739 362957039 363333282 364026871 364793015 365353584 365485687
589C65485687l94058q75664j217117j420555j587792j864891k348480l004570l654251
$$ 365485687 365091629 364215965 362998848 361578293 359990501 358125610 355777130 352772560 349118309
598C49118309m048843l999291l489723k696075j892548j289558r03740n48630L8910
$$ 349118309 345069466 341070175 337580452 334884377 332991829 331702271 330798531 330249901 330288811
607C30288811J003914K232437L362007L952598L726387K738457J372795J63040m62989
$$ 330288811 331292725 333525162 336887169 340839767 344566154 347304611 348677406 348840446 348377457
616C48377457l72582K49291J035499J638565J874886J741218J327134P09610q3847
$$ 348377457 348004875 348254166 349289665 350928230 352803116 354544334 355871468 356581078 356497231
625C56497231j020737j974526k688713k848968k238693q90465Q72841K542114L630257
$$ 356497231 355476494 353501968 350813255 347964287 345725594 344835129 345707970 348250084 351880341
634C51880341L876304L338013K332497J263961M37165m9630k90222m61998o99081j020432
$$ 351880341 355756645 359094658 361427155 362691116 363128281 363078651 362788429 362326431 361627350 360606918
644C60606918j345939j580277j700020j788597j994438k443733l165665m082832n069504
$$ 360606918 359260979 357680702 355980682 354192085 352197647 349753914 346588249 342505417 337435913
653C37435913o031837o940651p782173q458424q721867q227482o710701m200668j124267
$$ 337435913 331404076 324463425 316681252 308222828 299500961 291273479 284562778 280362110 279237843
662B79237843J800499L862895M692746M433918L640461K948742K723274K889767L052558
$$ 279237843 281038342 284901237 289593983 294027901 297668362 300617104 303340378 306230145 309282703
671C09282703K804718K019444R31835k6302n11570m72336j43585J40381J64108p2918
$$ 309282703 312087421 314106865 315038700 315012398 314500828 314028492 313884907 314025288 314189396 314116478
681C14116478m28047p73983j109028j543865k202740l140011m350071n841617p678452
$$ 314116478 313688431 312914448 311805420 310261555 308058815 304918804 300568733 294727116 287048664
690B87048664r899616j2349987j4555702j5792714j5383529j3077469r274044m910469
$$ 287048664 277149048 264799061 250243359 234450645 219067116 205989647 196715603 191805134
698A91805134j028576J745644L502826M940129O893196R785003J3313523J6562328
$$ 191805134 190776558 192522202 196025028 200965157 207858353 217643356 230956879 247519207
706B47519207J8460712J8327122J6195603J2766418R041729N869827L638954K250023
$$ 247519207 265979919 284307041 300502644 313269062 322310791 328180618 331819572 334069595
714C34069595J325150M99458l77922j215858j806259j992302j780968j340370r07173
$$ 334069595 335394745 335894203 335516281 334300423 332494164 330501862 328720894 327380524 326473351
723C26473351o70968o99882r42459j283837j615753j879730k069626k207470k318821
$$ 326473351 325802383 325102501 324160042 322876205 321260452 319380722 317311096 315103626 312784805
732C12784805k421589k530212k662029k836113l070507l381195l789502m324283n005188
$$ 312784805 310363216 307833004 305170975 302334862 299264355 295883160 292093658 287769375 282764187
741B82764187n802975o600361p191620p351760o957283o101151n118732m479504m574909
$$ 282764187 276961212 270360851 263169231 255817471 248860188 242759037 237640305 233160801 228585892
750B28585892n501938o963673q358497r026223q534298o862297m393100j731377N51491
$$ 228585892 223083954 216120281 207761784 198735561 190201263 183338966 178945866 177214489 177765980
759A77765980K114849K904453L072052K831612K341423J670990Q43677r4127j032429
$$ 177765980 179880829 182785282 185857334 188688946 191030369 192701359 193545036 193450909 192418480
768A92418480j815109k299118k418003k212124j808358j364688j008263p94087p01808
$$ 192418480 190603371 188304253 185886250 183674126 181865768 180501080 179492817 178698730 177996922
777A77996922o61545n94845m46091j94168J56212N91736J103210J684685K323055K988091
$$ 177996922 177335377 176740532 176294441 176100273 176256485 176848221 177951431 179636116 181959171 184947262
787A84947262L631878M201088M652824M963036N123672N130654M976806M659310M197444
$$ 184947262 188579140 192780228 197433052 202396088 207519760 212650414 217627220 222286530 226483974
796B26483974L652688L129615K753296K628842K801761L237972L834210M449272M945965
$$ 226483974 230136662 233266277 236019573 238648415 241450176 244688148 248522358 252971630 257917595
805B57917595N223713N237179M999237M570770M042168L505268L024406K611923K222023
$$ 257917595 263141308 268378487 273377724 277948494 281990662 285495930 288520336 291132259 293354282
814B93354282J766816J154747L34682o69899j748791k720604l368568l487835k936420
$$ 293354282 295121098 296275845 296610527 295940628 294191837 291471233 288102665 284614830 281678410
823B81678410j679345J79749K397861M629174O500587P708378Q101139P716847O754398
$$ 281678410 279999065 280178814 282576675 287205849 293706436 301414814 309515953 317232800 323987198
832C23987198N494346M202118L057290K132682J422158Q86383M90493K13624L8337
$$ 323987198 329481544 333683662 336740952 338873634 340295792 341182175 341672668 341886292 341924629
841C41924629n9433j06201j11008m8484J36413M96025J037369J693382K332688K804870
$$ 341924629 341865196 341758995 341647987 341599503 341735916 342231941 343269310 344962692 347295380 350100250
851C50100250L000641K893486K544403K067375J581040J168136Q61855O55365N19180
$$ 350100250 353100891 355994377 358538780 360606155 362187195 363355331 364217186 364872551 365391731
860C65391731M16947L10325J62659n2109l37982o68945r96475j273919j486396j666794
$$ 365391731 365808678 366119003 366281662 366229553 365891571 365222626 364226151 362952232 361465836 359799042
870C59799042j882096k191658k598037l014908l278313l198776k636795j568298j10627
$$ 359799042 357916946 355725288 353127251 350112343 346834030 343635254 340998459 339430161 339319534
879C39319534J504402K998925M132843M771957M911957M659843M178543L624344L102799
$$ 339319534 340823936 343822861 347955704 352727661 357639618 362299461 366478004 370102348 373205147
888C73205147K652702K263222J904259J555023J218223R15032O70814N01023M03518
$$ 373205147 375857849 378121071 380025330 381580353 382798576 383713608 384384422 384885445 385288963
897C85288963L59879L42483L22762K79388K01302Q9912m5662j94397l49273n07660
$$ 385288963 385648842 385991325 386314087 386593475 386794777 386884689 386839027 386644630 386295357 385787697
907C85787697o65817q08716r08547r32274q61625p10297n26657l72467k89154k69394
$$ 385787697 385121880 384313164 383404617 382472343 381610718 380900421 380373764 380001297 379712143 379442749
917C79442749k56081j73645K6703L31459O66161R32121J055565J021347Q70285O64292
$$ 379442749 379186668 379013023 379039726 379371185 380037346 380969467 382025032 383046379 383916664 384580956
927C84580956M48646K33727R040k25563m39605n80254o07758n31997m23279l82957
$$ 384580956 385029602 385263329 385272369 385046806 384607201 384026947 383419189 382887192 382463913 382080956
937C82080956m89274p50846j097031j413536j604958j645469j590310j541557j588402
$$ 382080956 381591682 380840836 379743805 378330269 376725311 375079842 373489532 371947975 370359573
946C70359573j758003k003288k231636k353134k320824k139168j840744j453628r81446
$$ 370359573 368601570 366598282 364366646 362013512 359692688 357553520 355712776 354259148 353277702
955C53277702m13627K44636R42307J578598K034187K222176K133140J845398J495323
$$ 353277702 352864075 353108711 354051018 355629616 357663803 359885979 362019119 363864517 365359840
964C65359840J219139J097909J130867J248855J354866J370850J266021J059266P99751
$$ 365359840 366578979 367676888 368807755 370056610 371411476 372782326 374048347 375107613 375907364
973C75907364N41305L20816J48926Q888j38511l42026o43577j053277j529579j976051
$$ 375907364 376448669 376769485 376918411 376927299 376788788 376446762 375803185 374749908 373220329 371244278
983C71244278k262726k274551j963463j382179o77185l8109L71246M69360K73056j30882
$$ 371244278 368981552 366707001 364743538 363361359 362684174 362646065 363017311 363486671 363759727 363628845
993C63628845o38160j169892j684570k158661k556305k816811k871360k682190k273369
$$ 363628845 362990685 361820793 360136223 357977562 355421257 352604446 349733086 347050896 344777527
1002C44777527j736069j199036p81631n55382n31311o72493r19723j213188j504860
$$ 344777527 343041458 341842422 341060791 340505409 339974098 339301605 338381882 337168694 335663834
1011C35663834j765175j988869k200813k450714k792282l251267l801327m365158m847717
$$ 335663834 333898659 331909790 329708977 327258263 324465981 321214714 317413387 313048229 308200512
1020C08200512n177956n331382n310498n093555m591580l654823k146320n0183K447300
$$ 308200512 303022556 297691174 292380676 287287121 282695541 279040718 276894398 276844215 279291515
1029B79291515M963475P027130Q244495Q444576P732220O426296M920349L537636K447777
$$ 279291515 284254990 291282120 299526615 307971191 315703411 322129707 327050056 330587692 333035469
1038C33035469J666565J118546P12966L91198J33972o0425j97334k94037l74909m61082
$$ 333035469 334702034 335820580 336533546 336924744 337058716 336998291 336800957 336506920 336132011 335670929
1048C35670929n68352p11059r03588j157264j468621j813659k151490k440414k658043
$$ 335670929 335102577 334391518 333487930 332330666 330862045 329048386 326896896 324456482 321798439
1057C21798439k814388k947808l109912l344288l671799m087353m566803n079975n603542
$$ 321798439 318984051 316036243 312926331 309582043 305910244 301822891 297256088 292176113 286572571
1066B86572571o130772o674614p263145p927037q683319r520664j0395622j1243000
$$ 286572571 280441799 273767185 266504040 258577003 249893684 240373020 229977398 218734398
1074B18734398j1995621j2604999j3048268j3318977j3408203j3287554j2910280j2231293
$$ 218734398 206738777 194133778 181085510 167766533 154358330 141070776 128160496 115929203
1082A15929203j1235352r958934q489151o940394n419631l999014k709293j554627
$$ 115929203 104693851 94734917 86245766 79305372 73885741 69886727 67177434 65622807
1090F5622807n34740L40171J057744J629205K119546K658023L415714M547729O123209
$$ 65622807 65088067 65428238 66485982 68115187 70234733 72892756 76308470 80856199 86979408
1099H6979408Q070898J0169449J2095576J3515491J4189873J4052276J3231926J2013054
$$ 86979408 95050306 105219755 117315331 130830822 145020695 159072971 172304897 184317951
1107A84317951J0743065R722786R113236Q889293Q855801Q722458Q215389P188854
$$ 184317951 195061016 204783802 213897038 222786331 231642132 240364590 248579979 255768833
1115B55768833N694313L980980K418175J372051J080608J577263K690888M113617N502338
$$ 255768833 261463146 265444126 267862301 269234352 270314960 271892223 274583111 278696728 284199066
1124B84199066O571694P149276P188187O748276N960579M987793L981666L044739K208099
$$ 284199066 290770760 297920036 305108223 311856499 317817078 322804871 326786537 329831276 332039375
1133C32039375J436806O65321j49917r93538j787300k423439k813645k920456k755851
$$ 332039375 333476181 334141502 333991585 332998047 331210747 328787308 325973663 323053207 320297356
1142C20297356k356224j757851r99298j43833P00016J389770J798077J873913J673278
$$ 320297356 317941132 316183281 315183983 315040150 315740166 317129936 318928013 320801926 322475204
1151C22475204J335412J010627P84989O45752N08766K84424n9624m80843q93669j226158
$$ 322475204 323810616 324821243 325606232 326251984 326760750 327045174 326985550 326504707 325611038 324384880
1161C24384880j460609j636544j815796k035598k277756k470417k523003k380104k074070
$$ 324384880 322924271 321287727 319471931 317436333 315158577 312688160 310165157 307785053 305710983
1170C05710983j747341j626663j937313k781449m032878n313015o092778n898571m538479
$$ 305710983 303963642 302336979 300399666 297618217 293585339 288272324 282179546 276280975 271742496
1179B71742496k232913M34684K739182M106769M335804L635788K477513J344909N25742
$$ 271742496 269509583 269944267 272683449 276790218 281126022 284761810 287239323 288584232 289109974
1188B89109974L9196k86579o61335j204376j905652k673301l415261m092044m718476
$$ 289109974 289149170 288862591 288201256 286996880 285091228 282417927 279002666 274910622 270192146
1197B70192146n328750n943566o563816p186260p821941q494206r222622j0005340
$$ 270192146 264863396 258919830 252356014 245169754 237347813 228853607 219630985 209625645
1205B09625645j0817719j1627502j2409725j3144818j3798704j4299488j4534760j4378061
$$ 209625645 198807926 187180424 174770699 161625881 147827177 133527689 118992929 104614868
1213A04614868j3735380j2585855j0995068r097753p060299n043883l180981j562686
$$ 104614868 90879488 78293633 67298565 58200812 51140513 46096630 42915649 41352963
1221D1352963k31151Q25925J674371K418546L170333M013558M981799O059503P205067
$$ 41352963 41121812 41947737 43622108 46040654 49210987 53224545 58206344 64265847 71470914
1230G1470914Q376427R543032J0674944J1723671J2610970J3241644J3537702J3475142
$$ 71470914 79847341 89390373 100065317 111788988 124399958 137641602 151179304 164654446
1238A64654446J3100891J2521133J1863136J1231652J0680027J0205669R770985R332771
$$ 164654446 177755337 190276470 202139606 213371258 224051285 234256954 244027939 253360710
1246B53360710Q868065Q380260P884427P382125O840802O194877N374623M346828L142529
$$ 253360710 262228775 270609035 278493462 285875587 292716389 298911266 304285889 308632717 311775246
1255C11775246J846771N46493p32383k058029l557339n321598p301121r257870j0818443
$$ 311775246 313622017 314168510 313436127 311378098 307820759 302499161 295198040 285940170 275121727
1264B75121727j1612511j1425361j0280133q407478o125584l713703j354027Q29182
$$ 275121727 263509216 252083855 241803722 233396244 227270660 223556957 222202930 223032112
1272B23032112K681027L960304M375553L706188J934891o95038l743381o723900r259472
$$ 223032112 225713139 229673443 234048996 237755184 239690075 238995037 235251656 228527756 219268284
1281B19268284j1157913j2379380j2939853j2822113j1957779j0282660p823973m755277
$$ 219268284 208110371 195730991 182791138 169969025 158011246 147728586 139904613 135149336
1289A35149336j385899J907349M768610O931248Q251342Q711548Q411427P547645O378079
$$ 135149336 133763437 135670786 140439396 147370644 155621986 164333534 172744961 180292606 186670685
1298A86670685N161762M082928L188991K373658J423702J18046j660004l841896o152439
$$ 186670685 191832447 195915375 199104366 201478024 202901726 203019772 201359768 197517872 191365433
1307A91365433q159390r369964r354248p861491m905595p95346L905897Q493014J2278232
$$ 191365433 183206043 173836079 164481831 156620340 151714745 150919399 154825296 163318310 175596542
1316A75596542J4754200J5705643J5235443J3699551J1581249R355278P381630N855389
$$ 175596542 190350742 206056385 221291828 234991379 246572628 255927906 263309536 269164925
1324B69164925M808788M149818L717671L337192K858200K172470J209488p4424j689301
$$ 269164925 273973713 278123531 281841202 285178394 288036594 290209064 291418552 291344128 289654827
1333B89654827l572349n528622p190456q052998p611561n568657k022323K471847P023983
$$ 289654827 286082478 280553856 273363400 265310402 257698841 252130184 250107861 252579708 259603691
1342B59603691J0689640J2784882J3098888J1907215R797821P409497N213508L424874
$$ 259603691 270293331 283078213 296177101 308084316 317882137 325291634 330505142 333930016
1350C33930016K045784R76257J08566o41632j356316k147598l156128m505882o234627
$$ 333930016 335975800 336952057 337060623 336418991 335062675 332915077 329758949 325253067 319018440
1359C19018440q235645j0237770j1840992j2602062j2157269j0351600p333222l566589
$$ 319018440 310782795 300545025 288704033 276101971 263944702 253593102 246259880 242693291
1367B42693291K60563L420410N355549N836124M995804L242950J091919j000328k731056
$$ 242693291 242953854 246374264 251729813 257565937 262561741 265804691 266896610 265896282 263165226
1376B63165226l964005m683151m937038m803467m377918l766766l070602k357388j645508
$$ 263165226 259201221 254518070 249581032 244777565 240399647 236632881 233562279 231204891 229559383
1385B29559383r10492j18312P33509J591339K352581K902603L160706L113193K815895
$$ 229559383 228648891 228530579 229264088 230855427 233208008 236110611 239271317 242384510 245200405
1394B45200405K366886J862316J357613Q52432L07465l17021j022872j760293k447605
$$ 245200405 247567291 249429607 250787220 251639652 251947117 251630096 250607224 248846931 246399326
1403B46399326l013553l433609l737412l979683m196071m376984m477768m460907m338398
$$ 246399326 243385773 239952164 236214752 232235069 228038998 223662014 219184246 214723339 210384941
1412B10384941m180260m076538m073200m121265m074841l745880k991524j791839k77825
$$ 210384941 206204681 202128143 198054943 193933678 189858837 186112957 183121433 181329594 181051769
1421A81051769J303597K677936L645306M154167M310150M312077M340496M455128M557590
$$ 181051769 182355366 185033302 188678608 192832775 197142925 201455002 205795498 210250626 214808216
1430B14808216M447575L948192L030072J856803P20005j04503m92077n18837l98502
$$ 214808216 219255791 223203983 226234055 228090858 228810863 228706360 228214283 227695446 227296944
1439B27296944l58067n34267r49326j560287k321072l195496m115295m931240n429173
$$ 227296944 226938877 226404610 225455284 223894997 221573925 218378429 214263134 209331894 203902721
1448B03902721n429515m915028m093285l321781k923202k998448l361702l650951l550205
$$ 203902721 198473206 193558178 189464893 186143112 183219910 180221462 176859760 173208809 169658604
1457A69658604k982655k148437j383877r35898q00152p30171m06666L43743J424007
$$ 169658604 166675949 164527512 163143635 162207737 161407585 160677414 160270748 160614491 162038498
1466A62038498K512569L247376L429584L124009K603302K181968K045212K172794K388077
$$ 162038498 164551067 167798443 171228027 174352036 176955338 179137306 181182518 183355312 185743389
1475A85743389K487660K365627K063465J729698J529217J559086J812439K194748K570572
$$ 185743389 188231049 190596676 192660141 194389839 195919056 197478142 199290581 201485329 204055901
1484B04055901K815036K857247K709083K475128K328682K448254K933636L746357M725055
$$ 204055901 206870937 209728184 212437267 214912395 217241077 219689331 222622967 226369324 231094379
1493B31094379N682373O530705P344551Q288784R438000J0599251J1288795J0928555
$$ 231094379 236776752 243307457 250652008 258940792 268378792 278978043 290266838 301195393
1501C01195393R183940O247464K867107N9586j353932j134033K92015K089481L455048
$$ 301195393 310379333 316626797 319493904 319553490 318199558 317065525 317357540 319447021 322902069
1510C22902069L975983L722152L062172K368584J808319J329537P98530J56212n19142
$$ 322902069 326878052 330600204 333662376 336030960 337839279 339168816 339967346 340123558 339604416
1519C39604416j063576j325912j234589q05130j20926O76956J391144J802292J764374
$$ 339604416 338540840 337214928 335980339 335175209 335054283 335731239 337122383 338924675 340689049
1528C40689049J321411P53860M73709P85943J651763K621613L025360K340355N26657
$$ 340689049 342010460 342764320 343238029 344023972 345675735 348297348 351322708 353663063 354189720
1537C54189720j880836l999520n023422m609795l019714r51958Q14553J770706J854286
$$ 354189720 352308884 348309364 343285942 338676147 335656433 334704475 335519028 337289734 339144020
1546C39144020J401138R30138Q81348J411247K312851L081474L115235J990127k87399
$$ 339144020 340545158 341475296 342356644 343767891 346080742 349162216 352277451 354267578 353980179
1555C53980179l179169n747375p015305o408577m067650q45947K037430L541145L271370
$$ 353980179 350801010 345053635 338038330 331629753 327562103 326716156 328753586 332294731 335566101
1564C35566101J638413l86582j781120j981774j127853P6065P87087M93583p27539
$$ 335566101 337204514 336817932 335036812 333055038 331927185 332003250 332790337 333283920 332556381
1573C32556381k295341l480339l814431l316383k419624j668167j382103j498623j671944
$$ 332556381 330261040 326780701 322966270 319649887 317230263 315562096 314179993 312681370 311009426
1582C11009426j544132j000309k42348L49159M55971l395q68912j883430k861481l754597
$$ 311009426 309465294 308464985 308222637 308571796 309027767 309024372 308155460 306272030 303410549 299655952
1592B99655952m582214n296402n706062n531349m562836k822800o20289J534043L108806
$$ 299655952 295073738 289777336 284071274 278539925 273977089 271154289 270534000 272068043 275176849
1601B75176849L738060L336659K112942M93068j018791k008533k302990k044659j638393
$$ 275176849 278914909 282251568 284364510 284857578 283838787 281830254 279527264 277482605 275844212
1610B75844212j563206k125206l280697m640636n672493n993691n583229m784965m104176
$$ 275844212 274281006 272155800 268875103 264234467 258561974 252568283 246985054 242200089 238095913
1619B38095913l927326m336777n117779n926761o493454o732293o723060o615429o548615
$$ 238095913 234168587 229831810 224714031 218787270 212293816 205561523 198838463 192223034 185674419
1628A85674419o628971o947746p576370q514548r626379j0633306j1205158j1113777
$$ 185674419 179045448 172097702 164521332 156006784 146380405 135747099 124541941 113428164
1636A13428164j0357810r171915p907400o855702o121040n607113n110822m446492
$$ 113428164 103070354 93898439 85991039 79135337 73014297 67407184 62296362 57849870
1644E7849870l525334k359061j009583M67987K053613L760090N609670P600355R666910
$$ 57849870 54324536 51965475 50955892 51423879 53477492 57237582 62847252 70447607 80114517
1653H0114517J1646900J3278981J4262542J4375058J3595867J2155475J0455304Q882484
$$ 80114517 91761417 105040398 119302940 133677998 147273865 159429340 169884644 178767128
1661A78767128P621555O586666N525380M229545K711697J218376O8436n68409p91340
$$ 178767128 186388683 192975349 198500729 202730274 205441971 206660347 206728783 206160374 205369034
1670B05369034q92391j136303j559010j940460j984902j588211r94358p16037j248742
$$ 205369034 204476643 203340340 201781330 199840870 197855968 196267757 195273399 194557362 193308620
1679A93308620k757091m938889p160263q784160r494419r425669r039793q843479r119578
$$ 193308620 190551529 185612640 178452377 169668217 160173798 150748129 141708336 132864857 123745279
1688A23745279r822082j0658045j1274633j1427088j1041498j0177074q947163p466802
$$ 123745279 113923197 103265152 91990519 80563431 69521933 59344859 50397696 42930894
1696D2930894n848110m218671k721181j475391n22037K08845Q77032J662038K677593
$$ 42930894 37082784 32864113 30142932 28667541 28145504 28354349 29231381 30893419 33571012
1705C3571012L914073N229487O387391P119107P188034O446190M876070K616458m3120
$$ 33571012 37485085 42714572 49101963 56221070 63409104 69855294 74731364 77347822 77304702
1714G7304702k707648m964285o488610p129249o936460o115875m930680l598578k230670
$$ 77304702 74597054 69632769 63144159 56014910 49078450 42962575 38031895 34433317 32202647
1723C2202647q36911O17036K142117L690694N172789O504307P653665Q648343R537449
$$ 32202647 31365736 31982772 34124889 37815583 42988372 49492679 57146344 65794687 75332136
1732G5332136J0336600J0993261J1402645J1468763J1174507J0617037R979277R450455
$$ 75332136 85668736 96661997 108064642 119533405 130707912 141324949 151304226 160754681
1740A60754681R133644Q994426Q878537Q594417Q018322P169705O215973N402412M941731
$$ 160754681 169888325 178882751 187761288 196355705 204374027 211543732 217759705 223162117 228103848
1749B28103848M915676N238533N699691O060677O156731N951595N524292N007496M521160
$$ 228103848 233019524 238258057 243957748 250018425 256175156 262126751 267651043 272658539 277179699
1758B77179699M141159L909950L859253M010678M337635M719142M937401M750939M023189
$$ 277179699 281320858 285230808 289090061 293100739 297438374 302157516 307094917 311845856 315869045
1767C15869045K835179J498375M40254Q545L03878J133385K113228K854843L127403
$$ 315869045 318704224 320202599 320642853 320651398 320955276 322088661 324201889 327056732 330184135
1776C30184135K916184K368927J692886J075211O58722N45387P82852J317482J954155
$$ 330184135 333100319 335469246 337162132 338237343 338896065 339441452 340224304 341541786 343495941
1785C43495941K385330K315789J632805N16777o01159j236801j108093k98500P75680
$$ 343495941 345881271 348197060 349829865 350346642 349745483 348508682 347400589 347102089 347877769
1794C47877769J580964J744842J239510L73573l92952o92863m24920K30065R34181
$$ 347877769 349458733 351203575 352443085 352816658 352423706 351730843 351305923 351535988 352470169
1803C52470169J376762J416550J119461O90422L51334K31514L24974N22766O93703
$$ 352470169 353846931 355263481 356382942 357073364 357424698 357656212 357981186 358503952 359197655
1812C59197655P64427P50122P25517P60613Q65936R87320J049271J011695Q94814P51686
$$ 359197655 359962082 360712204 361437721 362198334 363064270 364051590 365100861 366112556 367007370 367759056
1822C67759056O14395M60701K37999p2746m04778o19278n88378k90909J54190N56144
$$ 367759056 368373451 368834152 369072151 368999405 368594627 367975349 367386971 367096062 367250252 367806396
1832C67806396P78275Q32977Q63762J020966J315079J566085J499787R40361l2997
$$ 367806396 368584671 369417648 370281410 371302376 372617455 374183540 375683327 376623688 376590691
1841C76590691j080170j764336j791496j174202k20108O43578J098594J077843P51457
$$ 376590691 375510521 373746185 371954689 370780487 370560379 371203957 372302551 373380394 374131851
1850C74131851L86276J79024J65482K42462K70729J80283J6326r4413k8382K48909
$$ 374131851 374518127 374697151 374862633 375105095 375375824 375556107 375572433 375478020 375449638 375698547
1860C75698547O44379R66263J009559O62117k1705q23403j447410j655579j385841
$$ 375698547 376342926 377309189 378318748 378980865 378959160 378135757 376688347 375032768 373646927
1869C73646927p82967j24283L20778M18625K16027j16234l94326n14335m75922l41453
$$ 373646927 372863960 372739677 373060455 373479080 373695107 373578873 373184547 372670212 372194290 371852837
1879C71852837j74981j2779J25313K07634J87378L5133k20031m81530o28433n89142
$$ 371852837 371677856 371665077 371790390 371998024 372185402 372220535 372000504 371518974 370890541 370301399
1889C70301399l89938j42441K6894N4588k8038j29318j67122j22185l5324L7384P2975
$$ 370301399 369911461 369769020 369795914 369850502 369822464 369693146 369526024 369403839 369368515 369405899 369478874
1900C69478874R0752J18484J52016J48850O7291p9422k03743j86653L9024M22516P98569
$$ 369478874 369569626 369688110 369840126 369988976 370056267 369976845 369773102 369586449 369625473 370047989 370846558
1911C70846558R71031Q24623L98331j29853n37834o74553n31654k29607O1646K16255
$$ 370846558 371817589 372642212 373040543 372910690 372372856 371698303 371166649 370937042 370998688 371214943
1921C71214943K07367R8190j3084n6229k3193L9940P0839L2768o1913j57852j88637
$$ 371214943 371422310 371520500 371507416 371451187 371427994 371467934 371538773 371571541 371509628 371351776 371163139
1932C71163139j13830N2566K41013L53889L10631R1553k45628n84450q01544q22182
$$ 371163139 371049309 371101875 371342888 371696777 372007408 372098961 371853333 371268883 370467339 369645157
1942C69645157o57196l95203j60103n0850r7732k54669m28353n27153n02891l66059
$$ 369645157 368987961 368592758 368432655 368381805 368284073 368029404 367601051 367073898 366571007 366204948
1952C66204948j71279J5029J47667K17743K48413K73476L14484L67202M03786L90091
$$ 366204948 366033669 366048698 366196365 366414108 366662521 366935997 367250481 367617683 368021469 368411560
1962C68411560L06244J61896n684j47896k28233k39754k04353j57700j24702j06049
$$ 368411560 368717804 368879700 368874016 368726120 368497887 368258133 368053780 367896080 367771378 367665329
1972C67665329q1062k5750O4240J66168K41547K61078K26974J75209J55869K01645
$$ 367665329 367584267 367558517 367622757 367788925 368030472 368291550 368518524 368693733 368849602 369051247
1982C69051247L03802M13475M65050M12178K53296L4027j72882l00369l13988k22054
$$ 369051247 369355049 369768524 370233574 370645752 370899048 370933075 370760193 370459824 370145836 369923782
1992C69923782o7367R3345K10495K58332K38533J75781J03912N1194K9029K9297L1777
$$ 369923782 369856415 369949760 370160255 370418587 370657120 370832901 370936813 370988007 371017036 371046333 371078110
2003C71078110J8310j5068n4512p7133o5689k1858L1357O1340M2267l0213j35574k38647
$$ 371078110 371096420 371081352 371026840 370949707 370884018 370862160 370893517 370954857 370997124 370966911 370831337 370592690
2015C70592690l05214l17078k77557k07787j35918q5525o7177p6675r8725j14746j10473
$$ 370592690 370287476 369970398 369692841 369485054 369349136 369263611 369196434 369119759 369021034 368906288 368795815
2026C68795815q2131l6888J1558M9630P0114P3204O3476M4785J7204k1400p0343j22376
$$ 368795815 368713684 368676796 368688354 368737984 368808098 368881302 368944778 368989563 369006767 368985367 368915024 368792648
2038C68792648j64489j83373j74484j45416j13831r7466j02882j21307j32027j14708
$$ 368792648 368628159 368444786 368270302 368124886 368011055 367913589 367810707 367689400 367557373 367442665
2048C67442665o3019R308P2975R8038O9046m272r2583j60141j83907j65214j28479
$$ 367442665 367379646 367388954 367461929 367559967 367629013 367624741 367532158 367372017 367188110 367022896 366894417
2059C66894417j07384j26991j89629k74734l49732l85971l72124l15666k36397j54876
$$ 366894417 366787033 366660042 366470413 366195679 365845947 365459976 365087852 364772186 364535789 364380913
2069C64380913q4152k8267J4228M4671O1645O3324M9019K2697q468l6507n4550n8251
$$ 364380913 364296761 364268494 364282722 364327393 364389038 364452362 364501381 364524078 364515610 364479103 364424553 364366302
2081C64366302m6005j8539J8997N6725Q1138P9460M5815j4343q4725j44729j76354
$$ 364366302 364320297 364301758 364320755 364377480 364458618 364538078 364583893 364569550 364484825 364340096 364163742
2092C64163742j72729j37902q4457k7008K1248N0773N5771L4943o600n4206q8196q9112
$$ 364163742 363991013 363853111 363768654 363741646 363762894 363813667 363869438 363904381 363897781 363843575 363755379 363666267
2104C63666267m9629J8921Q8120J23825J03836K9335p3014j64070k09999j98593j42441
$$ 363666267 363616638 363635559 363723679 363847504 363951340 363980675 363907661 363743591 363533592 363334999 363192558
2115C63192558p0266j2551J3085N416k2888n4741p6484q1826p2593n6916m6005n0125
$$ 363192558 363122292 363109741 363122826 363128242 363105354 363050613 362974129 362892303 362819710 362762794 362716789 362666664
2127C62666664p3013j08795j40763j48582j18294n3635K3346P9728Q9912M9820j8120
$$ 362666664 362593651 362484856 362344093 362195511 362077217 362023582 362046928 362126656 362216568 362266388 362248268
2138C62248268p5912r0676n1918K1057R0294J20011R5749L2081l6087p1869n6305K938
$$ 362248268 362172356 362081680 362029762 362050819 362141113 362261124 362356873 362388954 362352867 362280998 362224693 362227631
2150C62227631P6370J27106J27677P1984k3918j30196k14844k55279k44408j90887
$$ 362227631 362304001 362431107 362558784 362630768 362606850 362476654 362261810 362006531 361762123 361571236
2160C61571236j15280m2763M425J2893j6708p0305j25580j60865j64452j40343j04599
$$ 361571236 361455956 361413193 361417618 361430511 361413803 361343498 361217918 361057053 360892601 360752258 360647659
2171C60647659p7285p0076p9613r1171q7777o3095k6283K518M425k5749p6027j21956
$$ 360647659 360570374 360500298 360420685 360329514 360241737 360178642 360152359 360154877 360159302 360133553 360057526 359935570
2183C59935570j40419j20964o9084m006N1689Q0643P5073L8376j7853p6217j18752
$$ 359935570 359795151 359674187 359605103 359601097 359652786 359733429 359808502 359846878 359829025 359752808 359634056
2194C59634056j31302j09787o2294p553L2463M2954K1782j9799o3324r4146j06430
$$ 359634056 359502754 359392967 359330673 359323120 359355583 359398537 359420319 359400520 359337196 359243050 359136620
2205C59136620j05896j04676j14708j41868j83029k27395k59666k66151k38877j80626
$$ 359136620 359030724 358926048 358811340 358669472 358486443 358259048 357999382 357733231 357494354 357313728
2215C57313728j04255k9602K4376M5700L3607l242n1461r8571j36605j61285j71280
$$ 357313728 357209473 357179871 357204247 357249947 357283554 357280312 357228851 357130280 356993675 356832390 356661110
2226C56661110j66664j50643j30081j13716j08604j15662j27678j33057j22756r6055
$$ 356661110 356494446 356343803 356213722 356100006 355991402 355875740 355748062 355615005 355492249 355396194
2236C55396194o2484l7041l1929m8828p8850j05743j14441r8381o2676k0828J1177
$$ 355396194 355333710 355296669 355264740 355215912 355137062 355031319 354916878 354818497 354755821 354734993 354746170
2247C54746170K2545J2741q011k4643k4147m234K4605M2762L1624j6021r0333j66320
$$ 354746170 354768715 354781456 354773445 354748802 354724655 354720421 354745026 354787788 354819412 354803391 354713058 354546738
2259C54546738k15721k19231j77574j11962n4474l3683n9052j15127j68877j85776
$$ 354546738 354331017 354111786 353934212 353822250 353767776 353734093 353675041 353559914 353391037 353205261
2269C53205261j50413p6828l624K5940r270r2468j71967j87492j01700P6637K94304
$$ 353205261 353054848 352978020 352974396 353000336 352991066 352898598 352726631 352539139 352437439 352514076 352808380
2280C52808380M78058N69687N49354M38919K85149J34125J5335o1607r8610j00785
$$ 352808380 353286438 353856125 354405479 354844398 355129547 355263672 355279007 355217400 355118790 355018005
2290C55018005p3127k4224L2006P8201J03264J09901J16844J51368K35252L71818N39628
$$ 355018005 354944878 354920654 354952660 355030861 355134125 355244026 355360870 355512238 355747490 356119308 356658936
2301C56658936O94847P83157P59010O05049L46489N2414j81389k62908j40191J75591
$$ 356658936 357353783 358136940 358895950 359500999 359847488 359899902 359718513 359455605 359315414 359491005
2311C59491005O06651J027413J299705J311035J010781M37011k77786r31473j315689
$$ 359491005 360097656 361125069 362424774 363735809 364746590 365183601 364905815 363974342 362658653
2320C62658653j303673r24987l78533M3030R5100k82516r18617j494561j719703j496239
$$ 362658653 361354980 360429993 360051460 360094490 360189590 359907074 358988457 357493896 355774193 354277954
2330C54277954r67598m21600j12801j29852l97835q05015j340294k111473l199349
$$ 354277954 353310356 352888756 352775955 352646103 352248268 351443253 350102959 347991486 344792137
2339C44792137m443359n333672n150184l324051J62773M595947Q718071J1228828J1348687
$$ 344792137 340348778 335015106 329864922 326540871 326703644 331299591 340017662 351246490 362595177
2348C62595177R145965N461045J485252j763992l799782m706307m908905m856262m800949
$$ 362595177 371741142 377202187 378687439 376923447 373123665 368417358 363508453 358652191 353851242
2357C53851242m767609m661483m404183m002304l526573l050270k606621k191582j796264
$$ 353851242 349083633 344422150 340017967 336015663 332489090 329438820 326832199 324640617 322844353
2366C22844353j427727j104546q33397n95836l57800r5672J89056M75922P49149J015682
$$ 322844353 321416626 320312080 319478683 318882847 318525047 318429375 318618431 319094353 319843502 320859184
2376C20859184J298676J611481J931953K201462K350349K335854K164764J888123J572799
$$ 320859184 322157860 323769341 325701294 327902756 330253105 332588959 334753723 336641846 338214645
2385C38214645J271058J006660P79877N84945M20342K88963J91422J20506O4049J4801
$$ 338214645 339485703 340492363 341272240 341857185 342277527 342566490 342757912 342878418 342942467 342957268
2395C42957268k5978m8523m5166j8044J8730M5090M4975J4382l7041r1171j27259j31301
$$ 342957268 342931290 342882767 342837601 342819557 342838287 342883377 342928352 342942734 342905693 342814522 342687263 342555962
2407C42555962r9945m4213J4878N2490N1269J0338n3635j13639j45073j38703j03798
$$ 342555962 342456017 342411804 342426682 342479172 342530441 342540779 342487144 342373505 342228432 342089729 341985931
2418C41985931o3057l9253m4861p5798j16424j47820j57547j44729j20201j01510j05171
$$ 341985931 341922874 341883621 341838760 341762962 341646538 341498718 341341171 341196442 341076241 340974731 340869560
2429C40869560j38664j95847k57110k97127k95296k47001j66512q1825k2163m654k7199
$$ 340869560 340730896 340535049 340277939 339980812 339685516 339438515 339272003 339190178 339168015 339163361 339136162
2440C39136162p0992j10511j25351j07918o3744p477M4480P9460R0561P7400M5586
$$ 339136162 339065170 338954659 338829308 338721390 338657646 338650169 338694649 338774109 338864670 338942070 338987656
2451C38987656M196l6087o5575p9498p8430o9237o1340o3286p8736j04560j31569j48316
$$ 338987656 338991852 338955765 338890190 338810692 338732262 338663025 338601685 338538399 338459663 338355103 338223534 338075218
2463C38075218j46293j24588r1210o0196m5242n2796p9917j15166j44920j60790j61705
$$ 338075218 337928925 337804337 337713127 337652931 337607689 337554893 337474976 337359810 337214890 337054100 336892395
2474C36892395j53389j44157j39809j43280j54190j71700j93863k16865k33040k33650
$$ 336892395 336739006 336594849 336455040 336311760 336157570 335985870 335792007 335575142 335342102 335108452
2484C35108452k12822j72997j26953r2888q5411j07078j45340j78108j85700j61972
$$ 335108452 334895630 334722633 334595680 334502792 334417381 334310303 334164963 333986855 333801155 333639183
2494C33639183j18866q0109o9274r6207j50452k06184k34337k17629j59530q2779j8692
$$ 333639183 333520317 333440208 333370934 333274727 333124275 332918091 332683754 332466125 332306595 332223816 332205124
2505C32205124Q507q507n6763j12076j51023j62392j49803j27068j08414j00174r9525
$$ 332205124 332213631 332205124 332148361 332036285 331885262 331722870 331573067 331445999 331337585 331237411 331137886
2516C31137886r8038q9378p3433n6686m6463m6273n2795n9052n9089n2681m5281m2762
$$ 331137886 331039848 330950470 330877037 330820351 330773888 330727615 330674820 330615768 330556679 330503998 330458717 330415955
2528C30415955m6997n1957m7874k7924M883L7193N0583L3531j1558o6376j06811j15166
$$ 330415955 330368958 330317001 330269127 330241203 330246086 330283279 330333862 330367393 330355835 330289459 330182648 330067482
2540C30067482r1095n1727k1630j8158m1008p2403q8424p3967l2158J7738N0354M9553
$$ 330067482 329976387 329924660 329903030 329884872 329843864 329771461 329683037 329609070 329576912 329594650 329645004 329694557
2552C29694557J5335l8223r2163j33629j59607j74026j80283j76239j56479j17149
$$ 329694557 329709892 329671669 329579506 329445877 329286270 329112244 328931961 328755722 328599243 328482094
2562C28482094o4888j6327Q469l510m9171j09673j59225j79253j68076j41983j25198
$$ 328482094 328417206 328400879 328409348 328405838 328356667 328246994 328087769 327908516 327740440 327598457 327473259
2573C27473259j35613j73912k23121k57149k56424k17857j57929j02844p5340q3695
$$ 327473259 327337646 327163734 326940613 326683464 326427040 326209183 326051254 325948410 325873070 325789375
2583C25789375j18522j59226j85852j87912j69372j44082j28021j31683j54991j88484
$$ 325789375 325670853 325511627 325325775 325137863 324968491 324824409 324696388 324564705 324409714 324221230
2593C24221230k17629k28424k13509j75857j27831q6860o9237q1596j18332j63727
$$ 324221230 324003601 323775177 323561668 323385811 323257980 323171120 323101883 323020287 322901955 322738228
2603C22738228j99166k12211k02408j79253j55067j36108j18294r1438m8600M692M9630
$$ 322738228 322539062 322326851 322124443 321945190 321790123 321654015 321535721 321444283 321395683 321400375 321450005
2614C21450005O2599K7961n0163j47896k31742k74392k67257k22779j65481j18180
$$ 321450005 321512604 321540565 321490402 321342506 321110764 320836372 320569115 320346336 320180855 320062675
2624C20062675r2449q6250r0694r7580j03283j07479j08262j00555p8945m4060o695
$$ 320062675 319970226 319883976 319793282 319695702 319592419 319484940 319376678 319276123 319197178 319153118 319146423
2635C19146423J6766J2379k0218o5670r9087j01109o9084k0942J4934J5526k3174q3256
$$ 319146423 319163189 319175568 319155350 319089680 318990593 318889484 318820400 318799458 318814392 318829918 318806744 318723488
2647C18723488j34010j48392j16329m9134K6436Q2016R9144P5989K5864l0899p5322
$$ 318723488 318589478 318441086 318324757 318275623 318302059 318384075 318483219 318559208 318585072 318554173 318478851
2658C18478851r7713r8515q6307p1507o0291n1670l9787j7701J4916N0583P5512P5378
$$ 318478851 318381138 318282623 318196316 318124809 318064518 318012848 317973061 317955360 317970276 318020859 318096371 318171749
2670C18171749M3430j6231q9226j56727k01969k16160j99394j59416j08757o1016k8362
$$ 318171749 318215179 318198948 318109722 317952995 317751026 317534866 317335472 317176056 317067299 317006283 316977921
2681C16977921j9169l5439p2269j18046j58768j82705j84631j68057j43089j22013
$$ 316977921 316958752 316923313 316851044 316732998 316574230 316391525 316206894 316038837 315895748 315773735
2691C15773735j13869j21097j39027j58634j71127j71795j63136j52550j49421j59416
$$ 315773735 315659866 315538769 315399742 315241108 315069981 314898186 314735050 314582500 314433079 314273663
2701C14273663j81656k08149k29016k37159k33517k26193k26631k42290k71759l05519
$$ 314273663 314092007 313883858 313654842 313417683 313184166 312957973 312731342 312489052 312217293 311911774
2711C11911774l29209l32164l11871k75173k35520k06489j97201k09351k37159k69852
$$ 311911774 311582565 311250401 310938530 310663357 310427837 310221348 310024147 309814796 309577637 309307785
2721C09307785k94838l02086k87857k57301k23885k05650k17419k64873l39432m21448
$$ 309307785 309012947 308710861 308423004 308165703 307941818 307736168 307518749 307253876 306914444 306492996
2731C06492996m87003n17540n07126m63657m04053l45459k98576k63386k32277j97144
$$ 306492996 306005993 305488453 304981327 304517670 304113617 303768158 303469582 303206196 302973919 302776775
2741C02776775j54914j12744q5258q7719j27869j99432k81868l47576l72563l47862
$$ 302776775 302621861 302509117 302423859 302336140 302208271 302008839 301726971 301379395 301006832 300658970
2751C00658970k82936k03152j38168j10283j26057j76525k43626l10154l65810m08268
$$ 300658970 300376034 300172882 300034714 299924431 299798374 299621849 299378223 299068069 298702259 298293991
2761B98293991m39243m59595m66843m57573m31575l94535l56388l27168l11851l08991
$$ 298293991 297854748 297395153 296928310 296470737 296039162 295644627 295288239 294961071 294649220 294340229
2771B94340229l14198l24020l40099l67546m09127m59919n06038n29328n16834m68330
$$ 294340229 294026031 293702011 293361912 292994366 292585239 292125320 291619282 291089954 290573120 290104790
2781B90104790l98178l28846k79446k57511k55280k56195k44941k15855j75362j36966
$$ 290104790 289706612 289377766 289098320 288840809 288585529 288329334 288084393 287868538 287693176 287556210
2791B87556210j12668j06735j15165j30158j46065j63498j87625k23198k69642l19481
$$ 287556210 287443542 287336807 287221642 287091484 286945419 286781921 286594296 286371098 286101456 285781975
2801B85781975l60718l81317l75157l42330k90280k30713j77021j41315j31645j48278
$$ 285781975 285421257 285039940 284664783 284322453 284032173 283801460 283624439 283483124 283351479 283203201
2811B83203201j83201k21214k45457k44598k17915j75743j34811j10493j09863j30386
$$ 283203201 283020000 282798786 282553329 282308731 282090816 281915073 281780262 281669769 281559906 281429520
2821B81429520j62869j97525k27165k49214k63176k69261k68058k62318k58141k63080
$$ 281429520 281266651 281069126 280841961 280592747 280329571 280060310 279792252 279529934 279271793 279008713
2831B79008713k82555l15666l54214l85875m01574m00200l90224l85342l97110m29191
$$ 279008713 278726158 278410492 278056278 277670403 277268829 276868629 276478405 276093063 275695953 275266762
2841B75266762m76628n29136n77946o19488o55708o89163p19261p40242p44667p29695
$$ 275266762 274790134 274260998 273683052 273063564 272407856 271718693 270999432 270259190 269514523 268784828
2851B68784828p02057o77547o74439p03621p60898q27847q79802q99315q86212q58364
$$ 268784828 268082771 267405224 266730785 266027164 265266266 264438419 263558617 262659302 261773090 260914726
2861B60914726q43601q65173r29756j024418j122570j195774j225949j210537j161670
$$ 260914726 260071125 259205952 258276196 257251778 256129208 254933434 253707485 252496948 251335278
2870B51335278j099720j045113j012020j004524j016198j033325j041946j035500j020641
$$ 251335278 250235558 249190445 248178425 247173901 246157703 245124378 244082432 243046932 242026291
2879B42026291j016026j044178j119766j239223j380844j513768j612758j670056j697006
$$ 242026291 241010265 239966087 238846321 237607098 236226254 234712486 233099728 231429672 229732666
2888B29732666j715565j746101j797218j864529j935501j996498k036572k047424k022514
$$ 229732666 228017101 226271000 224473782 222609253 220673752 218677254 216640682 214593258 212570744
2897B12570744j958638j859359j737576j613541j505565j421452j353187j281815j189232
$$ 212570744 210612106 208752747 207015171 205401630 203896065 202474613 201121426 199839611 198650379
2906A98650379j069431r33190q01544o95381o24847n87807n76782n86605o19488o81038
$$ 198650379 197580948 196647758 195846214 195150833 194525986 193938179 193361397 192774792 192155304 191474266
2916A91474266p72152q81538r86767j062126j091481j076393j035366r93728r68457
$$ 191474266 190702114 189820576 188833809 187771683 186680202 185603809 184568443 183574715 182606258
2925A82606258r59930r50317r14555q35686p15465n75333m45137l46909k81906k29969
$$ 182606258 181646328 180696011 179781456 178945770 178230305 177654972 177209835 176862926 176581020 176351051
2935A76351051j61228n4188R0599K48433L82347M61101M72431M25530L42197K42520
$$ 176351051 176189823 176135635 176226234 176474667 176857014 177318115 177790546 178216076 178558273 178800793
2945A78800793J36718K5330r2068k08130l05004l61213l62492l12347k32678j55849
$$ 178800793 178937511 178962841 178870773 178662643 178357639 177996426 177633934 177321587 177088909 176933060
2955A76933060j12362j17378j66798k39792l10402l59211l83339l96385m23393m87385
$$ 176933060 176820698 176703320 176536522 176296730 175986328 175627117 175243778 174847393 174424000 173936615
2965A73936615n97839p44820r01966j037903j128769j164703j148262j083794r68437
$$ 173936615 173338776 172593956 171691990 170654087 169525318 168360615 167212353 166128559 165160122
2974A65160122p89528n32608j96133J98765O08864R83620J284694J500817J648636
$$ 165160122 164370594 163837986 163641853 163840618 164449482 165433102 166717796 168218613 169867249
2983A69867249J758079J852741J936608J993236K000256J946640J844101J725006J628151
$$ 169867249 171625328 173478069 175414677 177407913 179408169 181354809 183198910 184923916 186552067
2992A86552067J581402J589851J636333J690350J721554J710472J651344J550064J419449
$$ 186552067 188133469 189723320 191359653 193050003 194771557 196482029 198133373 199683437 201102886
3001B01102886J274567J130714J001396Q97255Q23384P77187P48768P22809O83651
$$ 201102886 202377453 203508167 204509563 205406818 206230202 207007389 207756157 208478966 209162617
3010B09162617O19983N28927M16374K95010J78356P5627j1635q9359j66035k46105
$$ 209162617 209782600 210311527 210727901 211022911 211201267 211276894 211265259 211175900 211009865 210763760
3020B10763760l26615l97415m47445m72755m80728m88129n12276n61828o31771p05452
$$ 210763760 210437145 210039730 209592285 209119530 208638802 208150673 207638397 207076569 206444798 205739346
3030B05739346p63417p91931p86819p51400o90899o10047n13973m14142l30086k85912
$$ 205739346 204975929 204183998 203397179 202645779 201954880 201344833 200830860 200416718 200086632 199800720
3040A99800720l01456l81184n10883o62899q08430r29718j025639j106739j186275
$$ 199800720 199499264 199118080 198607197 197944298 197135868 196206150 195180511 194073772 192887497
3049A92887497j269627j351509j419086j459255j466160j443367j403427j362591j336041
$$ 192887497 191617870 190266361 188847275 187388020 185921860 184478493 183075066 181712475 180376434
3058A80376434j333675j357117j400337j452064j499615j532803j545982j537380j508198
$$ 180376434 179042759 177685642 176285305 174833241 173333626 171800823 170254841 168717461 167209263
3067A67209263j462593j409416j364289j346969j374169j448078j549854j643353j690597
$$ 167209263 165746670 164337254 162972965 161625996 160251827 158803749 157253895 155610542 153919945
3076A53919945j673184j604299j525135j482153j499386j561451j619053j614962j515913
$$ 153919945 152246761 150642462 149117327 147635174 146135788 144574337 142955284 141340322 139824409
3085A39824409j331796j110430r13496p86123p40147p55968q01744q52900r01823r54342
$$ 139824409 138492613 137382183 136468687 135682564 134942417 134186449 133384705 132531805 131629982 130675640
3095A30675640j017189j088028j153555j195335j199217j159716j080894r72872q48789
$$ 130675640 129658451 128570423 127416868 126221533 125022316 123862600 122781706 121808834 120960045
3104A20960045p23372o11953n26114m69932m35639m06008l60527k86512j85156p1106
$$ 120960045 120236673 119624720 119098606 118628674 118193035 117787027 117426500 117139988 116954832 116883726
3114A16883726L4723J16263J69344K02245K30437K67916L22856L95012M79040N67704
$$ 116883726 116918449 117034712 117204056 117406301 117636738 117904654 118227510 118622522 119101562 119669266
3124A19669266O54392P35006Q06551Q67529R16720R53846R79395R96160J009007J024131
$$ 119669266 120323658 121058664 121865215 122732744 123649464 124603310 125582705 126578865 127587872 128612003
3134A28612003J046782J078358J114072J143799J156635J145831J113290J068526J023245
$$ 128612003 129658785 130737143 131851215 132995014 134151649 135297480 136410770 137479296 138502541
3143A38502541R84830R53303R22212Q85230Q41560P95984P54566P17831O77242O19517
$$ 138502541 139487371 140440674 141362886 142248116 143089676 143885660 144640226 145358057 146035299 146654816
3153A46654816N35459M28724L17164K24647J68543J48278J44815J30386Q4095L729
$$ 146654816 147190275 147618999 147936163 148160810 148329353 148477631 148622446 148752832 148836927 148840656
3163A48840656r3612j80693k36740k57931k59314k64635k92425l46164m13237m73843
$$ 148840656 148747044 148566351 148329611 148071680 147812366 147547731 147255306 146909142 146495905 146022062
3173A46022062n13267n30005n35307n45244n69153o03685o33307o39276o10495n51328
$$ 146022062 145508795 144978790 144443483 143898239 143329086 142725401 142092094 141452818 140842323 140290995
3183A40290995m81377m27456m11568m39910m99878n64499o04744o03457n63965n10301
$$ 140290995 139809618 139382162 138970594 138530684 138030806 137466307 136861563 136258106 135694141 135183840
3193A35183840m76923m92869n68151o87094q15000r12295r51748r30109q69083q06065
$$ 135183840 134706917 134214048 133645897 132958803 132143803 131231508 130279760 129349651 128480568 127674503
3203A27674503p78160q07333q91905j007499j116524j183319j188126j136160j056203
$$ 127674503 126896343 126089010 125197105 124189606 123073082 121889763 120701637 119565477 118509274
3212A18509274r89562r73157j022816j126003j247015j342717j381092j354217j278954
$$ 118509274 117519712 116546555 115523739 114397736 113150721 111808004 110426912 109072695 107793741
3221A07793741j185436j102667j045627j013537r95035r77612r54704r26618q97236
$$ 107793741 106608305 105505638 104460011 103446474 102451439 101473827 100519123 99592505 98695269
3230I8695269q69685q43916q16860p84130p41529o84939o11524n19371m09556k86140
$$ 98695269 97825584 96981668 96164808 95380678 94639149 93954210 93342686 92823315 92413759 92127619
3240I2127619j55850k5835R8210K12936L16649M08124M87919N59006O30207P14550
$$ 92127619 91971769 91945934 92044144 92257080 92573729 92981853 93469772 94028778 94658985 95373535
3250I5373535Q26245R73367J153002J351242J547909J725283J876049K004604K122908
$$ 95373535 96199780 97173147 98326149 99677391 101225300 102950583 104826632 106831236 108954144
3259A08954144K242536K368231K494955K611856K708168K777615K819967K838726K837687
$$ 108954144 111196680 113564911 116059866 118671722 121379890 124157505 126977472 129816198 132653885
3268A32653885K820187K790727K756977K730484K723227K741680K781238K826920K858639
$$ 132653885 135474072 138264799 141021776 143752260 146475487 149217167 151998405 154825325 157683964
3277A57683964K860908K830143K775688K712536K652817K598209K541542K474423K396297
$$ 157683964 160544872 163375015 166150703 168863239 171516056 174114265 176655807 179130230 181526527
3286A81526527K317410K254276K217331K201653K186374K143631K055607J925125J777096
$$ 181526527 183843937 186098213 188315544 190517197 192703571 194847202 196902809 198827934 200605030
3295B00605030J646137J557923J515808J498222J471558J407566J298942J161709J025982
$$ 200605030 202251167 203809090 205324898 206823120 208294678 209702244 211001186 212162895 213188877
3304B13188877R19628Q55484Q27332Q17127Q06541P86038P57255P26681O99387O74152
$$ 213188877 214108505 214963989 215791321 216608448 217414989 218201027 218958282 219684963 220384350 221058502
3314B21058502O46324O13003N78880N55191N53761N78194O19011O56089O67057O37398
$$ 221058502 221704826 222317829 222896709 223451900 224005661 224583855 225202866 225858955 226526012 227163410
3324B27163410N67494M71325L69758K82288K20623J87416J79539J91268K17553K54230
$$ 227163410 227730904 228202229 228571987 228854275 229074898 229262314 229441853 229633121 229850674 230104904
3334B30104904K97394L43113L86276M21162M41341M39797M11033L54233K76146J90640
$$ 230104904 230402298 230745411 231131687 231552849 231994190 232433987 232845020 233199253 233475399 233666039
3344B33666039J14555N9490K5253j335l9310j01986j87702k78302l48758l80783l72715
$$ 233666039 233780594 233840084 233865337 233864002 233824692 233722706 233535004 233256702 232907944 232527161 232154446
3355B32154446l39222k99282k63062k23541j61419n8937Q5640K53944M15077N41077
$$ 232154446 231815224 231515942 231252880 231029339 230867920 230808983 230894623 231148567 231563644 232104721
3365B32104721O19888O57692O69823O69479O60134O38199O01024N53341N06020M67510
$$ 232104721 232724609 233382301 234052124 234721603 235381737 236019936 236620960 237174301 237680321 238147831
3375B38147831M34418L91464L19595K11067P9632m1694j13774j10721l2139R5825K32353
$$ 238147831 238582249 238973713 239293308 239504375 239584007 239542313 239428539 239317818 239285679 239381504 239613857
3386B39613857L39108L93257L93772L56388L05176K61536K37674K33727K40440K44846
$$ 239613857 239952965 240346222 240739994 241096382 241401558 241663094 241900768 242134495 242374935 242619781
3396B42619781K37752K19402J99203J90869K03495K34203K67601K82726K65503K17896
$$ 242619781 242857533 243076935 243276138 243467007 243670502 243904705 244172306 244455032 244720535 244938431
3406B44938431J58596J14612J06354J35594J84230K22378K24247J81103J05266K4147
$$ 244938431 245097027 245211639 245317993 245453587 245637817 245860195 246084442 246265545 246370811 246394958
3416B46394958l3454m9839k4414K8305Q7432J33839J56479J53046J28555R2354N5599
$$ 246394958 246361504 246311665 246287251 246315556 246402988 246536827 246693306 246846352 246974907 247067261 247122860
3427B47122860K9907K4033M1561P8545J25103J69219K03209K26231K42577K55165K59437
$$ 247122860 247152767 247176800 247218361 247296906 247422009 247591228 247794437 248020668 248263245 248518410 248777847
3438B48777847K42348J89915R9258j2970j11656j57566j26209k2431J19477K51464
$$ 248777847 249020195 249210110 249309368 249296398 249184742 249027176 248900967 248878536 248998013 249249477
3448B49249477L34072L53985L26081K79750K39964K14062J91726J58444J09920N8976
$$ 249249477 249583549 249937534 250263615 250543365 250783329 250997391 251189117 251347561 251457481 251516457
3458B51516457K7847L3836P6409J36490J87358K10934K07462J92986J87225J99547
$$ 251516457 251544304 251578140 251654549 251791039 251978397 252189331 252396793 252589779 252777004 252976551
3468B52976551K24724K47154K52609K36531K04315J65424J26591Q9588N4245K3041
$$ 252976551 253201275 253448429 253701038 253937569 254141884 254307308 254433899 254523487 254577732 254600773
3478B54600773R54p534k671J1673L2425O2180J07841J71871K43111K97775L11470K77710
$$ 254600773 254601727 254594193 254591522 254603195 254635620 254697800 254805641 254977512 255220623 255518398 255829868 256107578
3490B56107578K17953J71833J71871K18506K74620K87705K26173J06106j4439o9866
$$ 256107578 256325531 256497364 256669235 256887741 257162361 257450066 257676239 257782345 257767906 257698040
3500B57698040k9984P9136J90602K39906K06127J22433N2185M5891J11160K14996L11222
$$ 257698040 257668056 257747192 257937794 258177700 258383827 258506260 258558445 258604336 258715496 258930492 259241714
3511B59241714L75004M14753M57211N17692N80044O01101N37548L76091J47495q6593
$$ 259241714 259616718 260031471 260488682 261006374 261586418 262187519 262725067 263101158 263248653 263162060
3521B63162060k60964l34892l03841j92775l9044J22204K64797L71857M34570M54274
$$ 263162060 262901096 262566204 262262363 262069588 262030544 262152748 262417545 262789402 263223972 263678246
3531B63678246M46624M39682M63600N31369O22978O85081O52905M87671K09083j00002
$$ 263678246 264124870 264564552 265028152 265559521 266182499 266867580 267520485 268008156 268217239 268117237
3541B68117237l25317l78838k48432r594K14500L22438K91252J86481J14136J51844
$$ 268117237 267791920 267413082 267164650 267155056 267369556 267691994 267983246 268169727 268283863 268435707
3551B68435707L04566N12428P05547Q55999R84554J114483J209641J155205Q13846
$$ 268435707 268740273 269252701 269958248 270814247 271798801 272913284 274122925 275278130 276091976
3560B76091976J30711p81346j647701k142219k048207j375656l62587O39286J326542
$$ 276091976 276222687 275441341 273793640 271651421 269603214 268227558 267864971 268504257 269830799
3569B69830799J563969J405620J027565O32267L77922L53775N79739R99546J469479
$$ 269830799 271394768 272800388 273827953 274460220 274838142 275191917 275771656 276771202 278240681
3578B78240681J771183J678276J071682M0016j107292j951542k159367j654091o63299
$$ 278240681 280011864 281690140 282761822 282801838 281694546 279743004 277583637 275929546 275266247
3587B75266247L92990J111793J292248R98841M80289J1539k36415k33517l9959K71645
$$ 275266247 275659237 276771030 278063278 279062119 279542408 279553947 279317532 279084015 279044056 279315701
3597B79315701O52427J056843J401062J556702J401672R03359J70116n68752j055146
$$ 279315701 279968128 281024971 282426033 283982735 285384407 286287766 286457882 285889130 284833984
3606B84833984j113262p24010l1071P13539J231747J304302Q49896j6251r69105j549091
$$ 284833984 283720722 282996712 282965641 283679180 284910927 286215229 287065125 287048874 286079769 284530678
3616B84530678j338902j93348J597290L333702M171086L523216J402836j510010m141044
$$ 284530678 283191776 282998428 284595718 287929420 292100506 295623722 297026558 295516548 291375504
3625B91375504n512848n194626l467694j130542R26399K125645K379951J996479J426087
$$ 291375504 285862656 280668030 277200336 276069794 276996193 279121838 281501789 283498268 284924355
3634B84924355J037788J021461J406556K101421K891655L427315L283367K142353K9888
$$ 284924355 285962143 286983604 288390160 290491581 293383236 296810551 300093918 302236271 302266159
3643C02266159k559528m783516n814209n258808l388119j017151R05991J766128J533795
$$ 302266159 299706631 294923115 289108906 283850098 280461979 279444828 280350819 282116947 283650742
3652B83650742O85195j26895m24653q1462P28664J708832K592048L190251L369694
$$ 283650742 284335937 284209042 283784389 283702927 284431591 286140423 288732471 291922722 295292416
3661B95292416L040218K203903J021729j95752j115665j568909j664524j724949k063827
$$ 295292416 298332634 300536537 301558266 301362514 300246849 298677940 297013416 295288467 293224640
3670B93224640k746658l500843l849946l389530k028255m7474K044029L741188M714699
$$ 293224640 290477982 286977139 283127193 279737663 277709408 277661934 279705963 283447151 288161850
3679B88161850M842224M139729K697563O92234j550827l544312m749031m789486l651619
$$ 288161850 293004074 297143803 299841366 300533600 298982773 295438461 290689430 285899944 282248325
3688B82248325j728096L39871J938305K719516K677231K046337J130543J83201o03752
$$ 282248325 280520229 280860100 282798405 285517921 288195152 290241489 291372032 291555233 290951481
3697B90951481j050625r80358l06435Q34942K025395K677517K308673Q30002j329288
$$ 290951481 289900856 288920498 288614063 289449005 291474400 294151917 296460590 297290592 295961304
3706B95961304l364620m454575m143353k546062k71034J880378L263054L610668L049508
$$ 295961304 292596684 288142109 283998756 281452694 281181660 283062038 286325092 289935760 292985268
3715B92985268J945362P04727l64571j091156j405792j296520p92179K1915R79157
$$ 292985268 294930630 295635357 295270786 294179630 292773838 291477318 290685139 290707054 291686211
3724B91686211J829681K273979K040882R96914p40547k746353m349537m848938l827457
$$ 291686211 293515892 295789871 297830753 298827667 298087120 295340767 290991230 286142292 282314835
3733B82314835j425896J597652M120522N144424M289284K007904o31447k500210l001670
$$ 282314835 280888939 282486591 286607113 291751537 296040821 298048725 297417278 294917068 291915398
3742B91915398k350426j372433r51328j462784k551784l382264l192062j791286L04775
$$ 291915398 289564972 288192539 287241211 285778427 283226643 279844379 276652317 274861031 275165806
3751B75165806K181434L058491K717762J572533L73249k43206p8488N94635J260968
$$ 275165806 277347240 280405731 283123493 284696026 285069275 284826069 284747581 285342216 286603184
3760B86603184J479721J094436K52972p21760j498413j846676j675415j028061p1849
$$ 286603184 288082905 289177341 289430313 288708553 287210140 285363464 283688049 282659988 282588139
3769B82588139R20868J630153J796951J345368M47540n31673j198769j325931r57756
$$ 282588139 283509007 285139160 286936111 288281479 288729019 288197346 286998577 285672646 284714890
3778B84714890l67833J13087K89459J95942M0932M6425K94342O84738J023273J169453
$$ 284714890 284347057 284460144 284749603 284945545 284986477 285032902 285327244 286011982 287035255 288204708
3788B88204708J130428J033516R98631J013679R15738N05142k83757j283912k154064
$$ 288204708 289335136 290368652 291367283 292380962 293296700 293801842 293518085 292234173 290080109
3797B90080109k571411k430993j908664j335640r62410p79877n28965R4776J180458
$$ 290080109 287508698 285077705 283169041 281833401 280870991 280091114 279562149 279656925 280837383
3806B80837383K468167L450908L653298K913551J481228j28174j421928k171841k460251
$$ 280837383 283305550 286756458 290409756 293323307 294804535 294676361 293254433 291082592 288622341
3815B88622341k522411k519245k406464j992760j130829J06125J399804K340888K660447
$$ 288622341 286099930 283580685 281174221 279181461 278050632 278156757 279556561 281897449 284557896
3824B84557896K383175J800212J277161J021938R63383Q12855K72350p46097k026577
$$ 284557896 286941071 288741283 290018444 291040382 292003765 292816620 293088970 292342873 290316296
3833B90316296l140850l671303l431359k548008j359043j90010Q39863J848812L025150
$$ 290316296 287175446 283504143 280072784 277524776 276165733 275975723 276815586 278664398 281689548
3842B81689548M364777N496597N752621M496021J548558k534542o547471r085960r170914
$$ 281689548 286054325 291550922 297303543 301799564 303348122 300813580 294266109 285180149 276009235
3851B76009235o723652k635116J621208M637146N653916M799518K896061R76868k16618
$$ 276009235 269285583 266650467 268271675 272908821 278562737 283362255 286258316 287235184 287018566
3860B87018566n08251k36359M0722j03359p44114j603069k231560k261028j589279
$$ 287018566 286510315 286273956 286314678 286211319 285467205 283864136 281632576 279371548 277782269
3869B77782269m20456Q42685J786442K157879J942043J322460N62382j18084o07548
$$ 277782269 277361813 278204498 279990940 282148819 284090862 285413322 285975704 285857620 285250072
3878B85250072q90865r93652r37882p42950m60625j94626o7539j39217l34301m45709
$$ 285250072 284359207 283365555 282427673 281684723 281224098 281029472 280961933 280822716 280488415 280042706
3888B80042706k37999L97338J331845K214165K619476K257843J124916m83799k101364
$$ 280042706 279804707 280202045 281533890 283748055 286367531 288625374 289750290 289266491 287165127
3897B87165127l280754l753052l484268k633324j456852k18391Q67519J658726K088241
$$ 287165127 283884373 280131321 276647053 274013729 272556877 272338486 273206005 274864731 276952972
3906B76952972K158509J925583J474876Q95863K70481l21751p93838j058732j061573
$$ 276952972 279111481 281037064 282511940 283407803 283678284 283356533 282562695 281503963 280442390
3915B80442390q19854m37985p0572J52569J95160J27525O9104R8991J94454K46544
$$ 280442390 279622536 279184551 279113979 279266548 279461708 279589233 279658337 279757328 279951782 280198326
3925B80198326J42536j41411n03711p65972p75490m96350l1757M31194P16858P39174
$$ 280198326 280340862 280199451 279695740 278929768 278154278 277657928 277626171 278057365 278774223 279513397
3935B79513397N26982J91898j30558l37753l93086l29532k27356j72711k11601l22285
$$ 279513397 280040379 280232277 280101719 279763966 279370880 279041348 278813992 278641281 278429680 278107395
3945B78107395m22344m17519k63118r92K56996L93448L55396J82266k6931j79902k41966
$$ 278107395 277685051 277267532 277004414 277003422 277260418 277653866 278009262 278191528 278164597 277984695 277742729
3956B77742729k36263k03209j58978r0694J0624J18141J74065J33781J2436j15890
$$ 277742729 277506466 277303257 277144279 277053585 277064209 277182350 277356415 277490196 277502632 277386742
3966B77386742j70460j30310n4131l2825j10073k42386l35655l29838k55070k03724
$$ 277386742 277216282 277085972 277031841 276999016 276888943 276646557 276310902 275981064 275725994 275522270
3976B75522270k38399l21369l40100k20642k6455O1073j07173m86165q20636q31642
$$ 275522270 275283871 274962502 274622402 274401760 274375305 274436378 274329205 273843040 273022404 272190762
3986B72190762m78669o8779o3152o76022j585903k065468j569194m21753o5270k511348
$$ 272190762 271712093 271643314 271580162 270904140 269318237 267252769 265683575 265261822 265196552 262685204
3996B62685204r158249j9634571l1448422m0821113
$$ 262685204 253526955 233892384 202443962 161622849
4000A61622849
$$ 161622849
##END=$$ End of the data block
