##TITLE=$$ Begin of the data block
##JCAMP-DX=5.00 $$ ACD/SpecManager v 10.08
##SPECTROMETER/DATA SYSTEM=16PC
##DATE=Mon Sep 02 15:38:51 2013
##DATA TYPE=INFRARED SPECTRUM
##DATA CLASS=XYDATA
##ORIGIN=
##OWNER=
##NPOINTS=3601
##FIRSTX=400.00000000
##LASTX=4000.00000000
##MAXX=4000.00000000
##MINX=400.00000000
##MAXY=38.15573502
##MINY=11.27522373
##XFACTOR=1.0000000000
##YFACTOR=0.000000100000000
##FIRSTY=19.84924126
##DELTAX=1.00000000
##XUNITS=1/CM
##YUNITS=TRANSMITTANCE
##XYDATA=(X++(Y..Y))
400A98492413M7144432L5554790K2321930J1884060O580601N918426P399826Q253632
408C43550110O967087L795356J58616k483445l489380l166732k279587j413422o66733
417C40971870J98594J364517K672996L656082L818894K949409J246720p84188k563171
426C53531723l649559l854446l251954k126731q82073Q9569N52445N26657K65350R4223
436C41295204J90811M49334N33561J07613r07440k225838l325424l743668l348236
445C29025917k413177j450043r07440r26514j294022j604995j519280r53369j02749
454C17854328O98986J191635J340676J351280J538772K129059L100014M156990M861946
463C38223686M861565M089088K823563J561203P61909O11878R42917J357002J479607
$$ plain form
400 198492413 245636845 281191635 303513565 315397625 321978226 327896652 335296478 343550110
408 343550110 350517197 354312553 354471169 351987724 348498344 345331612 343052025 341638603 340971870
417 340971870 341170464 342534981 345207977 348864059 352682953 355632362 356879082 356094894 353531723
426 353531723 349882164 346027718 342775764 340649033 339766960 339856529 340408974 340935631 341200981 341295204
436 341295204 341486015 341935349 342468910 342576523 341669083 339443245 336117821 332374153 329025917
445 329025917 326612740 325162697 324255257 323328743 322034721 320429726 318910446 317957077 317854328
454 317854328 318553314 319744949 321085625 322436905 323975677 326104736 329204750 333361740 338223686
463 338223686 343085251 347174339 349997902 351559105 352321014 352932892 353875809 355232811 356712418
472C56712418J185951O59790K58789K75192P50809J453476K019272K159652J803551
481C67278900J101685L15399l30315p36351r35936j034355j137237j303215j530343
490C61688232j766433j930580j944924j768608j426239j005440o17523l38058j61095
499C50729332m082K36855O08978J052704J407242J466865J054802P8812j440888l360977
509C51829643n409317p193069q245316q136749o629658l820457j83983L524761O497002
518C22232857Q138389Q266716P150917N382615L634490K413254J902199J948814K185860
527C63256111K226601J846695J076507J68076n42374q08563n98297j05591L54271N12543
537C67385979K84691j91040o37665p94602n62553n7564M48761O70509M54255j43891
$$ plain form
472 356712418 357898369 358558159 358816948 359092140 359842949 361296425 363315697 365475349 367278900
481 367278900 368380585 368695984 368365669 367629318 366693382 365659027 364521790 363218575 361688232
490 361688232 359921799 357991219 356046295 354277687 352851448 351846008 351228485 350890427 350729332
499 350729332 350725250 350962105 351571083 352623787 354031029 355497894 356552696 356631508 355190620 351829643
509 351829643 346420326 339227257 330981941 322845192 316215534 312395077 312211094 315735855 322232857
518 322232857 330371246 338637962 345788879 351171494 354805984 357219238 359121437 361070251 363256111
527 363256111 365482712 367329407 368405914 368573990 368031616 367223053 366624756 366519165 366873436 367385979
537 367385979 367670670 367479630 366841965 366047363 365484810 365427246 365876007 366546516 367000771 366856880
547C66856880q85658j465340j655807j414376r00154l99513j91765m21028j033058
556C58490181j803741k447129k748489k655754k286949j850930j526184j361656j256142
565C40553207j022873n09147K98385J237412K029266K405472K238312J610451P83691
574C49624176Q1100k60581j95885J23100M38767N28526L19786q3695m74357o66351
584C49434586o02417l77732j74293j46904l33405o41250r12629j023140r51919p80182
594C43490715o29539n83344o44455p51991q38585q81157r09653r66034j047439j078110
604C35160408r36851n29366J37749R30862J631241K030868K027894J674728J152763
613C43280296O87256M49486M92592P46002J064873J301384J362228J231499R56879
$$ plain form
547 366856880 365971222 364505882 362850075 361435699 360535545 360136032 359944267 359523239 358490181
556 358490181 356686440 354239311 351490822 348835068 346548119 344697189 343171005 341809349 340553207
565 340553207 339530334 339021187 339319572 340556984 342586250 344991722 347230034 348840485 349624176
574 349624176 349705276 349444695 349248810 349371910 349810677 350339203 350658989 350575294 350100937 349434586
584 349434586 348832169 348454437 348280144 348133240 347799835 347158585 346245956 345222816 344270897 343490715
594 343490715 342861176 342277832 341633377 340881386 340042801 339161644 338251991 337285957 336238518 335160408
604 335160408 334223557 333694191 333831940 334762802 336394043 338424911 340452805 342127533 343280296
613 343280296 343967552 344417038 344909630 345655632 346720505 348021889 349384117 350615616 351572495
622C51572495O14585K73171k7008k76032m79126o32782p06977o44417l86200Q4266
632C49391975P00570J303176J684075J671638J222039M61998l49541r31740j111259
641C54042931r00155m83436j22070k9145k84691q25691j497955k132912k604027k853698
651C42309151k901230k840729k823982l006134l451882m042129m452000m256477l147621
660C11386967j157189J257458L355465M441719M217091K945404J327095J34620j82876
669C27725754K97699J073074J539955J345177N51948m49752j205635j450692j212387
678C28215141p29561k80494m2382n4740k71721o30303j080703j575966k065926k526417
688C18956928l006286l636017m555054n780449p102680q103561q319741p476482n651074
$$ plain form
622 351572495 352187080 352460251 352433243 352157211 351678085 351045303 350338326 349693909 349307709 349391975
632 349391975 350092545 351395721 353079796 354751434 355973473 356435471 356085930 355154190 354042931
641 354042931 353142776 352659340 352537270 352508125 352223434 351397743 349899788 347766876 345162849 342309151
651 342309151 339407921 336567192 333743210 330737076 327285194 323243065 318791065 314534588 311386967
660 311386967 310229778 311487236 314842701 319284420 323501511 326446915 327774010 327908630 327725754
669 327725754 328023453 329096527 330636482 331981659 332533607 332083855 330878220 329427528 328215141
678 328215141 327485580 327205086 327162704 327107964 326836243 326205940 325125237 323549271 321483345 318956928
688 318956928 315950642 312314625 307759571 301979122 294876442 286772881 278453140 270976658 265325584
697B65325584l256912q42228J180592K719498L989162N318661O899948Q631458J0143814
706C00109577J0983086J0838184R688378P802429N610313L532639J850395O65131o1951
715C51018181m40025n89715o17256o14204o59638q08143j067391j382637j647720j749992
725C41441460j631356j333809r95864p94487q56171j183701j646270k041169k199287
734C28759346k075729j774521j495781j434784j692276k236557k928543l584004m035377
743C07501774m172039l961849l463040k828140k284012k069302k335014l050537l973179
752B79364662m718475m915161m371090l160687j584377k1839J237697K091389K602425
761B66524544K890014L013516K926311K525978J758919P02915m28676j367417j905059
$$ plain form
697 265325584 262068672 261226444 262407036 265126534 269115696 274434357 281334305 289965763 300109577
706 300109577 311092663 321930847 331619225 339421654 345031967 348564606 350415001 351080132 351018181
715 351018181 350578156 349988441 349371185 348756981 348097343 347289200 346221809 344839172 343191452 341441460
725 341441460 339810104 338476295 337480431 336685944 335829773 334646072 332999802 330958633 328759346
734 328759346 326683617 324909096 323413315 321978531 320286255 318049698 315121155 311537151 307501774
743 307501774 303329735 299367886 295904846 293076706 290792694 288723392 286388378 283337841 279364662
752 279364662 274646187 269731026 265359936 262199249 260614872 260593033 261830730 263922119 266524544
761 266524544 269414558 272428074 275354385 277880363 279639282 280342197 279913521 278546104 276641045
770B76641045j978054j678620j196670p31888m23126l19405l90358n53017o99863p22466
780B67947578n36575j11503N08708J206246J826534K239208K397919K362957K273598
789B80114670K276687K450428K759896L070659L211899L061943K610760J975880J360492
798C02893314R74236R49631J287651J855964K440682K832660K913514K701568K337036
807C21186256K009049J858215J902809K029572K054253J822662J296005N72128j67961
816C34562988p57675j128654j330872j478424j656189j844063j905670j650276r34067
825C21877098K51427J749306L272476M492111N135574N067406M328575L127480J785545
834C51086998O45523l5171j70746J23062N78079Q90274Q54492M56887j24169o09360
$$ plain form
770 276641045 274662991 272984371 271787701 271055813 270632687 270313282 269922924 269369907 268670044 267947578
780 267947578 267411003 267299500 267808208 269014454 270840988 273080196 275478115 277841072 280114670
789 280114670 282391357 284841785 287601681 290672340 293884239 296946182 299556942 301532822 302893314
798 302893314 303867550 304817181 306104832 307960796 310401478 313234138 316147652 318849220 321186256
807 321186256 323195305 325053520 326956329 328985901 331040154 332862816 334158821 334730949 334562988
816 334562988 333805313 332676659 331345787 329867363 328211174 326367111 324461441 322811165 321877098
825 321877098 322128525 323877831 327150307 331642418 336777992 341845398 346173973 349301453 351086998
834 351086998 351732521 351697350 351526604 351649666 352227745 353118019 353972511 354429398 354305229 353695869
844C53695869p55806m71916J46523Q71124J450615J717949J644668J328164R30442
853C60557632O05507M45633M63105N99937P57561Q35228P66449N45845K34298o5307
863C65745888k53144k83432j90696p8011o8130k42119n98946j054649j479759j752816
873C59744186j801300j612625j220703o80618n0621O14548J261711J840744K309227
882C60404549K637863K810516K816429K645378K292061J776200J164054N73235J46713
891C77266998k861J49689N11703Q98591J106605J004219N96085K6321m84276p37877
901C80335197o49986k88276J59988M72450M93393K02904k75421p32155r67674q83789
911C77866631n28489p2441K72599L55644J60866j83602m68330n07698k34604K61688
$$ plain form
844 353695869 352940063 352468147 352614670 353485794 354936409 356654358 358299026 359627190 360557632
853 360557632 361163139 361608772 362071877 362671814 363429375 364264603 365031052 365576897 365811195 365745888
863 365745888 365492744 365209312 365018616 364940605 364872475 364630356 364031410 362976761 361497002 359744186
873 359744186 357942886 356330261 355109558 354428940 354378319 354992867 356254578 358095322 360404549
882 360404549 363042412 365852928 368669357 371314735 373606796 375382996 376547050 377120285 377266998
891 377266998 377264137 377413826 377925529 378824120 379930725 380934944 381531029 381557350 381073074 380335197
901 380335197 379685211 379396935 379556923 380029373 380522766 380725670 380450249 379718094 378750420 377866631
911 377866631 377338142 377265701 377538300 377893944 378054810 377871208 377402878 376895180 376660576 376922264
921C76922264P75986J086807J063118P26662K37426j87911l81508k99683l5171K38304
931C80146294L53202K25335j16196n52673r34754j145744j142044r58100o83937m27932
941C74763451k81449k93922m61655p30629j014252j220779j286583j199875j006584
950C67267723p89833o28929n58205n44929n00946l27835K7847N34172J072693J481972
960C67033730J625099J453476J033744N24331J12953n9395M5891L53241P05871R31015
970C73759956R07631O12374J28288l87497p64084q85315p40394m34189j49231o7597
980C71979942k84080p51229j287651j652298j657676j265641o15043L4561M23431M10691
990C65335007L5782n10407r86366j218682j175994r66683p66449p21588q78029j166191
$$ plain form
921 376922264 377698250 378785057 379848175 380574837 380812263 380624352 380242844 379943161 379907990 380146294
931 380146294 380499496 380724831 380608635 380055962 379121208 377975464 376833420 375875320 375191383 374763451
941 374763451 374482002 374188080 373726425 372995796 371981544 370760765 369474182 368274307 367267723
950 367267723 366477890 365848961 365290756 364745827 364244881 363917046 363944893 364479065 365551758 367033730
960 367033730 368658829 370112305 371146049 371670380 371783333 371723938 371769829 372123070 372828941 373759956
970 373759956 374667587 375279961 375408249 375020752 374256668 373371353 372630959 372196770 372047539 371979942
980 371979942 371695862 370944633 369656982 368004684 366347008 365081367 364466324 364500885 364924316 365335007
990 365335007 365370789 364860382 363874016 362655334 361479340 360512657 359746208 359024620 358146591 356980400
1000C56980400j443863j567077j453858j116905o55899k17934N6000Q0452j43814n31349
1010C49986153r45549j253968j383819j352234j254959j217423j333618j622009k020912
1019C37601662k422715k722320k852974k791252k536812k087898j435051n78156M44680
1028C20619164J540107K568741L381577L863449L962707L696327L133355K370605J515999
1037C46652031O79665l2845n34172p77092p75223o07147l95432k64473k93731m88167
1047C43163414p79305j057243j220894j221313j084671r00994p85713q29277j056862
1056C34227142j413726j788331k061271k160073k094726j953545j864395j935825k210770
1065C16744480k652778l171483l669948m090023m432068m744568n093117n526714o058083
$$ plain form
1000 356980400 355536537 353969460 352515602 351398697 350742798 350524864 350580864 350661316 350517502 349986153
1010 349986153 349040604 347786636 346402817 345050583 343795624 342578201 341244583 339622574 337601662
1019 337601662 335178947 332456627 329603653 326812401 324275589 322187691 320752640 320174484 320619164
1028 320619164 322159271 324728012 328109589 331973038 335935745 339632072 342765427 345136032 346652031
1037 346652031 347331696 347298851 346764679 345987587 345212364 344605217 344209785 343945312 343651581 343163414
1047 343163414 342384109 341326866 340105972 338884659 337799988 336898994 336113281 335284004 334227142
1056 334227142 332813416 331025085 328963814 326803741 324709015 322755470 320891075 318955250 316744480
1065 316744480 314091702 310920219 307250271 303160248 298728180 293983612 288890495 283363781 277305698
1074B77305698o662445p289447p879334q376865q739205q938884q963604q811493q483735
1083B03160686p978248p287464o405545n341873m134674k856674j605549m80556M47197
1092A67517300J163063J722183K244930K888394L798999N056267O626110Q343411R940872
1101B09301529J1119842J1645337J1428718J0562344R292106P934800O775627N983352
1109B84043655N574398N431786N365105N185432M768829M092217L234692K347488J603622
1118C21647224J142655J029396J239738J679116K222557K757683L209991L541412L730469
1127C42200241L750763L566322L149224K508392J707954Q62656J04027m66194q13561
1136C56569824r80186j060906j155204j316758j522865j679611j663132j381187q29354
$$ plain form
1074 277305698 270643253 263353806 255474472 247097607 238358402 229419518 220455914 211644421 203160686
1083 203160686 195182438 187894974 181489429 176147556 172012882 169156208 167550659 167070103 167517300
1092 167517300 168680363 170402546 172647476 175535870 179334869 184391136 191017246 199360657 209301529
1101 209301529 220421371 232066708 243495426 254057770 263349876 271284676 278060303 284043655
1109 284043655 289618053 295049839 300414944 305600376 310369205 314461422 317696114 320043602 321647224
1118 321647224 322789879 323819275 325059013 326738129 328960686 331718369 334928360 338469772 342200241
1127 342200241 345951004 349517326 352666550 355174942 356882896 357745552 357849579 357383385 356569824
1136 356569824 355589638 354528732 353373528 352056770 350533905 348854294 347191162 345809975 344980621
1145C44980621j13639N78117J046867J167526R47915N29060J21727r3117n0583J68686
1155C49283180L82309M02184J32293l80096r66415j419640j594543j475602j179695
1164C43183975q94356p82661r03854j188507j481400j632080j583519j414681j302490
1173C32000427j423568j838532k427330k917557l001518k488289j413650m4251J227684
1182C17673416K049408K248917J884689J188164M38728j57089n26619p16858q31108
1191C23251648r65500j175270j474648j854724k294426k761612l212777l603305l909989
1200C01999397m150657m385147m691658n130253n715142o414795p175560p953987q735523
1209B47646675r528084j0335464j1128121j1825676j2300624j2400265j1981640j0950155
$$ plain form
1145 344980621 344866982 345445099 346491966 347659492 348607407 349136467 349258194 349165077 349114494 349283180
1155 349283180 349665489 350067673 350199966 349819870 348853455 347433815 345839272 344363670 343183975
1164 343183975 342289619 341506958 340603104 339414597 337933197 336301117 334717598 333302917 332000427
1173 332000427 330576859 328738327 326310997 323393440 320391922 317903633 316489983 316445732 317673416
1182 317673416 319722824 321971741 323856430 325044594 325483322 325326233 324799614 324082756 323251648
1191 323251648 322286148 321110878 319636230 317781506 315487080 312725468 309512691 305909386 301999397
1200 301999397 297848740 293463593 288771935 283641682 277926540 271511745 264336185 256382198 247646675
1209 247646675 238118591 227783127 216655006 204829330 192528706 180128441 168146801 157196646
1217A57196646r295807p113333m598036k008676L95355K421608L991747N145588O004829
1226A52139921O712160P375965Q040829Q689785R267292R708328R961205R999943R828834
1235B31724262R480324R004917Q456879P877865P288704O695308O104737N543899N064011
1244B97240906M726505M573593M598599M733314M858551M839287M568100M005356L199196
1253C37343407K274360J389122O70510J51672k55852p32841j466255k542649l873329
1262C32958145n201340o194686o586934o292457n434227m269371l057747j949673r55601
1271B93016109r841R20505J754818K301140K340107J740074N33276j088925k854347
1280B98652916m510689n891304o917953p555199p758465p458134o590957n154724l250675
$$ plain form
1217 157196646 147900839 140787506 136189470 134180794 134576149 136997757 140989504 146135092 152139921
1226 152139921 158852081 166228046 174268875 182958660 192225952 201934280 211895485 221895428 231724262
1235 231724262 241204586 250209503 258666382 266544247 273832951 280528259 286632996 292176895 297240906
1244 297240906 301967411 306541004 311139603 315872917 320731468 325570755 330138855 334144211 337343407
1253 337343407 339617767 341006889 341677399 341829071 341573219 340840378 339374123 336831474 332958145
1262 332958145 327756805 321562119 314975185 308682728 303248501 298979130 295921383 293971710 293016109
1271 293016109 293006268 293926773 295681591 297982731 300322838 302062912 302596188 301507263 298652916
1280 298652916 294142227 288250923 281332970 273777771 266019306 258561172 251970215 246815491 243564816
1289B43564816j081810J090469L011055M485206N404778N748253N567474M974976M129543
1298B76894760L213062K388821J751099J283264Q53653K61078o78063k032375l687573
1307B80247726n340728o566105o935253o154938m175301j231384K201805N529080Q193874
1316B65768776R822540J0307102R800873Q636341P201462N822640M691581L853493
1324C25904808L244095K752991K283935J791535J281929P82890K97966k25601q88939
1333C37225609j782532k895279m043808m875488m973145m031906k029133P05281L571319
1342C16870918N906105P226334P388725O600495N285644L888245K711372J856766J266556
1351C59001160Q16955L97835n3368n65376j161880j876526k742310l762092m878655
$$ plain form
1289 243564816 242483006 243573475 246584530 251069736 256474514 262222767 267790241 272765217 276894760
1298 276894760 280107822 282496643 284247742 285531006 286384659 286645737 285967674 283935299 280247726
1307 280247726 274906998 268340893 261405640 255250702 251075401 249844017 252045822 257574902 265768776
1316 265768776 275591316 285898418 295699291 304335632 311537094 317359734 322051315 325904808
1324 325904808 329148903 331901894 334185829 335977364 337259293 338042183 338340149 338114548 337225609
1333 337225609 335443077 332547798 328503990 323628502 318655357 314623451 312594318 313299599 316870918
1342 316870918 322777023 330003357 337392082 343992577 349278221 353166466 355877838 357734604 359001160
1351 359001160 359818115 360215950 360162582 359597206 358435326 356558800 353816490 350054398 345175743
1360C45175743n958214o797828p162896o849212n760784l973198j753273M90245K315712
1369C09726295L382149L550148K909527J724224L29247r74427j982212k600898k828446
1378C13235607k728100k407684j999397j630688j381435j246891j131173q88958m03652
1387B99417629L34645J196727J953831K375793K340622J898079J249714O51684K91805
1396C11710529K02866K59952K60697M1199m35429j067543j679020k117901k328796
1405C04846554k361298k317638k281685k276554k275353k248459k208614k215824k337112
1414B84324017k584782k877216l048954k913952k350331j368637j26133J121712K115250
1423B72290974K693405K856884K759170K623291K619629K769127K927094K866592K418861
$$ plain form
1360 345175743 339217529 332419701 325256805 318407593 312646809 308673611 306920338 307410583 309726295
1369 309726295 313108444 316658592 319568119 321292343 321621590 320647163 318664951 316064053 313235607
1378 313235607 310507507 308099823 306100426 304469738 303088303 301841412 300710239 299821281 299417629
1387 299417629 299752274 300949001 302902832 305278625 307619247 309517326 310767040 311418724 311710529
1396 311710529 311913395 312173347 312434044 312475243 312039814 310972271 309293251 307175350 304846554
1405 304846554 302485256 300167618 297885933 295609379 293334026 291085567 288876953 286661129 284324017
1414 284324017 281739235 278862019 275813065 272899113 270548782 269180145 269054012 270175724 272290974
1423 272290974 274984379 277841263 280600433 283223724 285843353 288612480 291539574 294406166 296825027
1432B96825027J591034N86243k90260p87888q36716n68084k27070l7022j06640m25453
1442B95723171r26513j548367k239284k911377l404503l524762l163166k417316j612320
1451B73975563j165905j354523k119751l057918l624935l448048k553616j358642m19216
1460B54873009q8215k97604o07548m93965L05195J605663K870408L522834L284512
1469B64974289K332878J190338M22840L35713Q41026J558228K063121K127743J815949
1478B77662125J400356J175690J287040J664257K080670K285099K132797J657295J059494
1487B92404823O26793O09074J098251J963864K891178L527679L685532L487549L347778
1496C13642521L754654M947796O676902Q215523Q675766P479134M725151J228523j824646
$$ plain form
1432 296825027 298416061 299002304 298712044 297924156 297087440 296519356 296292286 296255264 296148624 295723171
1442 295723171 294796658 293248291 291009007 288097630 284693127 281168365 278005199 275587883 273975563
1451 273975563 272809658 271455135 269335384 266277466 262652531 259204483 256650867 255292225 254873009
1460 254873009 254784794 254487190 253879642 253385677 253690872 255296535 258166943 261689777 264974289
1469 264974289 267307167 268497505 268920345 269256058 270097084 271655312 273718433 275846176 277662125
1478 277662125 279062481 280238171 281525211 283189468 285270138 287555237 289688034 291345329 292404823
1487 292404823 293031616 293640690 294738941 296702805 299593983 303121662 306807194 310294743 313642521
1496 313642521 317397175 322344971 329021873 337237396 345913162 353392296 358117447 359345970 357521324
1505C57521324l425484l200492j533204O92749K558709L513031L511505K876701K018814
1514C64533653J211396N29975o6948o16226j090049j413117j517754j378898j013184
1523C59178848m68216J72196P74345J172753J243171J001053O45561M83933P46689
1532C64950333J399994K091102K295799J609993J5641k043496l841056m707108m344330
1541C57426872k950287j094856N63812J567955J820221J562119J213074J154480J547851
1550C62811241K245789K830009K773972J687584m42849l143768n559044o771927o220893
1559C50210114m007187r14193J903382L433227L264695J756248j78108j552239j802292
1568C52113647j031913J06659Q14247N92537n05677j947326l045731l340988k820129
$$ plain form
1505 357521324 354095840 350895348 349362144 350054893 352613602 356126633 359638138 362514839 364533653
1514 364533653 365745049 366275024 366208076 365591850 364501801 363088684 361570930 360192032 359178848
1523 359178848 358710632 358882828 359657173 360829926 362073097 363074150 363719711 364203644 364950333
1532 364950333 366350327 368441429 370737228 372347221 372362862 370319366 366478310 361771202 357426872
1541 357426872 354476585 353381729 353945541 355513496 357333717 358895836 360108910 361263390 362811241
1550 362811241 365057030 367887039 370661011 372348595 371905746 368761978 363202934 356431007 350210114
1559 350210114 346202927 345288734 347192116 350625343 353890038 355646286 355468178 353915939 352113647
1568 352113647 351081734 351188393 352002640 352595177 352089500 350142174 347096443 343755455 340935326
1577C40935326j867066j001549n78422o23055q81996j028633q79822m91752r6016O0692
1587C33547707j42632o58073j331482k001534k565918k979927l213386l216763k929687
1596C14508305k325898j455440m55933M78363J147385J398983J172752N30320l38440
1605C14660397j154175j643353j666145j311436q87279p80773j245099k234878l399754
1614C00337505m258175m458923l975830l117199k348328k040634k297306k946338l677082
1623B71217690m214516m425602m322586m006882l622570l347282l390847l948421n094757
1632B34844227o677513q298207r436893r682026q944988p531224o009120m938775m601764
1641A68723717m872780n294829n311813m535169k913514p32021J547270L519516N026064
$$ plain form
1577 340935326 339068260 338066711 337488289 336865234 335983238 334954605 334074783 333583031 333487015 333547707
1587 333547707 333405075 332747002 331415520 329413986 326848068 323868141 320654755 317437992 314508305
1596 314508305 312182407 310726967 310271034 310749397 311896782 313295765 314468517 314998837 314660397
1605 314660397 313506222 311862869 310196724 308885288 307998009 307217236 305972137 303737259 300337505
1614 300337505 296079330 291620407 287644577 284527378 282179050 280138416 277841110 274894772 271217690
1623 271217690 267003174 262577572 258254986 254248104 250625534 247278252 243887405 239938984 234844227
1632 234844227 228166714 219868507 210431614 200749588 191804600 184273376 178264256 173325481 168723717
1641 168723717 163850937 158556108 153244295 148709126 145795612 145063591 146610861 150130377 155156441
1650A55156441O201343P352085Q728047J0312538J1763191J2558174J2283879J0899238
1658B35254936Q810330O686859N115547M295940L967972L620186K843380J596012K10171
1667B72401333q58727j355896j392650j339016j523247j965256k345161k245693j501599
1676B57874088m07905L78303J99375j200313l486252n881882p564945q076725p515964
1685B24317780o431904n511132n252819n800171o972522q423043r799327j0824643
1693A65302219j1298894j1080504j0099258q404026o201468l826723j639109J16921
1701A12869158J407242K404346L381844M561185N988532P496957Q761387R411898R151831
1710A65434380P841911N537567K483883r23901m210605o920071q722267r492064r319257
$$ plain form
1650 155156441 161357784 168709869 177437916 187750454 199513645 212071819 224355698 235254936
1658 235254936 244065266 250752125 255867672 260163612 264131584 267751770 270595150 272191162 272401333
1667 272401333 271542606 270186710 268794060 267455044 265931797 263966541 261621380 259375687 257874088
1676 257874088 257466183 257844486 258043861 256843548 253357296 247475414 239910469 231833744 224317780
1685 224317780 217885876 212374744 207121925 201321754 194349232 185926189 176126862 165302219
1693 165302219 154003325 142922821 132823563 124419537 118218069 114391346 112752237 112869158
1701 112869158 114276400 116680746 120062590 124623775 130612307 138109264 146870651 156282549 165434380
1710 165434380 173276291 178813858 181297741 180373840 176163235 169243164 160520897 151028833 141709576
1719A41709576q433190p071323n362082l292522p88460K137642N267448Q176384J0376463
1728A42719936J1534262J1640654J1025028J0194683R583626R352245R348240R245415
1736B24644089Q770466P880439O788845N833474N274276N143814N235749N229816M875069
1745B79676037M125805L159466K278041J753559J705018K061214K617493L140564L462181
1754C03979378L518848L334351K975521K520485K055855J690025J547165J721802K204666
1763C25548096K831993L308945L323669K708778J559105K28920q10241j183587p88345
1772C36727333J66740J273613K120400K461624K283096J751290J104584N58891K63328
1781C48710899K93389O44645J212235J782150K076264J865959J109085K2888r73968
$$ plain form
1719 141709576 133276386 126205063 120842981 117550459 116761999 118899641 124167089 132343473 142719936
1728 142719936 154254198 165894852 176919880 187114563 196698189 206050434 215398674 224644089
1736 224644089 233414555 241294994 248083839 253917313 259191589 264335403 269571152 274800968 279676037
1745 279676037 283801842 286961308 289239349 290992908 292697926 294759140 297376633 300517197 303979378
1754 303979378 307498226 310832577 313808098 316328583 318384438 320074463 321621628 323343430 325548096
1763 325548096 328380089 331689034 335012703 337721481 339280586 339509506 338699265 337515678 336727333
1772 336727333 336894073 338167686 340288086 342749710 345032806 346784096 347888680 348447571 348710899
1781 348710899 349004288 349648933 350861168 352643318 354719582 356585541 357694626 357717514 356743546
1790C56743546j450158j184806l02124P74803J531753J625214J051369J34506o53992
1799C58270111r40552o25114R5940Q56437J316300J319732R43528M26063K7351r8686
1809C61591110M0169L09677N44014O40793O05202N24330M98199N75295P30171Q92296
1819C66951256R93538R99870R06830P15027M18205K3842m09737p60460q84437o99234
1829C68254700k55890K65999O51970P84835P23381O61354P82738J106491J436196J463432
1839C75875206R70802M311j105118j898041k029686j456337m51927N47562J172752
1848C71629524J286392J002617N72777K23427N1002J8387L1624L1967L5858J10436
1858C74994011L05061N93605Q61893R53979P50809K43187m43764j088333j465072j446762
$$ plain form
1790 356743546 355293388 354108582 353806458 354581261 356113014 357738228 358789597 358924103 358270111
1799 358270111 357329559 356704445 356800385 357656822 358973122 360292854 361236382 361662445 361689796 361591110
1809 361591110 361631279 361940956 362484970 363125763 363730965 364255295 364753494 365328789 366058960 366951256
1819 366951256 367944794 368944664 369851494 370566521 370984726 371008568 370598831 369838371 368953934 368254700
1829 368254700 367998810 368264809 368916779 369701614 370424995 371086349 371869087 372975578 374411774 375875206
1839 375875206 376846008 376850319 375745201 373847160 371817474 370361137 369909210 370456772 371629524
1848 371629524 372915916 373918533 374491310 374714737 374765739 374784126 374815750 374847717 374883575 374994011
1858 374994011 375299072 375892677 376754570 377708549 378459358 378702545 378258781 377170448 375705376 374258614
1868C74258614j066285n01403J3237L00903L20969J66435j1368j00784q6632l3875
1878C73259811k0027o8893j37444j58882j04561j2130M0512l434j35612k86217l75557
1889C71997566l67050k84882j83334r9029k7543N8136J66359K62871K90985K20528
1899C72034607Q5411k8076m0016O0310J96762K55013J65748l7880k31437k78016j19361
1910C72063065J79901M66118N87081M75884J81999j67732m42658n69763n49240m27894
1920C71796761k58828p8048R3498K33040L07770K85491J56746m6730k55775l88374
1930C71845551l85285k39067j564K32201L58734L08494P8125k61154n86548p72628
1940C70576859p47948n30930k24952K9373J22299K8686j81655l83072m61846l74756
$$ plain form
1868 374258614 373192329 372690926 372704163 373005066 373326035 373492470 373481102 373380318 373293686 373259811
1878 373259811 373239784 373170891 373033447 372874565 372770004 372757874 372798386 372794952 372659340 372373123 371997566
1889 371997566 371630516 371345634 371162300 371063271 371035728 371093864 371260223 371523094 371814079 372034607
1899 372034607 372120018 372091942 372051926 372112236 372308998 372564011 372729759 372691879 372460442 372182426 372063065
1910 372063065 372242966 372709084 373296165 373772049 373954048 373786316 373343658 372773895 372224655 371796761
1920 371796761 371537933 371459885 371553383 371786423 372094193 372379684 372536430 372489700 372233925 371845551
1930 371845551 371460266 371221199 371219635 371451836 371810570 372119064 372197189 371936035 371349487 370576859
1940 370576859 369828911 369297981 369073029 369102402 369224701 369253387 369071732 368688660 368226814 367852058
1950C67852058j67808N2757J79596J60561K1972j48544k49367k15912n0582J79748
1960C67614479L75366M48494L60947J40228j32446l55263m48112l84941k03476J2893
1970C67428169J72043K14539J37138p858j40801j92909j36909L356J69373K97279L47100
1981C68290520L15780K30713J31226M7836q163m3373p2937j08223j52398j99546k38572
1992C68192863k56958k43301j90048r7313K2278J41411K22778K31285J51405p63j76277
2003C67997360l08189l39356k49328o9237J26762K50626K40097Q9493j43929l62510
2013C67231789m73442m31862k63253n2185R9106J20201N722j82495l48358m08935l33634
2024C64962654j57471L8567J65939J69144M7798j44462l24555m14009l70254k03057
$$ plain form
1950 367852058 367684250 367737007 367916603 368077164 368099136 367950592 367701225 367485313 367434731 367614479
1960 367614479 367989845 368438339 368799286 368939514 368807068 368451805 368003693 367618752 367415276 367428169
1970 367428169 367600212 367814751 367951889 367944031 367803230 367610321 367473412 367476768 367646141 367943420 368290520
1981 368290520 368606300 368837013 368968239 369016075 369007912 368964539 368891602 368783379 368630981 368431435 368192863
1992 368192863 367935905 367692604 367502556 367405243 367427521 367568932 367791710 368022995 368174400 368173637 367997360
2003 367997360 367689171 367349815 367100487 367031250 367158012 367408638 367648735 367738228 367594299 367231789
2013 367231789 366758347 366326485 366063232 366011047 366110153 366230354 366236076 366053581 365705223 365296288 364962654
2024 364962654 364805183 364843750 365009689 365178833 365226631 365082169 364757614 364343605 363973351 363770294
2034C63770294K7390K34146L36532K94304J25542r7733k79922l44353k68249r5330
2044C63702621Q5297J80321J38397k5482k37427l98903m33502l20930j04485J29127
2054C62715034K88086L13111J98669p973k28958l87191m34456l67928k27089p5874
2064C61785431K4033L7460l0518j39503k32125k60391k07405r5367K5749R9716R1744
2075C61098824L852j24855k35519k75688k23389r7504N0202J56936J77155J03340k9602
2086C60603752j59149k22549j85891o0653R9983K24113K54250J74255J7281j48163
2096C60597229k50092k46505j44997M58J15471J39541N3978j08642k79694l84254l73688
2107C59118805k46697m9438J43242K56958K47803J17111q8272k93579m24118m31595
$$ plain form
2034 363770294 363797684 364031830 364368362 364662666 364788208 364690475 364410553 364066200 363797951 363702621
2044 363702621 363787918 363968239 364106636 364081154 363843727 363444824 363011322 362690392 362585907 362715034
2054 362715034 363003120 363316231 363514900 363506927 363277969 362890778 362456322 362088394 361861305 361785431
2064 361785431 361809464 361846924 361816406 361676903 361444778 361184387 360976982 360881615 360907364 361007080 361098824
2075 361098824 361102676 360977821 360742302 360466614 360243225 360145721 360195923 360352859 360530014 360633354 360603752
2086 360603752 360444603 360222054 360036163 359975510 360075493 360299606 360553856 360728111 360745392 360597229
2096 360597229 360347137 360100632 359955635 359956093 360071564 360211105 360265083 360156441 359876747 359492493 359118805
2107 359118805 358872108 358822670 358965912 359222870 359470673 359587784 359499512 359205933 358781815 358350220
2117C58350220l12195j08261J06163K52113K74582J65176l4408k46163l87077m02336
2127C57657814k88887r7809Q8272J90811J71395M8332j11313k25105k32315j23444
2137C57077751N5466K25525L11050K73743J30653n5771k04582k53296j84898l4828
2147C57340813J24359K16102J93177O0348j27334k88124l50762k86789j24206O5803
2157C56823387K00920K25640J33857k9945j94702k96097l03154k28767j18866k9946
2167C56182327k746m6654j37787k29607k73208k38991j31073J0605J24550J52282O7750
2178C55477448j07346l06702m46243m62227l41720j31760Q1482K12135K14386J02615
2188C54292068n8059j85318k19002j48315j3276J16654J77421J38207J4381j42517
$$ plain form
2117 358350220 358038025 357929764 358035927 358288040 358562622 358727798 358693390 358447227 358060150 357657814
2127 357657814 357368927 357271118 357359390 357550201 357721596 357769928 357658615 357433510 357201195 357077751
2137 357077751 357133217 357358742 357669792 357943535 358074188 358018417 357813835 357560539 357375641 357340813
2147 357340813 357465172 357681274 357874451 357934799 357807465 357519341 357168579 356881790 356757584 356823387
2157 356823387 357024307 357249947 357383804 357353859 357159157 356863060 356559906 356331139 356212273 356182327
2167 356182327 356179581 356132927 355995140 355765533 355492325 355253334 355122261 355132866 355257416 355409698 355477448
2178 355477448 355370102 355063400 354617157 354154930 353813210 353681450 353762932 353975067 354189453 354292068
2188 354292068 354234009 354048691 353829689 353681374 353668098 353784752 353962173 354100380 354114761 353972244
2198C53972244k68097l11546k55508j20087M6616J87034K55242K30979J26114k1705
2208C53841286j61820k48451k57149j93329r0370K365M0627M654r1019k01912k73437
2219C52371445k66533j77460m2496P7629J24970P1678o5079k29225l50342l73840k86713
2230C50854034j23214M8370J55029J51101L8604j33171k88811l60527l18489j84021
2240C49838905j7891J09139J49574J00861K517q5639j14441o9161K5749J19591J61133
2251C50220337J21689Q697j36528k55356k94723k30446p9498J01509K39067K70462
2261C49965210J74179j8463k34566l90930m30527l47213j86768k4757O7596N2605o0387
2272C48565979k21672l61900m18587l58048j87378M6921K75460M31251M75159M11796
$$ plain form
2198 353972244 353704147 353392601 353137093 353017006 353063622 353250656 353505898 353736877 353862991 353841286
2208 353841286 353679466 353431015 353173866 352980537 352890167 352892532 352933159 352937813 352846794 352644882 352371445
2219 352371445 352104912 351927452 351884956 351962585 352087555 352159233 352094154 351864929 351514587 351140747 350854034
2230 350854034 350730820 350779190 350934219 351085320 351123924 350990753 350701942 350341415 350022926 349838905
2240 349838905 349821014 349930153 350079727 350180588 350183105 350097466 349983025 349913864 349939613 350059204 350220337
2251 350220337 350342026 350350723 350214195 349958839 349664116 349433670 349354172 349455681 349694748 349965210
2261 349965210 350139389 350120926 349886360 349495430 349064903 348717690 348530922 348506165 348573761 348626366 348565979
2272 348565979 348344307 347982407 347563820 347205772 347018394 347065315 347340775 347772026 348247185 348658981
2282C48658981K85263J57128P7362O1836Q9531J19133J15013O6567q545p5341j01432
2293C49445496p0267J5411J38626K77100M09126N16358N85365O08139N83878N18760
2303C53027992M23813L10784J90849P5874j7776o5194l6163R3727L26424O23474R00002
2314C55853806J040267R38454N51682n6649p15408j202850j344490j109314o44341
2323C53311157k16675q0719l40995q89778j463051j785813j718712j319007p83768
2332C44712639l22380n6496j1825j95847o71387j537094k791710m171028n102653m877167
2342C24975052k997589M70276M766082Q647995J0881615J0769959Q450241M802856
2350C70766487J027870j881370l499031m007836l952064l875771m056358m444504m792976
$$ plain form
2282 348658981 348944244 349101372 349178734 349240570 349330101 349449234 349564247 349630814 349622269 349546928 349445496
2293 349445496 349375229 349390640 349529266 349806366 350215492 350731850 351317215 351925354 352509232 353027992
2303 353027992 353451805 353762589 353953438 354029312 354011536 353946342 353910179 354003906 354330330 354953804 355853806
2314 355853806 356894073 357832527 358384209 358327560 357612152 356409302 355064812 353955498 353311157
2323 353311157 353094482 353013763 352672768 351782990 350319939 348534126 346815414 345496407 344712639
2332 344712639 344390259 344333763 344321938 344126091 343454704 341917610 339125900 334954872 329852219 324975052
2342 324975052 321977463 322447739 327213821 335861816 346743431 357513390 365963631 370766487
2350 370766487 371794357 369912987 366413956 362406120 358454056 354578285 350521927 346077423 341284447
2359C41284447m857636m543304l930588l201141k531128k016831j659565j397915j155071
2368C15991268q76789n48649j94053J41830M16641O14624P58801R03625J105957J390972
2378C19704227J730710K050476K259826K293778K140388J842766J477203J121712Q30345
2387C35451431O22483M87251L96461L18032K29721J25160J6251p2632j16082j00822
2397C37357254l2845O1570J47323J91956J79367J13144J5640p9384j38664j39351p9765
2408C37596245J7738J11466J57127J26991K4452j14898k39678l06511k99263k35328
2418C36838341j52931r0790o9351q5412j16844j38130j31225r3194l5858J8845M5929
2429C35989380K6245m5586j54762k68097l44620l52096k84424j66893m8370K0904J3466
$$ plain form
2359 341284447 336426811 331883507 327952919 324751778 322220650 320203819 318544254 317146339 315991268
2368 315991268 315114479 314565830 314371777 314513607 314930248 315544872 316303673 317207298 318313255 319704227
2378 319704227 321434937 323485413 325745239 328039017 330179405 332022171 333499374 334621086 335451431
2387 335451431 336073914 336561165 336957626 337275658 337505379 337630539 337646790 337574158 337458076 337357254
2397 337357254 337324409 337385979 337533302 337725258 337904625 338017769 338033409 337954025 337815361 337676010 337596245
2408 337596245 337613983 337725449 337882576 338009567 338034019 337919121 337679443 337372932 337073669 336838341
2418 336838341 336685410 336594620 336525269 336439857 336323013 336184883 336053658 335960464 335924606 335943451 335989380
2429 335989380 336015625 335970039 335815277 335547180 335202560 334850464 334566040 334399147 334350777 334371681 334385147
2440C34385147o1111j59684k25944k18086j29814N264J28593J84517J47095L2387j07956
2451C33980408k10572k29911j58234k8763J00098J71356J52092M6539j09176k61803
2461C33452034l61481l79104l14331j94245o4049K9908N5732J0109q1634j77078k35024
2472C31740837k36587j92566j36910j07040j23673j80244k47002k88276k80152k21786
2482C29726601j33667m8218L853L814m9896j40228k36130l00407l02468k32200j07994
2493C28183060K6092J16883J26457N0087p8163k01111k64931k45209j57547n0163K0371
2504C27525826J4762p1029k04850l32336l99895l75862k63366r8763O1836J64490J77765
2515C26198578J05018j8997j42822k21519k33918j89590j21307o6948n1575p6447j20811
$$ plain form
2440 334385147 334324036 334164352 333938408 333720322 333590508 333595772 333724365 333908882 334055977 334088364 333980408
2451 333980408 333769836 333539925 333381691 333352928 333453026 333624382 333776474 333823013 333713837 333452034
2461 333452034 333090553 332711449 332397118 332202873 332138824 332168732 332224464 332234573 332152939 331975861 331740837
2472 331740837 331504250 331311684 331174774 331067734 330944061 330763817 330516815 330228539 329948387 329726601
2482 329726601 329592934 329544716 329548569 329552383 329502487 329362259 329126129 328825722 328523254 328291054 328183060
2493 328183060 328209152 328326035 328452492 328502579 328424416 328223305 327958374 327713165 327555618 327505455 327525826
2504 327525826 327540588 327469559 327264709 326932373 326532478 326156616 325893250 325794487 325856323 326020813 326198578
2515 326198578 326303596 326284599 326141777 325920258 325686340 325496750 325375443 325308495 325256920 325180473 325059662
2526C25059662j53237j48010r7046j3809P1602J26076J27220P3204j6098j05896j61705
2537C24761963j63574j15013m1123K0828L9864L815p3662j58043k09541j99433j23787
2548C23742294o752J09406J80664J80855J12114M425r7771j55716j53274j02540l6811
2559C23776894N722j91n7259j46446k35901k94685l02467k55776j66664o1073K9602
2570C22291756P6255O2294q201j10130k05231k58637k55050k07176j49155j18637j36032
2581C20982056j91880k52494k77176k41471j50852l8395N1117Q3561N0335k9068j18465
2592C19867268j82305k00329j74541j24760p8430n8784p5646j22566j79329k18906
2602C18451672k16847j61762o0558N9967J60675K02884J64605N1403j02749k46659
$$ plain form
2526 325059662 324906425 324758415 324661369 324647560 324719162 324845238 324972458 325045662 325029564 324923668 324761963
2537 324761963 324598389 324483376 324442253 324463081 324502945 324506760 324433098 324275055 324065514 323866081 323742294
2548 323742294 323735542 323844948 324025612 324206467 324318581 324323006 324225235 324069519 323916245 323813705 323776894
2559 323776894 323782616 323782425 323725166 323578720 323342819 323048134 322745667 322489891 322323227 322262154 322291756
2570 322291756 322368011 322430305 322422104 322311974 322106743 321848106 321593056 321385880 321236725 321118088 320982056
2581 320982056 320790176 320537682 320260506 320019035 319868183 319829788 319880905 319964466 320014801 319985733 319867268
2592 319867268 319684963 319484634 319310093 319185333 319106903 319048119 318972473 318849907 318670578 318451672
2602 318451672 318234825 318073063 318012505 318072472 318233147 318436031 318600636 318652039 318549290 318302631
2612C18302631l32775l37600k72217j76983j01700q0814j15338j73874k08282j81103
2622C16321945q6727M4155J57452K02789J57795L9158j05095k17609k58370k20432
2632C16035061j31436l8356J4629O161n4798j34888j94054k03704j60409q5334j3447
2643C15039425K3098Q640m9362j26362j91326k20032k03209j47934p3700n188L6717
2654C14090767M0340Q374m3545r0714j09539q7490k9907M0722R3632J04408O6090p248
2666C14075890q6441j41888j56365j32541q9684n5103n0335q3275j44539k11296k55775
2677C12668648k55738k03762j12018r880O5479Q4477L8833n2643j49593k07520j97963
2688C11668320j23177j5926P5168J08147O7654k8153j36680k11048k22111j70574q5717
$$ plain form
2612 318302631 317969856 317632256 317360039 317183056 317081356 317000542 316885204 316711330 316503048 316321945
2622 316321945 316235218 316279373 316436825 316639614 316797409 316836567 316731472 316513863 316255493 316035061
2632 316035061 315903625 315865269 315879898 315886059 315831261 315696373 315502319 315298615 315138206 315052872 315039425
2643 315039425 315062523 315071163 315021801 314895439 314704113 314484081 314280872 314132938 314059238 314054050 314090767
2654 314090767 314131107 314139481 314095936 314005222 313895683 313808193 313778286 313819008 313912640 314017048 314083138 314075890
2666 314075890 313989449 313847561 313691196 313558655 313468971 313413868 313363533 313280258 313135719 312924423 312668648
2677 312668648 312412910 312209148 312097130 312087250 312152729 312237206 312276039 312223396 312073803 311866283 311668320
2688 311668320 311545143 311529217 311604385 311712532 311780186 311752033 311615353 311404305 311182194 311011620 310925903
2699C10925903j0643J7510j6003r7904j93977k65198k84901k50664j84574j22452r7064
2710C09420033j22872j88064k61250l05080k94457k28939j33686m7951q564l3664j15090
2721C07680416k22874l17249l64685l49960k80991j85318r9773n8308p8926j56555
2731C05565777k63329l57647l99913l69549k75383j53065n0030l185k1496q1539j40285
2742C03450356j58043j19095m1104L4886O5040K4720q0281k17590l43590m21867m35887
2753C01757545l90663l07274k13375j34468q8081q1291j08567j53560j93196k05421
2763B99881649j79386j22395n8517k0161l2596j00747k04067l04012l60508l51276
2773B98147984k82612j88752j15642r9888j50223k41947l27511l59382l13378k03094
$$ plain form
2699 310925903 310915260 310932770 310916767 310818863 310624886 310359688 310074787 309824123 309639549 309517097 309420033
2710 309420033 309297161 309109097 308847847 308542767 308248310 308019371 307885685 307837734 307829170 307795506 307680416
2721 307680416 307457542 307140293 306775608 306425648 306144657 305959339 305859566 305801258 305722332 305565777
2731 305565777 305302448 304944801 304544888 304175339 303899956 303746891 303696861 303693676 303672180 303590641 303450356
2742 303450356 303292313 303173218 303132114 303167000 303232040 303256760 303176479 302958889 302615299 302193432 301757545
2753 301757545 301366882 301059608 300846233 300711765 300623684 300542393 300433826 300280266 300087070 299881649
2763 299881649 299702263 299579868 299521351 299501190 299468594 299367847 299163780 298859768 298499260 298147984
2773 298147984 297865372 297676620 297560978 297461090 297310867 297068920 296741409 296382027 296068649 295865555
2783B95865555p4597J3485J9818n9605j86691k99034l39184k83756j54801j0338Q3256
2794B94574108Q3199j0262j55411k89898l61309l50189k75936j83506j18942j07460
2804B92804394j43643j98097k34299k27089j73225r0504q278M5052N1251P877p3433
2815B91760006j69754k53601l00408k96344k44255j64357q7738m3735m7169r1667j52607
2826B89908371k00539k15835j98021j64681j39579j39790j66492k06719k42405k61116
2836B87973194k61421k51694k43873k47727k67868l05595l58830m21657m81034n17502
2846B84615993n11360m54635l61576k69680k26593k66381l88126n49870o83765p28226
2856B80175781o59065n04475l32698k19956k14367l14369m73328o24218p11937p15675
$$ plain form
2783 295865555 295790958 295804443 295824261 295764656 295577965 295278931 294939747 294655991 294501190 294490852 294574108
2794 294574108 294657307 294647045 294491634 294201736 293840427 293490238 293214302 293030796 292911854 292804394
2804 292804394 292660751 292462654 292228355 292001266 291828041 291737537 291729259 291774311 291825562 291833439 291760006
2815 291760006 291590252 291336651 291036243 290739899 290495644 290331287 290243549 290199814 290152645 290060978 289908371
2826 289908371 289707832 289491997 289293976 289129295 288989716 288849926 288683434 288476715 288234310 287973194
2836 287973194 287711773 287460079 287216206 286968479 286700611 286395016 286036186 285614529 285133495 284615993
2846 284615993 284104633 283649998 283288422 283018742 282792149 282525768 282137642 281587772 280904007 280175781
2856 280175781 279516716 279012241 278679543 278459587 278245220 277930851 277457523 276833305 276121368 275405693
2866B75405693o52332n62268m87747m55341m68044n09224n52750n75008n63870n24273
2876B70054836m76722m49582m66632n34249o36215p38831q07457q24623p99732p63569
2886B63557224p50332p77168q35266q97140r35765r41868r28821r20773r33876r63554
2896B54672661r87091r79271r30519q53348p73888p13768o76193o44436n95569n17941
2906B47000637m20494l28770k69546k55585k79865l20778l56331l73688l74794l71246
2916B43649540l77693m06418m63009n45273o41746p32251p91378p98263p46269o48899
2926B37498341n35164m36344l69435l28674k90661k29759j36109k3059P9307J41144
2936B35369587J50394J18771P5779N2605O6471J14593J77231K28043K45838K20795
$$ plain form
2866 275405693 274753361 274191093 273703346 273248005 272779961 272270737 271717987 271142979 270579109 270054836
2876 270054836 269578114 269128532 268661900 268127651 267491436 266752605 265945148 265120525 264320793 263557224
2886 263557224 262806892 262029724 261194458 260297318 259361553 258419685 257490864 256570091 255636215 254672661
2896 254672661 253685570 252706299 251775780 250922432 250148544 249434776 248758583 248114147 247518578 247000637
2906 247000637 246580143 246251373 245981827 245726242 245446377 245125599 244769268 244395580 244020786 243649540
2916 243649540 243271847 242865429 242402420 241857147 241215401 240483150 239691772 238893509 238147240 237498341
2926 237498341 236963177 236526833 236157398 235828724 235538063 235308304 235172195 235149136 235228443 235369587
2936 235369587 235519981 235638752 235714531 235767136 235833607 235948200 236125431 236353474 236599312 236820107
2946B36820107J56955O9275k1019r3822j37196j52244j53904j64013k00653k67640
2956B35855846l50875m24691m64840m61235m22268l69606l25965l04337l05595l22934
2966B32103500l50628l88317m38747n00774n63508o06079o05297n43785m16622k30942
2976B27458801k079K51007N06935P41749R30577J052913J101513J088333J042824J000404
2986B35172977R87473J009083J048488J079064J080284J049213J001950R61952R45434
2995B44335918R50985R60293R49097Q99792Q12130P01770N92442N05066M49009M20723
3005B51577225M07963L96690L76282L41568K92301K31018J62372R3289L2730j0414
3015B53901024l1128l3226k9488l8395p5245j43013k28652l07789l56465l64589l41969
$$ plain form
2946 236820107 236977062 237046337 237025318 236931496 236794300 236642056 236488152 236324139 236123486 235855846
2956 235855846 235504971 235080280 234615440 234154205 233731937 233362331 233036366 232732029 232426434 232103500
2966 232103500 231752872 231364555 230925808 230425034 229861526 229255447 228650150 228106365 227689743 227458801
2976 227458801 227456722 227707729 228214664 228956413 229886990 230939903 232041416 233129749 234172573 235172977
2986 235172977 236160450 237169533 238218021 239297085 240377369 241426582 242428532 243390484 244335918
2995 244335918 245286903 246247196 247196293 248096085 248908215 249609985 250202427 250707493 251156502 251577225
3005 251577225 251985188 252381878 252758160 253099728 253392029 253623047 253785419 253878708 253911438 253901024
3015 253901024 253869896 253836670 253807182 253768787 253693542 253550529 253321877 253014088 252657623 252293034 251951065
3026B51951065l15571l14903l57723m40140n39703o24905o70223o63739o07986n14908
3036B46901264l99990k79560j71738r5520o7444r3956j66244k62222l55454m29230
3046B44579906m84504n37434o06727o98262p97710q75778r04675q74348q00228p17621
3056B37282619o64043o62708p13806p96490q80833r40876r62925r47647r06887q56953
3066B28949451q12454p81860p65934p58209p51362p42798p39307p55196q04062q88023
3076B21150246r90849j081428j126481j106395j026840r15814q11062p42130p17564
3085B12631683p23686p34024p23171o78082o02913n16567m45652m16031m44565n32360
3095B06814632o61525p98798r05590r51385r26533q44212p33948o26335n40771m79527
$$ plain form
3026 251951065 251635494 251320591 250962868 250522728 249983025 249358120 248687897 248024158 247416172 246901264
3036 246901264 246501274 246221714 246049976 245954456 245887012 245793056 245626812 245364590 245009136 244579906
3046 244579906 244095402 243557968 242951241 242252979 241455269 240579491 239674816 238800468 238000240 237282619
3056 237282619 236618576 235955868 235242062 234445572 233564739 232623863 231660938 230713291 229806404 228949451
3066 228949451 228136997 227355137 226589203 225830994 225079632 224336834 223597527 222842331 222038269 221150246
3076 221150246 220159397 219077969 217951488 216845093 215818253 214902439 214091377 213349247 212631683
3085 212631683 211907997 211173973 210450802 209772720 209169807 208653240 208207588 207791557 207346992 206814632
3095 206814632 206153107 205354309 204448719 203497334 202570801 201726589 200992641 200366306 199825535 199346008
3105A99346008m32377l86467l34129k74601k11105j46446q2741k3937K2239M6845M6348
3116A97569637K9011J5278K8915Q3962J75571K80686L68976M18644M27170M10843L95927
3127B00204620M05503M49905N25208O17027P07092P78828Q19969Q24852P95174P39727
3137B06867905O72035O05183N47390N00011M59766M24595L98388L90453M09604M56600
3147B11731930N18665N72205N91583N60417M80461L70827K60448J74694J25123J05438
3157B15491791R6493P6847L4885k6302r1076j41163j66493j71203j71642j86787k27394
3168B14517956k90203l59650m16489m47216m48703m28448l98560l71780l57666l63312
3178B10635929l91178m38099m92611n36251n49164n19962m53110l70273l02678k77290
$$ plain form
3105 199346008 198913631 198527164 198193035 197918434 197707329 197560883 197478142 197454205 197476444 197523289 197569637
3116 197569637 197598648 197613926 197642841 197726803 197902374 198183060 198552036 198970680 199397850 199808693 200204620
3127 200204620 200610123 201060028 201585236 202202263 202909355 203688183 204508152 205333004 206128178 206867905
3137 206867905 207539940 208145123 208692513 209192524 209652290 210076885 210475273 210865726 211275330 211731930
3147 211731930 212250595 212822800 213414383 213974800 214455261 214826088 215086536 215261230 215386353 215491791
3157 215491791 215588284 215665131 215700016 215673714 215582638 215441475 215274982 215103779 214932137 214745350 214517956
3168 214517956 214227753 213868103 213451614 213004398 212555695 212127247 211728687 211356907 210999241 210635929
3178 210635929 210244751 209806652 209314041 208777790 208228626 207708664 207255554 206885281 206582603 206305313
3188B06305313l05118l76339m66462n46817n97458o13175o02264n80635n63526n59330
3198B01094189n67971n82523n93891n96027n89810n83515n88703o15006o64272p28760
3208A94983711p95383q51708q92238r19476r40533r61074r81274r96418j000366r90925
3218A85654316r70097r43241r14325q85392q56857q30975q12664q07743q18252q39558
3228A76975212q61130q71505q64163q40244q04958p61853p07569o33030n29270l96576
3238A69704914k48489j08681j202O1036Q2588Q3828R1247J26667J98155K98862M12064
3249A70700989N20172O12087O86588P51915Q19931R01318J001015J116981J241341
3258A78352337J363182J471538J558056J618710J654911J672211J679477J685200J694336
$$ plain form
3188 206305313 206000195 205623856 205157394 204610577 204013119 203399944 202797680 202217045 201653519 201094189
3198 201094189 200526218 199943695 199349804 198753777 198163967 197580452 196991749 196376743 195712471 194983711
3208 194983711 194188328 193336620 192444382 191524906 190584373 189623299 188642025 187645607 186645241 185654316
3218 185654316 184684219 183740978 182826653 181941261 181084404 180253429 179440765 178633022 177814770 176975212
3228 176975212 176114082 175242577 174378414 173538170 172733212 171971359 171263790 170630760 170101490 169704914
3238 169704914 169456425 169347744 169346542 169407578 169490166 169573994 169665241 169791908 169990063 170288925 170700989
3249 170700989 171221161 171833248 172519836 173271751 174091682 174993000 175994015 177110996 178352337
3258 178352337 179715519 181187057 182745113 184363823 186018734 187690945 189370422 191055622 192749958
3267A92749958J705551J712113J705608J681271J643543J605186J582356J585216J610298
3276B07581100J639710J648159J614971J535893J425724J312847J224994J177960J168289
3285B20329647J178742J187458J179256J150532J107464J059551J013927R72691R34982
3294B30114250Q99716Q67157Q37555Q09116P76157P31564O71081N96199N15252M39853
3304B37257900L79486L36647L05958K76222K35711J77288J01852J8902n5084j00708
3314B38934174j02139n3234L7250J44978K36168K79274K58064J80245P6236j4095o0100
3325B39916821n5237k0466P858j926n7240j35784j97372k05632j49326m9877M9915
3336B39101734J07899J04465N0755k0466p4768r5291q9989q5201j07746j70727k66228
$$ plain form
3267 192749958 194455509 196167622 197873230 199554501 201198044 202803230 204385586 205970802 207581100
3276 207581100 209220810 210868969 212483940 214019833 215445557 216758404 217983398 219161358 220329647
3285 220329647 221508389 222695847 223875103 225025635 226133099 227192650 228206577 229179268 230114250
3294 230114250 231013966 231881123 232718678 233527794 234303951 235035515 235706596 236302795 236818047 237257900
3304 237257900 237637386 237974033 238279991 238556213 238791924 238969212 239071064 239089966 239034882 238934174
3314 238934174 238832035 238778801 238816051 238961029 239197197 239476471 239734535 239914780 239991016 239976921 239916821
3325 239916821 239861584 239841118 239848976 239847050 239789810 239654026 239456654 239251022 239101696 239051819 239101734
3336 239101734 239209633 239314098 239364853 239344387 239269619 239174328 239084339 238999138 238891392 238720665 238454437
3347B38454437l71341m59176n11188n22766n01881m63447m22974l91254l72735l64589
3357B34073086l58467l43781l11584k59743j95332j32770q9111p5608r2582j27678
3367B32086430j61019j73492j55926j13106o3228k9278k9774p0248j41372k21996k88830
3378B30638161l24574l23620k91748k41050j84288j30520q4191m6787j8330N34R194
3389B29002781P114n970l0155o4468j05381j44749j71413j73989j46427r3288k8076
3400B28045979K9792O3782O6242L9921m330n3386r5654j23215j32598j24665j06373
3411B27605495r0122r1171j19591j73473k34432k73877k66113k02732j01337L81O1417
3422B26114445N7811m196q9798j52187j54839q9492K0828J32294K01320K04182J45702
$$ plain form
3347 238454437 238083096 237623920 237112732 236589966 236088085 235624638 235201664 234810410 234437675 234073086
3357 234073086 233714619 233370838 233059254 232799511 232604179 232471409 232382298 232306690 232214108 232086430
3367 232086430 231925411 231751919 231595993 231482887 231419659 231390381 231360607 231290359 231148987 230926991 230638161
3378 230638161 230313587 229989967 229698219 229457169 229272881 229142361 229058170 229011383 228993053 228993587 229002781
3389 229002781 229009895 229003925 228973770 228909302 228803921 228659172 228487759 228313770 228167343 228074055 228045979
3400 228045979 228075771 228139553 228205795 228245716 228241386 228188000 228092346 227969131 227836533 227711868 227605495
3411 227605495 227515373 227424202 227304611 227131138 226896706 226622829 226356716 226153984 226052647 226053028 226114445
3422 226114445 226172256 226168060 226078262 225926075 225771236 225681744 225702572 225834866 226036186 226240368 226386070
3433B26386070N6210k4719o6243o0348k3289J3352J9722j5927q0604j41144j59702
3444B25903378j12000L43J48793K89936L82595M04339L57647K65274J58691O5289R53
3455B27865238l0899l5229j9950P801M2629Q1882J23902J68018K12631K53353K82174
3466B28951550K90393K72885K33516J85585J47191J32007J42460J68190J93176K04773
3476B30921726K00348J85623J68457J51959J34907J16806J04332J10054J43795K01492
3486B32439499K62184K97909K92435K55641K21119K24991K80857L63655M20838M02603
3496B35461731K94418J29948k3975j04256q5430R231J24474K06795K34127K22511K09618
3507B36679192K27394K82039L52879M08459M28676M17214L98426M00886M36821M92726
$$ plain form
3433 226386070 226442280 226417561 226351318 226290970 226267681 226281033 226300755 226284828 226204224 226063080 225903378
3444 225903378 225791378 225791721 225940514 226230450 226613045 227017384 227375031 227640305 227798996 227864285 227865238
3455 227865238 227834339 227799110 227779160 227786961 227829590 227911472 228035374 228203392 228416023 228669376 228951550
3466 228951550 229241943 229514828 229748344 229933929 230081120 230213127 230355587 230523777 230716953 230921726
3476 230921726 231122074 231307697 231476154 231628113 231763020 231879826 231984158 232094212 232238007 232439499
3486 232439499 232701683 232999592 233292027 233547668 233768787 233993778 234274635 234638290 235059128 235461731
3496 235461731 235756149 235886097 235862122 235757866 235672436 235681667 235806141 236012936 236247063 236469574 236679192
3507 236679192 236906586 237188625 237541504 237949963 238378639 238795853 239194279 239595165 240031986 240524712
3517B40524712N32283N14985M17690K49481N3520j08738j82209j41697l624J78833
3527B42035236L37429M16375L95755L02430J99394J60579K36722M26158O67019Q56018
3537B46033115Q93135P32117M12026M7855k19631k93141j67579P0934K96230M16890
3547B48221951M23564L83835L86086M73842O18039P45143P99771P91931P87163Q44307
3557B54475632R43470R67865P62729K44942n09243j262741j716919j660709j081314
3566B51163712j75457P45906J400967J647453J513958J150685P48901M73080M26540
3575B59095745O38771J054649J528531J845607J789952J251068L11241p45659j537228
3584B65232677j757240j330166m55970M87518J130962J284008R97906M99916N1479
$$ plain form
3517 240524712 241056995 241571980 241989670 242239151 242292671 242183933 242001724 241860027 241856403 242035236
3527 242035236 242372665 242789040 243184795 243487225 243686619 243847198 244083920 244510078 245177097 246033115
3537 246033115 246926250 247658367 248070393 248118248 247898617 247605476 247437897 247508831 247805061 248221951
3547 248221951 248645515 249029350 249415436 249889278 250507317 251252460 252052231 252844162 253631325 254475632
3557 254475632 255419102 256386967 257149696 257394638 256885395 255622654 253905735 252245026 251163712
3566 251163712 250988255 251734161 253135128 254782581 256296539 257447224 258196125 258669205 259095745
3575 259095745 259734516 260789165 262317696 264163303 265953255 267204323 267515564 266769905 265232677
3584 265232677 263475437 262145271 261689301 262176819 263307781 264591789 265589695 266089611 266141090
3593B66141090j74408j37004J08242M75120Q84495J259060J502380J506500J201420
3602B72766895O18248q6174o74991r30577p55291k16236M84047J086102J363620J189309
3612B74844952N77945k96077j113701j488114j111526O6948J727199L227730L848591
3621B80283947L136425J174545j391582l618508m693965m305478k750091p37324R82571
3630B68080540J950836K126350J785355J307392R95255J006736J371346K013473K738362
3639B83375645L220367L068085K000255N7373k297821m302787n224381m726391l057613
3648B72112732r37996Q02288J623097J488018P95097R9297j84823O5365P15904J521473
3658B78100452K253724K748832K894306K621022J938076R77859j5716p87125j211719
$$ plain form
3593 266141090 265966682 265829678 265937920 266413040 267297535 268556595 270058975 271565475 272766895
3602 272766895 273385143 273298969 272623978 271693401 270938110 270721874 271205921 272292023 273655643 274844952
3612 274844952 275422897 275126820 274013119 272525005 271413479 271480427 273207626 276435356 280283947
3621 280283947 283420372 284594917 283203335 279584827 274890862 270585384 267835293 267097969 268080540
3630 268080540 270031376 272157726 273943081 275250473 276245728 277252464 278623810 280637283 283375645
3639 283375645 286596012 289664097 291664352 291721725 289423904 285121117 279896736 275170345 272112732
3648 272112732 271174736 271977024 273600121 275088139 275883236 275982533 275797710 275863075 276578979 278100452
3658 278100452 280354176 283103008 285997314 288618336 290556412 291534271 291518555 290731430 289519711
3667B89519711j378041j532631j904697k521916l146381l386822k921314j689758O0138
3676B71098289J890774L367081M201374M285908L638744K348862N78098j393604l154621
3685B86860905m246636m335441l378544j678829K24132J773472K603455K634410K028809
3694B82485733J070766N7774p46269j121388r20276j41354R93061K039643K473106
3703B86190796J927547M18663j594696l371944m211960l771019k211723j10436J814442
3712B75079670L005047L250599K691555J679783N95436k86160q34637j030063r04923
3721B83246307n04894J11733Q46061J528454J918526J760864Q94890o14758k401313
3730B86785870l848381m299641l365212j177635J564560L841381M760666L993282J948472
$$ plain form
3667 289519711 288141670 286609039 284704342 282182426 279036045 275649223 272727909 271038151 271098289
3676 271098289 272989063 276356144 280557518 284843426 288482170 290831032 291409130 290015526 286860905
3685 286860905 282614269 278278828 274900284 273221455 273445587 275219059 277822514 280456924 282485733
3694 282485733 283556499 283614273 282868004 281746616 280826340 280684986 281678047 283717690 286190796
3703 286190796 288118343 288537006 286942310 283570366 279358406 275587387 273375664 273265228 275079670
3712 275079670 278084717 281335316 284026871 285706654 286302090 286015930 285181293 284151230 283246307
3721 283246307 282741413 282853146 283699207 285227661 287146187 288907051 289801941 289187183 286785870
3730 286785870 282937489 278637848 275272636 274095001 275659561 279500942 284261608 288254890 290203362
3739B90203362m31347k159443k709980k250958j470203j109047j492729k343598k986564
3748B73249493k801133j632156J00212J647835K372551K100258J182194K49958j63918
3757B76305294R3689P64065J376323J531029J097279K35004p27253j459274j746502
3766B77469654j527901q78143K2869R22909J547165J679993J260566M36917m72393
3775B80461636j113835j266784r49498l95469Q9759L04127K49634J00250O5842K49424
3785B77795086N91087R29947J127415J157894J102104J051808J008205Q58593M58145
3794B86080284k40288j107425j879330k301331k278938j926288j475583j104316q07991
3803B72958794m12960K71091J264038K328987L063259L115597K395935J136437k33536
$$ plain form
3739 290203362 289772015 287612572 284902592 282651634 281181431 280072384 278579655 276236057 273249493
3748 273249493 270448360 268816204 268916416 270564251 272936802 275037060 276219254 276469212 276305294
3757 276305294 276398983 277163048 278539371 280070400 281167679 281402683 280675430 279216156 277469654
3766 277469654 275941753 275063610 275086479 276009388 277556553 279236546 280497112 280934029 280461636
3775 280461636 279347801 278081017 277131519 276736050 276825809 277129936 277379570 277479820 277545662 277795086
3785 277795086 278386173 279316120 280443535 281601429 282703533 283755341 284763546 285622139 286080284
3794 286080284 285839996 284732571 282853241 280551910 278272972 276346684 274871101 273766785 272958794
3803 272958794 272545834 272816925 274080963 276409950 279473209 282588806 284984741 286121178 285887642
3812B85887642j318550j944981k189522k247219k246265k143917j776829j021538N8193
3821B71057014J190815K027283K337303K140503J682396J268082J063938R96189Q11958
3830B84575481K63901p01256j873092k869149l334465l123169k352581j299724k14481
3839B69071465Q24298J905861L132572M413929N360642N386085M000283J151066k590447
3848B92655754o142673q312188q305320o098786k474384J309318M050408N080891M468631
3857B76231651K871247J149711m4002n06859m63238l39374m80099r62315j582451j997223
3867B73877048j925334j297417k88239P72648J554184J859894J685734J182823N61542
3876B77982883m653m27208o90480q09059p97748o74477m86412l17841k56939l28922
$$ plain form
3812 285887642 284569092 282624111 280434589 278187370 275941105 273797188 272020359 270998821 271057014
3821 271057014 272247829 274275112 276612415 278752918 280435314 281703396 282767334 283763523 284575481
3830 284575481 284839382 284138126 282265034 279395885 276061420 272938251 270585670 269285946 269071465
3839 269071465 269895763 271801624 274934196 279348125 284708767 290094852 294095135 295246201 292655754
3848 292655754 286513081 278200893 269895573 263796787 261322403 262631721 266682129 271763020 276231651
3857 276231651 279102898 280252609 280208607 279701748 279238510 278899136 278419037 277456722 275874271 273877048
3867 273877048 271951714 270654297 270366058 271138706 272692890 274552784 276238518 277421341 277982883
3876 277982883 277978230 277551022 276860542 276051483 275253735 274579258 274092846 273775005 273518066 273189144
3886B73189144m46987m30546j01242N89199J481724K245064K517013K082234R85565
3895B82111168m79050j896724k898942l285617l054810k349777j373406l23181O39954
3904B67089615J395645J865463K017975J872330J489391R52854L51258k28196p00759
3913B76105576r89457j048317q90293n96904k90013p3471J9283L6068O0177J39446
3923B72472095K41185K68287J31073j75781n44395q00400p96433m96578o29N03769
3933B70802193Q31470Q81005O70299L14293l4218k52380k93846j99738p0629j1826
3943B72636623p6866k38933m07505m83170m19674k51465o8454M4956O2523K4948j698
3954B70821285J8082O4278Q4705M5910l5324j05057j19267q2073l9120l4008o7234
$$ plain form
3886 273189144 272742157 272311611 272210369 272799568 274281292 276526356 279043369 281125603 282111168
3895 282111168 281632118 279735394 276836452 273550835 270496025 268146248 266772842 266449661 267089615
3904 267089615 268485260 270350723 272368698 274241028 275730419 276683273 277034531 276806335 276105576
3913 276105576 275116119 274067802 273177509 272580605 272290592 272217121 272236404 272272472 272332649 272472095
3923 272472095 272713280 272981567 273112640 272936859 272392464 271592064 270795631 270299053 270298424 270802193
3933 270802193 271633663 272514668 273184967 273499260 273465042 273212662 272918816 272719078 272648449 272636623
3943 272636623 272559757 272320824 271913319 271430149 271010475 270759010 270690556 270735512 270798035 270822983 270821285
3954 270821285 270839367 270903645 270988350 271034260 270998936 270893879 270774612 270692539 270653419 270619411 270552177
3965B70552177r6588q2550l2921l204m4022j42574k16312j77975k1973J47362J84536
3976B70065956K3747k48471m44984m25701k24076l5152n7392l11604n99937o69346
3986B67073040m58889k11716l09295r14612j716557k060451j491242l78380j20601
3995B59411297k614155r141617j9299030l0685139l9697370
4000A57973986
$$ plain form
3965 270552177 270455589 270373039 270340118 270336914 270292892 270150318 269934006 269756031 269734058 269881420 270065956
3976 270065956 270089703 269841232 269396248 268970547 268746471 268711319 268653927 268342323 267742386 267073040
3986 267073040 266614151 266402435 266093140 265178528 263461971 261401520 259910278 259531898 259411297
3995 259411297 256797142 247655525 228356495 197671356 157973986
4000 157973986
##END=$$ End of the data block
