##TITLE=$$ Begin of the data block
##JCAMP-DX=5.00 $$ ACD/SpecManager v 10.08
##SPECTROMETER/DATA SYSTEM=16PC
##DATE=Mon Sep 02 17:01:44 2013
##DATA TYPE=INFRARED SPECTRUM
##DATA CLASS=XYDATA
##ORIGIN=
##OWNER=
##NPOINTS=3601
##FIRSTX=400.00000000
##LASTX=4000.00000000
##MAXX=4000.00000000
##MINX=400.00000000
##MAXY=37.52752686
##MINY=9.15367699
##XFACTOR=1.0000000000
##YFACTOR=0.000000100000000
##FIRSTY=20.56450844
##DELTAX=1.00000000
##XUNITS=1/CM
##YUNITS=TRANSMITTANCE
##XYDATA=(X++(Y..Y))
400B05645084N3899556M1423683K5553703J1776886L642883J370964K417488L483239
408C49213486K603302M3030k395897k992402j453094R03130K139663J095581j809997
417C47346802m873696o236534n048141j919289J557388L818017M183387L061753J480178
426C43369865L45688n7449o5880k31056q50372j758728k482453k597656k026558j080742
436C32564659k51160R2125j11694o40716j184731j558189j785622k019081k364121
445C22741470k752208k955571k739143k037373j033344p3204N29194O71978N11646
454C12863445L49140M35048Q20560J346550J764813J904449J774921J551552J465721
463C24276199J675949K192879K882919L532944L934784L957596L594131K968979K304001
$$ plain form
400 205645084 259544640 300968323 326522026 338298912 341941795 343312759 345730247 349213486
408 349213486 351816788 351859818 349463921 346471519 345018425 345921555 348061218 349156799 347346802
417 347346802 342473106 336236572 331188431 329269142 330826530 334644547 338827934 341889687 343369865
426 343369865 343715553 343658104 343592224 343361168 342510796 340752068 338269615 335671959 333645401 332564659
436 332564659 332313499 332405624 332293930 331653214 330468483 328910294 327124672 325105591 322741470
445 322741470 319989262 317033691 314294548 312257175 311223831 311150627 311679821 312351799 312863445
454 312863445 313212585 313647633 314468193 315814743 317579556 319484005 321258926 322810478 324276199
463 324276199 325952148 328145027 331027946 334560890 338495674 342453270 346047401 349016380 351320381
472C51320381J837082J717148J925316K271347K485008K359657J867104J172218N30701
481C67485962J34354j488l9940k14577o85768j447754k337761l128700l641281l811684
491C52311363l688392l378754k983399k556190k095604j561623r05914j06850P99942
500C35834579J707192K450027K850647K774659K169303J064682m57115k290191m299469
509C41804314o276894p902374q763733q468933o819916l959541l97988L126374N901832
518C08243141P497902P890968P403260O496200N538063M669915L831901K909584J892204
527C56373138R35593K87705J26037M17595Q97064J189537J011734L33748n94253j369553
537C59608345j647415j314201n31960L61824J030884J288948J147613P54548K84004
$$ plain form
472 351320381 353157463 354874611 356799927 359071274 361556282 363915939 365783043 366955261 367485962
481 367485962 367620316 367618828 367578888 367364311 366678543 365230789 362893028 359764328 356123047 352311363
491 352311363 348622971 345244217 342260818 339704628 337609024 336047401 335141487 335034637 335834579
500 335834579 337541771 339991798 342842445 345617104 347786407 348851089 348393974 346103783 341804314
509 341804314 335527420 327625046 318861313 310392380 303572464 299612923 299214935 302341309 308243141
518 308243141 315741043 323632011 331035271 337531471 343069534 347739449 351571350 354480934 356373138
527 356373138 357308731 357596436 357722473 358140068 359037132 360226669 361238403 361572151 360977898 359608345
537 359608345 357960930 356646729 356114769 356476593 357507477 358796425 359944038 360698586 360982590
546C60982590j47934n03006p83997r94797j128883j192017j225433j296196j453743
555C52256584j685371j910515k029381j994476j850167j708030j665268j722489j760711
564C35930176j600228j105003k73781P42073J697083K348404K542305K249412J557274
573C44087715O39115k80991r67980j231536r93424l41263M74625J122208J324806R91020
583C44824295K66304n29365j048813j081505o46477K1629N84679P48711L82728m38270
593C43083916j471978k404785k966079l019295k604447j915779j224289p71179o70051
602C26036034q60138j130448j208152q78258q2817J038246K186813L012543L246422
611C31360245K811203J863098P43408j45340m94766k10152N52140J451988K104873
$$ plain form
546 360982590 360834656 360331650 359547653 358552856 357423973 356231956 355006523 353710327 352256584
555 352256584 350571213 348660698 346631317 344636841 342786674 341078644 339413376 337690887 335930176
564 335930176 334329948 333224945 332951164 333693237 335390320 337738724 340281029 342530441 344087715
573 344087715 344726830 344445839 343477859 342246323 341252899 340911636 341386261 342508469 343833275 344824295
583 344824295 345090599 344561234 343512421 342430916 341784439 341806068 342390747 343139458 343522186 343083916
593 343083916 341611938 339207153 336241074 333221779 330617332 328701553 327477264 326706085 326036034
602 326036034 325175896 324045448 322837296 321959038 321876221 322914467 325101280 328113823 331360245
611 331360245 334171448 336034546 336777954 336632614 336137848 335927696 336479836 337931824 340036697
620C40036697K234612J775207Q80166j52054j001740j442451j406136r81293l55148
629C39587860K67563P37877R99908J083222J058807R86328Q76999O92520L79334q4305
639C46586113o54411j218224j628456j755867j544151j046334m29115O2790J82266
648C38554611k23655j131745k325630l469849m256019m549446m446659m193383m003525
657C09954700l889102l627072k904377j562824K19517J947727L048305L188687K477169
666C08852730J407165N73521L37200O51226J147042J409263J244278P66678K67448
675C16656551k2659r0275j13983k89020o50387j032601j194019j011867n96886k48718
685C11406136k86313q77933j980705l409558m956817o458664p768288q685894q944912
$$ plain form
620 340036697 342271309 344046516 344926682 344774628 343772888 342330437 340924301 339943008 339587860
629 339587860 339855423 340593300 341593208 342676430 343735237 344721565 345598564 346291084 346670418 346586113
639 346586113 345931702 344713478 343085022 341329155 339785004 338738670 338309555 338372345 338554611
648 338554611 338330956 337199211 334873581 331403732 327147713 322598267 318151608 313958225 309954700
657 309954700 306065598 302438526 299534149 297971325 298190842 300138569 303186874 306375561 308852730
666 308852730 310259895 310833416 311170616 311821842 312968884 314378147 315622425 316389103 316656551
675 316656551 316633892 316543617 316429634 316140614 315490227 314457626 313263607 312251740 311654854 311406136
685 311406136 311119823 310241890 308261185 304851627 299894810 293436146 285667858 276981964 268037052
694B68037052q309555o736946m485531k058544K0332J482449K463894L421497M842377
703B58677025O911888R340534J1458340J2535534J2149067J0398216P854805N286560
711C34611969L311424K159043J649475J369972R35669J90506p42111j563530j982346
720C39940071j873894j341323o61126j53846m6616l88031j045189j771202k311974
729C30346870k506408k342263j952934j555214j355591j462726j844635k351685k795410
738C12180004l045711l095589l055935l082314l272914l600998l922596m061508l922349
747B81120090l563308l179989l002701l165588l618279m134941m414234m215698l461151
756B48364201k252617q10700O23017J860542K789211L345719L482093L160191K384148
$$ plain form
694 268037052 259727497 252990551 248505020 246446476 246466808 247949257 250413151 253834648 258677025
703 258677025 265588913 274929447 286387787 298923321 311072388 321470604 329325409 334611969
711 334611969 337923393 340082436 341731911 343101883 344037552 344228058 343485947 341922417 339940071
720 339940071 338066177 336724854 336063728 335909882 335863266 335475235 334430046 332658844 330346870
729 330346870 327840462 325498199 323545265 321990051 320634460 319171734 317327099 314975414 312180004
738 312180004 309134293 306038704 302982769 299900455 296627541 293026543 289103947 285042439 281120090
747 281120090 277556782 274376793 271374092 268208504 264590225 260455284 256041050 251825352 248364201
756 248364201 246111584 245300884 245923901 247784443 250573654 253919373 257401466 260561657 262945805
765B62945805J249847l2711j174583j899109k051278j669940r82514l14159M6940k7943
775B56090355m59137j001835j361446j325817q52223p5397P65609J437092J808720
784B55025921J894932J830101J794452J929493K278042K770519L256779L567677L581390
793B77929306L269405K708531K055740J493073J167392J142865J386604J788959K208882
802B95150757K524757K671757K654858K535324K400589K325134K339001K410202K452030
811C17464409K354736K031784J464424P19681o7482p45888j208305j431007j470089
820C19112263j417847j338978j226845r98325n36690K38114J307564K527904L655205
829C21322365M418106M610214M171448L223495K041169R63745K75001R8839L55072
$$ plain form
765 262945805 264195652 264162941 262988358 261089249 259037971 257368031 256385517 256071358 256118298 256090355
775 256090355 255631218 254629383 253267937 251942120 251089897 251014500 251780109 253217201 255025921
784 255025921 256920853 258750954 260545406 262474899 264752941 267523460 270780239 274347916 277929306
793 277929306 281198711 283907242 285962982 287456055 288623447 289766312 291152916 292941875 295150757
802 295150757 297675514 300347271 303002129 305537453 307938042 310263176 312602177 315012379 317464409
811 317464409 319819145 321850929 323315353 324035034 323967552 323221664 322013359 320582352 319112263
820 319112263 317694416 316355438 315128593 314130268 313593578 313831692 315139256 317667160 321322365
829 321322365 325740471 330350685 334522133 337745628 339786797 340750542 341025543 341124382 341479454
838C41479454P97730J125640J114731P16439P6561n34134q42553o93245j13296P03773
848C43831100J482048J975213K058334J763725J253281P43599M16984L54348N12886
857C54391518P54547R10911Q56057N58509R2202l96424p51724q71925p51152m79966
867C54312553k10456r7123k39448o42929j213303j780662k149239k156181j723976
876C44099236q91381J90354J296768K198562K734757K866630K685128K368278K101097
885C59649429J994400K037163K109299K047920J737785J180497N07583p2136l65753
894C70826187k87590R6512N93758R65423J030579P41577K01607l84331q00247r11408
904C72072067p16552l41492K3193K07672J34125j54953n24368q10433q93631p47375
$$ plain form
838 341479454 342277184 343402824 344517555 345233994 345310555 344776421 343933868 343240623 343127327 343831100
848 343831100 345313148 347288361 349346695 351110420 352363701 353107300 353524284 353878632 354391518
857 354391518 355146065 356056976 356913033 357471542 357563744 357167320 356415596 355543671 354792519 354312553
867 354312553 354102097 354004974 353765526 353122597 351909294 350128632 347979393 345823212 344099236
876 344099236 343207855 343398209 344694977 346893539 349628296 352494926 355180054 357548332 359649429
885 359649429 361643829 363680992 365790291 367838211 369575996 370756493 371264076 371191940 370826187
894 370826187 370538597 370635109 371228867 372194290 373224869 373966446 374168053 373783722 372983475 372072067
904 372072067 371355515 371014023 371037216 371244888 371379013 371224060 370699692 369889259 368995628 368248253
914C68248253m40903j01509J46675K37427J85890P4501Q927O6452K60925N38902Q02422
925C70027962R49783R12590O77567K89535j62659n68389q23861q62083o79817l50151
935C69410477q622J89248J31607j94588o86226j160240j434174j411781j131668p50351
945C62953682m66843m27055o57158j055946j447449j660385j596108j254577p18499
954C53669662j10206M51698Q79784J129036J196365J114998R46541P65228O36063N90629
964C61269798O15311O56776O49414N50538L64227J43623l5324j13106p8621K3308J11847
975C64157791J09978k1172k66227n67666q54148j069184j186638j208191j150627j034431
985C56909485q79669p06215n34554l81851k55737j57700r1591p8659j59073l75747
$$ plain form
914 368248253 367807350 367705841 367852516 368089943 368275833 368350334 368359261 368425713 368686638 369225540 370027962
925 370027962 370977745 371890335 372567902 372857437 372694778 372126389 371302528 370440445 369760628 369410477
935 369410477 369401855 369591103 369722710 369528122 368841896 367681656 366247482 364835701 363704033 362953682
945 362953682 362486839 362059784 361402626 360346680 358899231 357238846 355642738 354388161 353669662
954 353669662 353559456 354011154 354890938 356019974 357216339 358331337 359277878 360043106 360679169 361269798
964 361269798 361885109 362541885 363191299 363741837 364106064 364249687 364214363 364101257 364022636 364045944 364157791
975 364157791 364267769 364246597 363980370 363412704 362558556 361489372 360302734 359094543 357943916 356909485
985 356909485 356029816 355323601 354789047 354407196 354151459 353993759 353902168 353823509 353664436 353288689
995C53288689p40624j206093j661949j969528k021332j794090j366730q88099n13497
1004C41126747l40195l74603n43747p39059q67958q88672q20046p27043o94122p93266
1014C34338036j058159j467629j948547k400704k736206k915763k960778k928200k860221
1023C13061829k736359k461948j906662r78508L03535J782036L194694M260388M775295
1032C19294300M678783M063263L129578K113075J212540N45502J37520n8823j30119
1041C34985619j66398k32582l54194n17197o81724q03223q53386q34579p81899p51648
1051C29008789p99560r57337j215439j521148j795960j967506k003041j929550j827507
1060C14991741j798305j919003k206020k608757l036270l405610l684406l905887m148140
$$ plain form
995 353288689 352548065 351341972 349680023 347710495 345689163 343895073 342528343 341640244 341126747
1004 341126747 340786552 340411949 339868202 339129143 338261185 337372513 336552467 335825424 335131302 334338036
1014 334338036 333279877 331812248 329863701 327462997 324726791 321811028 318850250 315922050 313061829
1023 313061829 310325470 307863522 305956860 304978352 305281887 307063923 310258617 314519005 319294300
1032 319294300 323973083 328036346 331165924 333278999 334491539 335037041 335174561 335115738 334985619
1041 334985619 334819221 334586639 334232445 333715248 333033524 332230301 331376915 330542336 329760437 329008789
1051 329008789 328209229 327251892 326036453 324515305 322719345 320751839 318748798 316819248 314991741
1060 314991741 313193436 311274433 309068413 306459656 303423386 300017776 296333370 292427483 288279343
1069B88279343m488621m961949n542831o163082o750450p265473p714748q134499q554344
1078B28703346q966045r313831r512063r479427r169559q582516p755661o741743n591746
1087A53590755m351825l073273j823015o81544K79522J032439J623125K176924K869224
1096A51642332L864470N246639O966190Q830109J0542011J1785584J2320346J2062321
1104B23260002J1114597R740162Q281994P058430O268024N937329N927257N994873
1112B83582668N888501N440177M624196L561801K471962J590577J090240J031818J360951
1121C10642891J946545K634830L293495L830376M186783M323272M212990L850403L266411
1130C42187996K532501J746178R99260L48282j97220o60935j072654j442109j752204
$$ plain form
1069 288279343 283790722 278828773 273285942 267122860 260372410 253106937 245392189 237257690 228703346
1078 228703346 219737301 210423470 200911407 191431980 182262421 173679905 165924244 159182501 153590755
1087 153590755 149238930 146165657 144342642 143661098 143940620 144973059 146596184 148773108 151642332
1096 151642332 155506802 160753441 167719631 176549740 187091751 198877335 211197681 223260002
1104 223260002 234374599 244114761 252396755 259455185 265723209 271660538 277587795 283582668
1112 283582668 289471169 294911346 299535542 303097343 305569305 307159882 308250122 309281940 310642891
1121 310642891 312589436 315224266 318517761 322348137 326534920 330858192 335071182 338921585 342187996
1130 342187996 344720497 346466675 347465935 347814217 347616997 346956062 345883408 344441299 342689095
1139C42689095j966706k046814j962852j700096j263390o85654l9672N64231J002121
1148C34590263J180153J080513P78351M13857J30996J0681L7613J16768J28784o980
1158C38460999k97623o80008j057701j344567j496887j519623j455497j359444j276817
1167C27972832j225777j199036j181526j178550j235886j429482j818065k378826k965813
1176C13359871l331413l221703k504272j262188K07767J503277K283668K406388J966953
1185C11408348J224690M65889j19744m87232p03850q73508j072731j331349j649456
1194C06861057k023411k453308k930393l422298l877373m250488m533043m766693n027485
1203B73576565n392876n910339o587506p402134q319320r300919j0301609j1259098
$$ plain form
1139 342689095 340722389 338675575 336712723 335012627 333749237 333063583 333023911 333588142 334590263
1148 334590263 335770416 336850929 337629280 338043137 338174133 338184814 338222427 338339195 338467979 338460999
1158 338460999 338163376 337483368 336425667 335081100 333584213 332064590 330609093 329249649 327972832
1167 327972832 326747055 325548019 324366493 323187943 321952057 320522575 318704510 316325684 313359871
1176 313359871 310028458 306806755 304302483 303040295 303248062 304751339 307035007 309441395 311408348
1185 311408348 312633038 313098927 312979183 312491951 311788101 310914593 309841862 308510513 306861057
1194 306861057 304837646 302384338 299453945 296031647 292154274 287903786 283370743 278604050 273576565
1203 273576565 268183689 262273350 255685844 248283710 239964390 230663471 220361862 209102764
1211B09102764j2088413j2688980j2957802j2803946j2160034j0991659r311781p195778
1219A18904371m788694k290630Q2311K151947L824396N105706O081972O873197P583857
1228A43528433Q272018Q941508R554882J0052910J0373935J0469265J0315857R926052
1236B21434860R350548Q670082P975769P346249O830692O441727O163254N960636N793781
1245B85967598N625477N428657N191212M915695M613190M289856L934803L519230L008766
1254C26494484K383995J651459Q36181m2152r88960k031594l184661m403153n559463
1263C15156136o464768o935902o868267o274356n263958l982830k554780j067504L93982
1272B76137753J696891K646427L032761K720070J723957K23713j504822l198910m695587
$$ plain form
1211 209102764 197014351 184325371 171367569 158563623 146403589 135411930 126100149 118904371
1219 118904371 114115677 111825047 111907358 114059305 117883701 122989407 129071379 135944576 143528433
1228 143528433 151800451 160741959 170296841 180349751 190723686 201192951 211508808 221434860
1236 221434860 230785408 239455490 247431259 254777508 261608200 268049927 274213181 280173817 285967598
1245 285967598 291593075 297021732 302212944 307128639 311741829 316031685 319966488 323485718 326494484
1254 326494484 328878479 330529938 331366119 331323967 330335007 328303413 325118752 320715599 315156136
1263 315156136 308691368 301755466 294887199 288612843 283348885 279366055 276811275 275743771 276137753
1272 276137753 277834644 280481071 283513832 286233902 287957859 288181572 286676750 283477840 278782253
1281B78782253n948200o969070p744809q181095q116207p392196n944100l856277j362439
1290B23267860J206685L501396N229187O212444O419182N964641N078698M041175L097973
1299B64019241K384968J889115J465091R01776J2607j282959k915039m662704o194096
1308B55618000p136421p162628o079731l899994q67062K579632N903797Q605290J0343990
1317B57904873J1007500J0704078R690743Q277778O745778N302791M077473L130970
1325C16841984K471008K057781J809769J612968J339035Q67119J08261r68589k304535
1334C23834801l723984m931126n556373n263787l888855j549682J336555M164543O342755
1343C10764847P499695P595672O886330N766907M584732L520507K584610J705742Q36869
$$ plain form
1281 278782253 272834053 265864983 258120174 249939079 241822872 234430676 228486576 224630299 223267860
1290 223267860 224474545 227975941 233205128 239417572 245836754 251801395 256880093 260921268 264019241
1299 264019241 266404209 268293324 269758415 270660191 270672798 269389839 266474800 261812096 255618000
1308 255618000 248481579 241318951 235239220 231339226 230472164 233051796 238955593 247560883 257904873
1317 257904873 268912373 279616451 289307194 297584972 304330750 309633541 313711014 316841984
1325 316841984 319312992 321370773 323180542 324793510 326132545 326999664 327107925 326139336 323834801
1334 323834801 320110817 315179691 309623318 304359531 300470676 298920994 300257549 304422092 310764847
1343 310764847 318264542 325860214 332746544 338513451 343098183 346618690 349203300 350909042 351745911
1352C51745911N645p15637j284103j746788k239647k923355l893318n110283o384125
1361C27454300p415466p879525p526054o270504m247761j804542N81169K436027L434735
1370B98762379L492984K768860J576157K57893r19800j812420k380753k649097k670956
1379B96425247k516537k267799k002334j762639j531162j234321p87678j56651O01959
1388B84768085J347352J911640K173271K110023J802349J391564J014786P48748N85461
1397B97853279M47426K32220j31894o45561j234131j782455k191925k428589k530785
1406B87587585k574443k618466k669277k692394k658787k590618k563801k658577k886524
1415B63674698l147488l251877l004303k303352j203270R6932J328601K257576K768975
$$ plain form
1352 351745911 351751556 351035919 349751816 348005028 345765381 342842026 338948708 333838425 327454300
1361 327454300 320038834 312159309 304633255 298362751 294114990 292310448 292891617 295327644 298762379
1370 298762379 302255363 305024223 306600380 306858273 305938473 304126053 301745300 299096203 296425247
1379 296425247 293908710 291640911 289638577 287875938 286344776 285110455 284322777 284166126 284768085
1388 284768085 286115437 288027077 290200348 292310371 294112720 295504284 296519070 297267818 297853279
1397 297853279 298300705 298532925 298401031 297755470 296521339 294738884 292546959 290118370 287587585
1406 287587585 285013142 282394676 279725399 277033005 274374218 271783600 269219799 266561222 263674698
1415 263674698 260527210 257275333 254271030 251967678 250764408 250861340 252189941 254447517 257216492
1424B57216492K901058K815914K718906K757397K942639L136119L117447K710820J903286
1433B82220078Q80622n0335o17923p29161n11379k26593j20449l03192p36332j311111
1443B78494225j940003k582531l192558l656006l801956l512249k856388k130451j731053
1452B53091030j916084k607861l390541l733616l315296k235546r69963q0566J32389
1461B34973946j85318n42126m20227L92513J664238K856465L442020L204040K344246
1470B47729797J349831P15332O89602J179752J847878K319774K383213K070542J605053
1479B61890774J257801J202850J441422J821270K126331K187843J964913J565628J201572
1488B76660404J094361J370277J989326K753640L406486L786392L948956M167309M773349
$$ plain form
1424 257216492 260117550 262933464 265652370 268409767 271352406 274488525 277605972 280316792 282220078
1433 282220078 283100700 283050365 282432442 281703281 281191902 280965309 280844860 280541668 279805336 278494225
1443 278494225 276554222 273971691 270779133 267123127 263321171 259808922 256952534 254822083 253091030
1452 253091030 251174946 248567085 245176544 241442928 238127632 235892086 234922123 234841557 234973946
1461 234973946 234788628 234246502 233826275 234218788 235883026 238739491 242181511 245385551 247729797
1470 247729797 249079628 249794960 250484562 251664314 253512192 255831966 258215179 260285721 261890774
1479 261890774 263148575 264351425 265792847 267614117 269740448 271928291 273893204 275458832 276660404
1488 276660404 277754765 279125042 281114368 283868008 287274494 291060886 295009842 299177151 303950500
1497C03950500N904522P309952Q365917Q348275O842575M055671Q18787j763954k844124
1506C40988121k239342m85115J491890K872811L316879L006401K391853J844025J452408
1515C54639931J068268N09491k50206j043625j621247j802215j551705r57603j63269
1524C48827820O68030J350402J685601J541404R70612K70805j14593J53389J049194
1533C56402664K104950K610932K010612K57950k091751m129181n040817m502793k808838
1542C44813728o84585J080055J976662J946182J329422O64406M32663Q46748J741066
1551C54146347K609558K798233J810646l96271l276710n839272p046775o305161l790703
1560C34709892m23164K524490M001007L644715J908264k10838j688576j966171j175652
$$ plain form
1497 303950500 309855022 317164974 325530891 333879166 340721741 344777412 345596199 343832245 340988121
1506 340988121 338748779 338263664 339755554 342628365 345945244 348951645 351343498 353187523 354639931
1515 354639931 355708199 356217690 355967484 354923859 353302612 351500397 349948692 348991089 348827820
1524 348827820 349495850 350846252 352531853 354073257 355043869 355314674 355200081 355353470 356402664
1533 356402664 358507614 361118546 363129158 363387108 361295357 357166176 352125359 347622566 344813728
1542 344813728 344129143 345209198 347185860 349132042 350461464 351125870 351558533 352405281 354146347
1551 354146347 356755905 359554138 361364784 360968513 357691803 351852531 344805756 338500595 334709892
1560 334709892 334286728 336811218 340812225 344456940 346365204 346154366 344465790 342499619 341323967
1569C41323967J640P43370N34974n75943k044983l156815l422966k823334j768188
1578C28811722q22334l71438m33273p15065q55255o75087k77710N4665P0381k90756
1588C24495850q91343j522522k055625k494698k908344l306885l574047l511219k964344
1597C01266823j938439o27517O52752J581554J935215J645794Q16975k90966j321412
1606C03720779j934700j957988j498680r33056p35245j215477k319641l626385m568367
1615B84931240m751816m179382l238182k465687k248268k639561l389015m131794m594250
1624B53293285m692878m505043m179249l873463l750152l981305m707431n940018p474632
1633B10189114q904000r763126r748364q881340p515773o171627n287905n023871n208215
$$ plain form
1569 341323967 341325607 342068977 342603951 342028008 339983025 336826210 333403244 330579910 328811722
1578 328811722 327989388 327617950 327184677 326469612 325614357 324939270 324661560 324716225 324786606 324495850
1588 324495850 323604507 322081985 320026360 317531662 314623318 311316433 307742386 304231167 301266823
1597 301266823 299328384 298700867 299353619 300935173 302870388 304516182 305333157 305042191 303720779
1606 303720779 301786079 299828091 298329411 297396355 296661110 295445633 293125992 289499607 284931240
1615 284931240 280179424 276000042 272761860 270296173 268047905 265408344 262019329 257887535 253293285
1624 253293285 248600407 244095364 239916115 236042652 232292500 228311195 223603764 217663746 210189114
1633 210189114 201285114 191521988 181773624 172892284 165376511 159204884 153916979 148893108 143684893
1642A43684893n443354n298901m495267l001929j023464J112022L105259M816847O309357
1651A39765463P771616R352665J0996170J2385120J3060303J2669601J1204396R067859
1659B26273193O904183N271206M355335L906879L444195K593746J338234J1158r54227
1668B53143902j338272j285267j185856j376114j876011k364273k417793j853886r30233
1677B38516197k49672m16679j658535l659916n713902p100715p461357o953106o117726
1686A99184589n569191n695457o529713p820568r209480j0385008j1140976j1350193
1694A31484003j0924463r820891q092212n929156l638191j542320J47619J415882K430763
1703I5531034L440686M636335O045485P505073Q712893R324989R060469P780952N534582
$$ plain form
1642 143684893 138241539 132942638 128447371 125445442 124421978 125534000 128639259 133456106 139765463
1651 139765463 147537079 156889744 167885914 180271034 193331337 206000938 217205334 226273193
1659 226273193 233177376 238448582 242803917 246710796 250154991 252748737 254086971 254098129 253143902
1668 253143902 251805630 250520363 249334507 247958393 246082382 243718109 241300316 239446430 238516197
1677 238516197 238266525 237849846 236191311 232531395 226817493 219716778 212255421 205302315 199184589
1686 199184589 193615398 187919941 181390228 173569660 164360180 153975172 142834196 131484003
1694 131484003 120559540 110738649 102646437 96717281 93079090 91536770 91684389 93100271 95531034
1703 95531034 98971720 103608055 109653540 117158613 125871506 135196495 144256964 152037916 157572498
1712A57572498K559414p54900l944578o576071q349342r160776r097367q358497p139721
1721A06750660n540304l544464j093722J788082M896393P844210J0180025J1575699
1729A32856579J1981296J1653948J1030359J0506955J0249595J0141068R898166R282551
1737B17600517Q275490P108421O130696N600929N529499N670776N665799N247993M391785
1746B71221905L322162K390557J893444J935024K396679L015747L516865L723182L602677
1755B97018242L240852K775002K335109K015477J878776J964360K277755K757530L248806
1764C19511909L521958L354797K652016J534500L32451n39436p70531l07884O16150
1773C29905930J600837K269821K433358K133102J568947R73701N20668L03116L58963
$$ plain form
1712 157572498 160131912 159377012 155432434 148856363 140507021 131346245 122248878 113890381 106750660
1721 106750660 101210356 97665892 96572170 98360252 103256645 111100855 121280880 132856579
1729 132856579 144837875 156491823 167522182 178029137 188278732 198419800 208317966 217600517
1737 217600517 225876007 232984428 239115124 244716053 250245552 255916328 261582127 266830120 271221905
1746 271221905 274544067 276934624 278828068 280763092 283159771 286175518 289692383 293415565 297018242
1755 297018242 300259094 303034096 305369205 307384682 309263458 311227818 313505573 316263103 319511909
1764 319511909 323033867 326388664 329040680 330575180 330907631 330368195 329597664 329289780 329905930
1773 329905930 331506767 333776588 336209946 338343048 339911995 340885696 341406364 341709480 342068443
1782C42068443O85349J212578J769294K096939J952477J257172J95465q23899j354789
1791C49059029j151505l17230P36160J501579J641694J153831L47328l41263n81741
1800C52047882l01323L12500R39942J300849J279755R52530N16243J76392M7721J17989
1810C57390480K81372M17938M66805M54330M58756N41992O98166Q53958R22966Q69904
1820C63356667P31582N80063M55589L31154J42174j36833m35143o05850n21049j76049
1830C63722305K86217O59790Q17947Q04368P94715R47266J248817J481629J351280
1839C72114334P01981l33176j360283j927414j779518j004066K4604Q56591J203842
1848C68496895J060104O48918K58751P5722J10092K39906L20740K83928J70822R4223
$$ plain form
1782 342068443 342753792 343966370 345735664 347832603 349785080 351042252 351237717 350413818 349059029
1791 349059029 347907524 347590294 348326454 349828033 351469727 352623558 352970886 352629623 352047882
1800 352047882 351746559 352059059 352999001 354299850 355579605 356532135 357048378 357224770 357272491 357390480
1810 357390480 357671852 358089790 358556595 359010925 359469681 360011673 360709839 361563797 362486763 363356667
1820 363356667 364088249 364668312 365123901 365455055 365597229 365460396 365025253 364419403 363898354 363722305
1830 363722305 364008522 364668312 365486259 366290627 367085342 368032608 369281425 370763054 372114334
1839 372114334 372816315 372483139 371122856 369195442 367415924 366411858 366436462 367293053 368496895
1848 368496895 369556999 370205917 370464668 370540390 370650482 370890388 371211128 371495056 371665878 371760101
1858C71760101J59874L92609P04918R24644Q72612M60511k40326j003724j537132j620025
1868C70874062j218911n12123J98250O38695O93283M37393O5193k34298l69454l57056
1878C70215034k66952j54495l4752R1209J97525K27089J28556r0447l47176n23796
1888C69441795n40962m10118k23885r0446o0577j01014j30691q8196K2850J41296J99929
1899C68159981J75285R6474J2626n0773j04866j71356k41356k61727j66931O2256L60565
1910C67870178N96428O42929M57649J15395k28806m25758m13208k41165l1052J01509
1920C68444099J10627L3607m4861n2757K6665J49536K40784K38876J28288n1613k25525
1931C68997726l15399k77748j26037O8893K06490K00614K3957k71988n74608p59010
$$ plain form
1858 371760101 371919975 372312584 373017502 373942146 374814758 375275269 375034943 374031219 372494087 370874062
1868 370874062 369655151 369143028 369341278 369979973 370673256 371110649 371175842 370941544 370572090 370215034
1878 370215034 369948082 369793587 369758835 369850044 370047569 370274658 370403214 370312767 369965591 369441795
1888 369441795 368900833 368490715 368266830 368176384 368115807 368014793 367884102 367795906 367818756 367960052 368159981
1899 368159981 368335266 368431740 368444366 368393593 368288727 368117371 367876015 367614288 367447357 367509613 367870178
1910 367870178 368466606 369109535 369567184 369682579 369453773 369028015 368614807 368373642 368342590 368444099
1920 368444099 368554726 368588333 368543472 368490715 368517380 368666916 368907700 369146576 369274864 369223251 368997726
1931 368997726 368682327 368404579 368278542 368347435 368553925 368754539 368778496 368506508 367931900 367172890
1941C67172890p48749n52826k62375m959J15585O5918j08528l14178m57726m86297
1951C64418755m01879k46544p4043P4539J81504K46238K73361K64473K19460J42288
1961C65098152M9133l3340p6523o4735n722O7901J12419R2736K975j25770k37046k74009
1973C64606171k08931o0692J10359K31400K52609J74446M9667m4212m5319N7106K14615
1984C65337219L41568L58887K34604J983k54020m36325m78211l70025j59798P2670
1994C64648552K49329L23333K89879J79253L9253q5030j64871j92146j76392j36528
2004C64974632r2163n6915l6545l1128l9062o0540r6435j45493j99661k44217k63176
2015C63709297k46620j98059j32790p1640l0975j5793k1553l9558o4888r7237j37672
$$ plain form
1941 367172890 366424141 365871315 365608940 365603981 365719566 365785484 365676956 365362778 364905052 364418755
1951 364418755 364016876 363770332 363696289 363770828 363952332 364198570 364471931 364736404 364955864 365098152
1961 365098152 365147285 365113945 365037422 364972687 364966965 365034866 365147285 365240021 365242996 365117226 364880180 364606171
1973 364606171 364397240 364336548 364446907 364678307 364930916 365105362 365155029 365110817 365065498 365122604 365337219
1984 365337219 365678787 366037674 366272278 366274261 366020241 365583916 365105705 364735680 364575882 364648552
1994 364648552 364897881 365221214 365511093 365690346 365729599 365644569 365479698 365287552 365111160 364974632
2004 364974632 364882469 364825554 364789009 364757881 364718819 364658279 364561844 364416351 364216690 363972473 363709297
2015 363709297 363462677 363264618 363131828 363060188 363029213 363013420 362991867 362952309 362887421 362790184 362652512
2026C62652512j82076k17895k28386k00310j33438m3144M3411R7160R9106M7455m0207
2037C61894188j31722j92985j99776j48926o1645K4757P3128O2447k060r3041j74942
2048C61049423k21100k22664j85890j25122n3215J8883P8087J06163Q4610O294j13563
2059C60421906k37504l20129l30925k70958j73683q6937m7455o3286j12838j60752
2069C58617439j78146j57395j11236o1340k5406r346q049j1597j2169o523M120J5983
2081C58056335K5063K6970J8883%k7695n9319q8806j10092j19018j13488r4757o8474
2093C57445602m5356l8109n6076r8686j50986j88255j86959j38740n7984K2927O8435
2104C56575813N9243K746p0877j25427j38207j12075p1450m6386n5237r5253j46408
$$ plain form
2026 362652512 362470436 362252541 362024155 361823845 361690407 361647263 361690674 361787834 361886940 361934395 361894188
2037 361894188 361762466 361569481 361369705 361220779 361159134 361183891 361257019 361319466 361317406 361224365 361049423
2048 361049423 360828323 360605659 360419769 360294647 360241432 360260315 360338402 360444565 360529175 360535469 360421906
2059 360421906 360184402 359864273 359533348 359262390 359088707 359001770 358954315 358891029 358778191 358617439
2069 358617439 358439293 358281898 358170662 358109322 358083916 358074570 358066521 358054924 358042755 358036232 358040352 358056335
2081 358056335 358081398 358108368 358127251 358127251 358099556 358040237 357951431 357841339 357722321 357608833 357514076 357445602
2093 357445602 357400246 357362137 357306061 357207375 357056389 356868134 356681175 356542435 356484451 356507378 356575813
2104 356575813 356635056 356637802 356566925 356441498 356303291 356191216 356119766 356073380 356018143 355922890 355776482
2115C55776482j84441j94206j74408j34316q4343l1662J9837O2866Q4457P0458J4801
2126C55225525p1564j59721k15798k16903j64757q5411j5564J6479L930l8033q3542
2137C54194641j10817j11160q7967m9934n455L9558P7515R7847Q9759N1003q431o5879
2149C54110680r7390r1438n5046j1673J3428O447k8382p2479j05743j17073j07003
2160C53444328q5373o3247m8752m6234n7755q3084j17302j49498j64909j53046j15166
2171C52359962o7710l4714l3913o5040j07842j32332j17531o3552O179N7526O3820
2182C51864853J9073n9852j42670j99814k13165j80588j13182k9411M8370J00784J14403
2193C51208801Q7281L1127l2196p8926r4795q3008o1874n4398p5302j21803j74065
$$ plain form
2115 355776482 355592041 355397835 355223427 355089111 355004768 354973106 354992943 355055809 355140266 355210724 355225525
2126 355225525 355153961 354994240 354778442 354561539 354396782 354311371 354295807 354312286 354316216 354278183 354194641
2137 354194641 354083824 353972664 353884697 353834763 353829308 353868866 353946381 354044228 354133987 354184990 354176559 354110680
2149 354110680 354013290 353921852 353866806 353855133 353868561 353875008 353846626 353774147 353668404 353551331 353444328
2160 353444328 353358955 353295708 353246956 353200722 353142967 353059883 352942581 352793083 352628174 352475128 352359962
2171 352359962 352292252 352257538 352223625 352158585 352050743 351918411 351800880 351737328 351743507 351801033 351864853
2182 351864853 351883926 351824074 351681404 351481590 351268425 351087837 350974655 350945244 350993614 351094398 351208801
2193 351208801 351296082 351327209 351295013 351216087 351121292 351038284 350976410 350922012 350846710 350724907 350550842
2204C50550842k07634k06222j70098j15470o4240l3035k6055l6506n2910o6757p5074
2215C49496841p9460q2817q6784r3002j03722j21536j46523j72691j87569j78070j39465
2226C48105202q1063k5329K937r422n5809j12648j52397j59226j36680j03150p8125
2237C47194290o9771p0915o7711n0964k4719k404K709j1444l4752n2262n4512m4288
2249C46713257l2768l0518m0932n7907p3738q5792r8839j20697j53389j89781k15378
2260C45613518k17324j92146j48887j03760p1411n8213n9166o2561n6877l7613j1177
2271C44594383Q927Q468j7929o0501r5215r4528m1237N8670J76087K70614L08953K81372
2283C45398064K04086J09215K8648j9417l2119j6518J7853O3896J14479J61438J96152
$$ plain form
2204 350550842 350343208 350136986 349966888 349851418 349787178 349754143 349728088 349691582 349638672 349571915 349496841
2215 349496841 349417381 349334564 349247780 349154778 349051056 348929520 348782997 348610306 348422737 348244667 348105202
2226 348105202 348024139 347998810 348001747 347992325 347936516 347823868 347671471 347512245 347375565 347272415 347194290
2237 347194290 347124519 347053604 346985893 346934929 346910210 346907806 346910515 346899071 346864319 346812057 346757545 346713257
2249 346713257 346680489 346649971 346609039 346551132 346477394 346391602 346292763 346172066 346018677 345828896 345613518
2260 345613518 345396194 345204048 345055161 344951401 344879990 344821777 344762611 344700050 344643173 344605560 344594383
2271 344594383 344603310 344611778 344593849 344533348 344438133 344343605 344302368 344361038 344537125 344807739 345116692 345398064
2283 345398064 345602150 345711365 345740013 345720596 345688477 345671959 345689812 345753708 345868187 346029625 346225777
2294C46225777K14195K20032K25906K45094K83165L32566L75061L89061L57933K76603
2304C49145393J53122R880j17035j83372j46828J7128K99301O48385R77516J183891
2314C51987381J179543R23881M48494j37672o73981j001969j036262q17032n10139
2323C50362244l37715m63601q93097j450805j863899j908761j540260r15832l02658
2332C40685616P2975J29509q1597m85267j086655j967430l146744m405060n220413
2341C24494934m926453l051338L38478M513741Q292274J0508423J0508957Q416100
2349C59095116N026436J417884j512527l348808m174500m366341m319763m266815m247017
2358C39303665m195213m046288l789253l456154l082847k684727k263012j824570j391105
$$ plain form
2294 346225777 346439972 346660004 346885910 347131004 347414169 347746735 348121796 348510857 348868790 349145393
2304 349145393 349298515 349308395 349191360 349007988 348861160 348878288 349177589 349825974 350803490 351987381
2314 351987381 353166924 354090805 354539299 354401627 353727646 352725677 351689415 350872383 350362244
2323 350362244 350024529 349560928 348667831 347217026 345353127 343444366 341904106 340988274 340685616
2332 340685616 340758591 340888100 340806503 340321236 339234581 337267151 334120407 329715347 324494934
2341 324494934 319568481 316517143 316855621 321369362 329661636 340170059 350679016 359095116
2349 359095116 364121552 365539436 364026909 360678101 356503601 352137260 347817497 343550682 339303665
2358 339303665 335108452 331062164 327272911 323816757 320733910 318049183 315786171 313961601 312570496
2367C12570496r91211o42147l43247q2912J47686L51429N33466P12872R22012J188316
2377C14366760J510144J844940K120743K266902K245522K066154J778374J448975J137695
2386C30786209Q82225O94122N61638M60244L63578K56577J44310M9591k67P019N7030
2397C34262276J12877J35498J06010L7422l6125q1062q5602o4850m6425n0468p6447
2408C34213104j04904j14059r4490n5809j8731j564j0643l8452p1411r8495j15929
2419C33488617j26381j35040j45226j57470j71357j85394j99318k11792k19536k18277
2429C31718826k02827j71051j26686p9537m3792l2464n0544r2583j42631j81008j92795
2440C30402908j73950j31912q0605l4675l510R461M806j4000m2839p4730j01890j16501
$$ plain form
2367 312570496 311579285 310937138 310593891 310510979 310658665 311010094 311543560 312256432 313178444 314366760
2377 314366760 315876904 317721844 319842587 322109489 324355011 326421165 328199539 329648514 330786209
2386 330786209 331668434 332362556 332924194 333384438 333748016 334004593 334148903 334198494 334198227 334205246 334262276
2397 334262276 334375153 334510651 334616661 334654083 334617958 334536896 334451294 334386444 334340019 334289551 334213104
2408 334213104 334108200 333994141 333899651 333843842 333825111 333823547 333812904 333774452 333703041 333604546 333488617
2419 333488617 333362236 333227196 333081970 332924500 332753143 332567749 332368431 332156639 331937103 331718826
2429 331718826 331515999 331344948 331218262 331138725 331094933 331062469 331011925 330919342 330776711 330595703 330402908
2440 330402908 330228958 330097046 330016441 329981766 329978256 329987717 329992523 329978523 329935684 329860954 329759064 329642563
2452C29642563j14670r7580p1449m3831j9684j030J1406J5984R002j3580n1193r8267
2464C29167671j44424j79444j98898k05498k07481k11830k20070k25983k19726j94168
2474C27160149j51024j03302p0114o9123j05896j69525k36168k78740k80418k42043
2484C25453796j82495j27868r8343r7885j12877j22032j07613o6300j0528L7842N8250
2495C24623947M0169j2245q4381j56021k09923k35749k31857k03247j58577j06697
2505C23265419n6534j7090K098p019m6272j06544j67733k05421k02560j60370r9793
2516C22198181n1956m0398o7100j10626j38092j26534p6141j0758L7575M8714K4452
2527C21687317j3657m0779m4288k9450j3313j0987k5978n0201p2250q5755r3345j01128
$$ plain form
2452 329642563 329527893 329430313 329358864 329315033 329295349 329294319 329305725 329321709 329330711 329317131 329265938 329167671
2464 329167671 329023247 328843803 328644905 328439407 328231926 328020096 327800026 327574043 327354317 327160149
2474 327160149 327009125 326905823 326835709 326766586 326660690 326491165 326254997 325976257 325695839 325453796
2484 325453796 325271301 325143433 325045090 324947205 324834328 324712296 324604683 324538383 324527855 324565697 324623947
2495 324623947 324664116 324651871 324567490 324411469 324201546 323965797 323733940 323530693 323372116 323265419
2505 323265419 323208885 323191795 323193893 323186874 323140602 323034058 322866325 322660904 322458344 322297974 322198181
2516 322198181 322146225 322105827 322038727 321928101 321790009 321663475 321587334 321576576 321614151 321662865 321687317
2527 321687317 321673660 321632881 321588593 321559143 321545830 321534843 321508865 321458664 321386414 321300659 321207314 321106186
2539C21106186j11847j21231j20087j02653p1373l6354r232L548M120q01n455r919
2551C20524902j8730l6659o5155r8877j30501j53923j65653j65367j52741j27735r3021
2562C19316540n6725l3073l7518p8277j49155k28691k88105l04184k70176j99661j19095
2573C17551880n5599k4720k6016m6940p1258q7776r3289r0866q5277q0128p7629p8640
2585C16733742q4687r4966j06011j11542j06105r0409p3070o9351r1229j39007j97659
2596C15569706k40650k43912j98135j17169l3149J6651P839o0425j63364k61727l18336
2607C13957329l12805k50035j56955p1011k4281l1261q2531j50833k03037k13967j78432
2618C12282181j10188l5496J9742M0645K7619o829m5738p4635q5830p9365o0844m0169
$$ plain form
2539 321106186 320994339 320873108 320753021 320650368 320578995 320542641 320533409 320536957 320541077 320540276 320534821 320524902
2551 320524902 320506172 320469513 320404358 320305481 320174980 320021057 319855404 319690037 319537296 319409561 319316540
2562 319316540 319259815 319226742 319189224 319110947 318961792 318733101 318444996 318140812 317870636 317670975 317551880
2573 317551880 317496281 317471561 317445545 317398605 317327347 317239571 317146282 317055416 316970139 316890011 316812382 316733742
2585 316733742 316649055 316554089 316448078 316336536 316230431 316140022 316066952 315997601 315906372 315767365 315569706
2596 315569706 315329056 315085144 314887009 314769840 314736691 314753342 314761181 314700756 314537392 314275665 313957329
2607 313957329 313644524 313394489 313237534 313166523 313142242 313110981 313028450 312877617 312674580 312460613 312282181
2618 312282181 312171993 312136497 312156239 312196884 312224503 312217674 312171936 312097301 312011471 311932106 311871262 311831093
2630C11831093k8763l5915o4087j05534j43452j58271j38665q8405k7333J7910K7352
2641C11085930j698n3882j04790j34277j35403j15032q6384o0329m1028k8018k0981
2652C10304108k2602l5954n9204q3046r4051q2989n2013j5545P495M845k0790n3787
2664C09796467p4024o9905m3964j1349Q793M273k7447p8144j35670j87912k25334k41013
2676C08714771k31399j97640j47342r3880n1766l1185l2253m5509n7888n9071m7645
2687C07719193l1338k1534k7867n3196r3402j40419j84708k18086k34413k30427k07100
2698C06276703j69773j28746r4967p6199p4138q4324r9793j15585j30577j46370j63708
2709C04992523j78985j86673j81865j65901j46485j35136j39694j60980j91364k20127
$$ plain form
2630 311831093 311802330 311766415 311702328 311596794 311453342 311295071 311156406 311068001 311040668 311058578 311085930
2641 311085930 311084232 311030350 310925560 310791283 310655880 310540848 310454464 310394135 310353107 310325089 310304108
2652 310304108 310281506 310245552 310186348 310103302 310009251 309926262 309874249 309858704 309866199 309871044 309850254 309796467
2664 309796467 309722443 309652538 309608574 309597225 309606018 309610291 309582844 309504700 309369030 309181118 308955784 308714771
2676 308714771 308483372 308285732 308138390 308044510 307992744 307961559 307929306 307883797 307825909 307766838 307719193
2687 307719193 307687855 307666321 307638454 307585258 307491856 307351437 307166729 306948643 306714230 306483803 306276703
2698 306276703 306106930 305978184 305883217 305807018 305732880 305648556 305548763 305433178 305302601 305156231 304992523
2709 304992523 304813538 304626865 304445000 304279099 304132614 303997478 303857784 303696804 303505440 303285313
2719C03285313k38362k43702k38361k26059k09351j88064j62811j36929j16768j09005
2729C01415901j16520j36604j62029j84727j99261k04868k03915j99279j93177j86901
2739B99628620j81179j77250j76296j79215j85832j95809k09274k26097k44332k59380
2749B97593956k63863k50339k16370j66092j11217o6071m2724m6063p3242j16367j65367
2760B96076241k11106k46982k68822k75631k69928k57702k47364k45686k55203k71873
2770B93525944k86904k90641k78016k51121k19326j95389j89667k06604k41203k80991
2780B91086082l10840l17307k95028k48661j91384j39789j07193r8267j07460j22528
2790B89147625j30043j22471r9525o8589m0531k5558l0251n5370r5997j41087j76525
$$ plain form
2719 303285313 303046951 302803249 302564888 302338829 302129478 301941414 301778603 301641674 301524906 301415901
2729 301415901 301299381 301162777 301000748 300816021 300616760 300411892 300207977 300008698 299815521 299628620
2739 299628620 299447441 299270191 299093895 298914680 298728848 298533039 298323765 298097668 297853336 297593956
2749 297593956 297330093 297079754 296863384 296697292 296586075 296520004 296477280 296431217 296357975 296241608 296076241
2760 296076241 295865135 295618153 295349331 295073700 294803772 294546070 294298706 294053020 293797817 293525944
2770 293525944 293239040 292948399 292670383 292419262 292199936 292004547 291814880 291608276 291367073 291086082
2780 291086082 290775242 290457935 290162907 289914246 289722862 289583073 289475880 289377613 289270153 289147625
2790 289147625 289017582 288895111 288795586 288726997 288686466 288660908 288630657 288575287 288479290 288338203 288161678
2801B88161678j89171j72920j33781q9874o5041p7629j29471k02293k65046k88162
2811B86548290k58617j87283j02558l6068p114j5145m3830p2594q8787r3022r6111
2822B85547161j10912j45054j97468k60563l22723l71285l94439l83187l36437k64511
2832B82760582j90239j41964j41811j93234k76604l55243l92189l68386k91728j95694
2842B80213490j24016j11714j71127k86961m24804n44987o18134o34212o03237n48458
2852B76145840m94919m60224m48036m51069m55552m50286m31843m05998l86067l87630
2862B71774216m23355m97570o01998p15160q06580q45794q16613p25937o05697n00603
2872B65234909m48513m63028n26600o00700o48079o51474o21624n88493n81704o14795
$$ plain form
2801 288161678 287972507 287799587 287665806 287575932 287510891 287433262 287303791 287101498 286836452 286548290
2811 286548290 286289673 286102390 285999832 285963764 285956650 285941505 285897675 285825081 285736294 285643272 285547161
2822 285547161 285436249 285291195 285093727 284833164 284510441 284139156 283744717 283361530 283025093 282760582
2832 282760582 282570343 282428379 282286568 282093334 281816730 281461487 281069298 280700912 280409184 280213490
2842 280213490 280089474 279977760 279806633 279519672 279094868 278549881 277931747 277297535 276694298 276145840
2852 276145840 275650921 275190697 274742661 274291592 273836040 273385754 272953911 272547913 272161846 271774216
2862 271774216 271350861 270853291 270251293 269536133 268729553 267883759 267067146 266341209 265735512 265234909
2872 265234909 264786396 264323368 263796768 263196068 262547989 261896515 261274891 260686398 260104694 259489899
2882B59489899o79779p55940q24337q76961r18007r54628r89036j017742j035595j044693
2892B50393181j055012j078377j117897j160659j181565j155987j074447r50775q16708
2901B40801754p06158o38637o10714n99690n79414n34325m67739l98102l46527l24573
2911B35595875l29819l50285l74927m01573m37699m91829n64289o41689p02610p28149
2921B30573006p14112o73561o28586n96618n78842n60418n20229m46243l44849k38380
2931B25271168j52951j03626q5792p9213n9375j0987O4011J49555K23465K66915K71892
2942B25755062K41089J84860J16883M9095r442n5008q7509j09749j24912j35536j42613
2953B25682220j47819j53713j64757j85547k17667k59571l05919l50514l88450m16565
$$ plain form
2882 259489899 258810120 258054180 257229843 256352882 255434875 254480247 253491211 252473469 251437874 250393181
2892 250393181 249338169 248259792 247141895 245981236 244799671 243643684 242569237 241618462 240801754
2901 240801754 240095596 239456959 238846245 238246555 237667141 237132816 236665077 236266975 235920448 235595875
2911 235595875 235266056 234915771 234540844 234139271 233701572 233209743 232645454 232003765 231301155 230573006
2921 230573006 229858894 229185333 228556747 227960129 227381287 226820869 226300640 225854397 225509548 225271168
2931 225271168 225118217 225014591 224928799 224849586 224790211 224779224 224843235 224992790 225216255 225483170 225755062
2942 225755062 225996151 226181011 226297894 226346989 226337547 226282539 226195030 226085281 225960369 225824833 225682220
2953 225682220 225534401 225380688 225215931 225030384 224812717 224553146 224247227 223896713 223508263 223091698
2963B23091698m33407m38900m35829m32644m43974m85573n65376o72912p75071q24337
2973B17583675p75184o04687l25050J8654L65009O58722Q69007R95045J059608J094341
2983B20939140J125336J165524J213130J256371J278839J266365J212044J121063J010990
2992B31588802R10092Q47778Q43887Q98629R88693J073627J109963J068077R45396
3001B40274944P68643N84678M42696L74584L82824M40731N04112N30568M96158M03481
3011B45203419K76890J50222N0698j0090l7976m9667o4087r3899j43261k07271k75860
3022B44799118l37486l83129m09546m20399m24957m34227m55609m89044n27000n57518
3032B40360203n68981n53551n08156m33903l37639k32505j39885q6022r3479j69144
$$ plain form
2963 223091698 222658291 222219391 221783562 221350918 220906944 220421371 219855995 219183083 218408012 217583675
2973 217583675 216808491 216203804 215878754 215897408 216262417 216921139 217790146 218785191 219844799 220939140
2983 220939140 222064476 223230000 224443130 225699501 226978340 228244705 229456749 230577812 231588802
2992 231588802 232498894 233346672 234190559 235089188 236077881 237151508 238261471 239329548 240274944
3001 240274944 241043587 241628265 242070961 242445545 242828369 243269100 243773212 244303780 244799938 245203419
3011 245203419 245480309 245630531 245681229 245671139 245633163 245583496 245519409 245425510 245282249 245074978 244799118
3022 244799118 244461632 244078503 243668957 243248558 242823601 242389374 241933765 241444721 240917721 240360203
3032 240360203 239791222 239237671 238729515 238295612 237957973 237725468 237585583 237499561 237406082 237236938
3042B37236938k97184m42142n63412o34556o56566o57253o73752p30858q24699r23787
3052B30832729r86309r82952r14078q09974p16553o74438p01943p90024r09061j022225
3062B22325172j099300j124477j099129j037808r62123q92830q44097q19951q15391
3071B13630066q21438q30974q42839q60271q87890r26285r70688j012974j045646j064816
3081B04366245j069565j058692j028862r75533q97617q02727p07512o33087n95818
3090A96596832n99918o35243o83288p25193p50141p57256p52106p41882p30228p17507
3100A89504070p02076o82316o57615o27270n90744n47848m99897m49772l99761l48587
3110A83998184k89802k14920j19133q297J00155J82495K19898K09846J70155J33381
$$ plain form
3042 237236938 236939754 236497612 235934200 235299644 234643078 233985825 233312073 232581215 231756516 230832729
3052 230832729 229846420 228863468 227949390 227139416 226422863 225748425 225046482 224256458 223347397 222325172
3062 222325172 221225872 220101395 219002266 217964458 217002335 216109505 215265408 214445457 213630066
3071 213630066 212808628 211977654 211134815 210274544 209386654 208460369 207489681 206476707 205431061 204366245
3081 204366245 203296680 202237988 201209126 200233593 199335976 198533249 197825737 197192650 196596832
3090 196596832 195996914 195361671 194678383 193953190 193203049 192445793 191693687 190951805 190221577 189504070
3100 189504070 188801994 188119678 187462063 186834793 186244049 185696201 185196304 184746532 184346771 183998184
3110 183998184 183708382 183493462 183374329 183366032 183466187 183648682 183868580 184078426 184248581 184381962
3120A84381962J33018J88237K94570M25148N41459O10237O16092N68734M99000M46186
3130A88704643M43115N02491O11458P36218Q35895Q78849Q56076P83157O91948O14090
3140A95657940N66730N47066N38693N25798N04761M86412M87099N14603N58376N92384
3150B00979862N88265N32150M33845L21942K28977J74141J54877J52225J43624J15318
3160B03825226O8474J2645m1751r0199j33171j71356k02103k21672k31190k40478k65389
3171B02309036l18069l96252m80709n43404n63316n38177m86336m35295m05293l99399
3181A97742786m05826m10423m09642m14009m38785m89731n54028o04629o15864n80940
3191A92818909n18055m62055m44527m76818n43881o15444o63071o75640o62956o46305
$$ plain form
3120 184381962 184514980 184703217 184997787 185422935 185964394 186574631 187190723 187759457 188258457 188704643
3130 188704643 189147758 189650249 190261707 190997925 191833820 192712669 193568745 194351902 195043850 195657940
3140 195657940 196224670 196771736 197310429 197836227 198340988 198827400 199314499 199829102 200387478 200979862
3150 200979862 201568127 202100277 202534122 202856064 203085041 203259182 203414059 203566284 203709908 203825226
3160 203825226 203893700 203906345 203864594 203774395 203641224 203469868 203267765 203046093 202814903 202574425 202309036
3171 202309036 201990967 201594715 201114006 200570602 200007286 199469109 198982773 198547478 198142185 197742786
3181 197742786 197336960 196926537 196516895 196102886 195664101 195174370 194620342 194015713 193399849 192818909
3191 192818909 192300854 191838799 191394272 190917454 190373573 189758129 189095058 188419418 187756462 187110157
3201A87110157o45199o66485p04403p46784p83558q10890q29773q42151q49019q52260
3211A79379635q57716q75416r14592r76181j046791j102238j117916j082478j006298
3220A70400009r18121q50964q26130q42781q80699r13620r24339r12457q90808q73718
3230A61566372q64754q53367q22382p59830o68116n64098m69046l96623l45011k99034
3240A55524111k40288j57518n2815O1636J71576K69031L55377M38509N26753O23512
3250A57519884P26166Q28352R24530J013088J097469J184025J280403J391049J514759
3259A67479725J643410J762447J855221J909237J921444J900882J864529J830044J806984
3268A83973923J793461J778163J748505J699524J638622J583367J554050J563339J609440
$$ plain form
3201 187110157 186464958 185798473 185094070 184347286 183563728 182752838 181923065 181080914 180231895 179379635
3211 179379635 178521919 177646503 176731911 175755730 174708939 173606701 172488785 171406307 170400009
3220 170400009 169481888 168630924 167804794 166962013 166081314 165167694 164243355 163330898 162440090 161566372
3230 161566372 160701618 159848251 159025869 158266039 157597923 157033825 156564779 156168156 155823145 155524111
3240 155524111 155283823 155126305 155073490 155135126 155306702 155575733 155931110 156369619 156896372 157519884
3250 157519884 158246050 159074402 159998932 161012020 162109489 163293514 164573917 165964966 167479725
3259 167479725 169123135 170885582 172740803 174650040 176571484 178472366 180336895 182166939 183973923
3268 183973923 185767384 187545547 189294052 190993576 192632198 194215565 195769615 197332954 198942394
3277A98942394J674500J729660J745376J702195J601009J464882J332512J244049J224079
3286B12660656J268578J345577J408863J418571J361199J254482J136074J043072R91745
3295B23888817R71126R52759R09195Q31185P30590O31733N54238N02929M66233M27742
3305B30866547L78666L23829K77996K54555K56100K71606K84710K83642K68764K51522
3315B33717937K44370K51064K61593K56901K21348J53179O9103k556l6773k4357K2392
3326B35134201P6370J09043J04828O6910J4420k9717m9419m2057j7319R632K5787K3957
3338B35426636M291k8629o7883j06811j40877j69163j94397k21672k54879k93483l32356
3349B33620777l63350l81775l89461l93334m01077m13208m20914m10404l71094l03840
$$ plain form
3277 198942394 200616894 202346554 204091930 205794125 207395134 208860016 210192528 211436577 212660656
3286 212660656 213929234 215274811 216683674 218102245 219463444 220717926 221854000 222897072 223888817
3295 223888817 224859943 225812702 226721897 227553082 228283672 228915405 229469643 229972572 230438805 230866547
3305 230866547 231245213 231569042 231847038 232101593 232357693 232629299 232914009 233197651 233466415 233717937
3315 233717937 233962307 234213371 234474964 234731865 234953213 235106392 235175495 235172939 235136166 235111809 235134201
3326 235134201 235210571 235319614 235424442 235491352 235505772 235476055 235426636 235384579 235367260 235376892 235402679 235426636
3338 235426636 235430927 235402298 235334415 235227604 235086727 234917564 234723167 234501495 234246616 233953133 233620777
3349 233620777 233257427 232875652 232486191 232092857 231691780 231278572 230857658 230447254 230076160 229772320
3359B29772320k22893j49040r9678p9212p8297p9689o7501l5038J2302O1112R4928
3370B29129314J01033P4291J8768n2414j21669j72673j97124j98250j88541j81695
3380B28211040j84612j92566j93195j76048j40553r8839o7730n7640o5365p5588p0934
3391B26887970m4651m559L0690M4632L1585O68l2082n3005n6839m6368k7790n569J6632
3404B26741314L3493L6411J6728k5692p8392j17798j21384q2283j6517M2495O0616
3415B26488991K1801o2847j61419k37103k66018k45533j90506j22814o1626j7948L242
3426B25148220K594j4610l6659m6387k7275K7427J09253J95389K59056K81677K59572
3437B26158257K02770J25618M0092m6825j27545j89552k16026j94874j27239l1300
$$ plain form
3359 229772320 229549427 229400387 229300709 229221497 229143200 229063511 228996010 228960972 228973274 229034386 229129314
3370 229129314 229230347 229304638 229323406 229270992 229149323 228976650 228779526 228581276 228392735 228211040
3380 228211040 228026428 227833862 227640667 227464619 227324066 227225227 227157497 227099857 227034492 226958904 226887970
3391 226887970 226843319 226838760 226869450 226914082 226945667 226946335 226914253 226861248 226804409 226758041 226730251 226724682 226741314
3404 226741314 226774807 226811218 226827946 226802254 226723862 226606064 226484680 226402397 226385880 226428375 226488991
3415 226488991 226510792 226447945 226286526 226049423 225783405 225537872 225347366 225224552 225162926 225144978 225148220
3426 225148220 225150814 225136204 225099545 225053158 225025883 225053310 225162563 225357952 225617008 225898685 226158257
3437 226158257 226361027 226486645 226526737 226479912 226352367 226162815 225946789 225751915 225624676 225593376
3447B25593376O6681J46656K06013K57778L16582L81355M28753M23279L39260J82495
3457B28342228n035j59855k25697j79386m1027J36642K92282L80860L88546L32851
3467B29262409K50778J82000J53064J67904K07730K39601K32544J74083P9422j3713
3477B30935822o3000m5700K7752J18293J80436J89952J58978J26514J32237J89190
3487B31950474K74811L48091L79734L73802L64246L85990M43058M97494M90418L84388
3497B35892506J96590j392j21937j13697O008J61800K66781K76070K11086J40801J32713
3508B37047329K08702L32851M38214M71000M24042L35789K62814K43568K77805L32260
3518B40374374L62893L38783K54478J27678q564j15223j54114r8857N2356K66362M77905
$$ plain form
3447 225593376 225660057 225806713 226012726 226270504 226587086 226968441 227397194 227820473 228159733 228342228
3457 228342228 228337193 228177338 227951641 227772255 227731228 227867870 228160152 228541012 228929558 229262409
3467 229262409 229513187 229695187 229848251 230016155 230223885 230463486 230696030 230870113 230949535 230935822
3477 230935822 230872822 230827122 230854874 230973167 231153603 231343555 231502533 231629047 231761284 231950474
3487 231950474 232225285 232573376 232953110 233326912 233691158 234077148 234520206 235017700 235508118 235892506
3497 235892506 236089096 236087704 235965767 235852070 235858078 236019878 236286659 236562729 236773815 236914616 237047329
3508 237047329 237256031 237588882 238027096 238498096 238922138 239257927 239520741 239764309 240042114 240374374
3518 240374374 240737267 241076050 241330528 241458206 241449642 241334419 241180305 241081448 241133804 241400166 241878071
3529B41878071O12793O24161N22632L78704K89841L25031M78001O60744P46269O41155
3539B47157402L46718l1090l31821m27075k91576j3733K57835M04644M04072L31993
3549B47807369L02563L87402N72929P81250R37385J026745J094818J186829J274071
3558B55371361J233787R12285K43225o62422j522484k003097j887551j193695j71985
3567B50319424Q18710J477871J681957J498909J114273P28474M88129M65316O64559
3576B59257622J024837J412850J637287J508331R37252K1343r54074j622544j709575
3585B61513329j177807k54059O80389J276474J372948J040974N07640K2393k50569
3594B64731712k61898m3583L41568Q20389J297016J642056J716308J433506Q23899
$$ plain form
3529 241878071 242490864 243115025 243637657 244016361 244306202 244631233 245109234 245769978 246516247 247157402
3539 247157402 247504120 247473030 247141209 246714134 246422558 246408825 246666660 247071304 247475376 247807369
3549 247807369 248109932 248497334 249070263 249851513 250788898 251815643 252910461 254097290 255371361
3558 255371361 256605148 257517433 257760658 257098236 255575752 253572655 251685104 250491409 250319424
3567 250319424 251138134 252616005 254297962 255796871 256911144 257639618 258127747 258593063 259257622
3576 259257622 260282459 261695309 263332596 264840927 265778179 265799522 264845448 263222904 261513329
3585 261513329 260335522 260081463 260761852 262038326 263411274 264452248 264959888 264982281 264731712
3594 264731712 264469814 264426231 264767799 265588188 266885204 268527260 270243568 271677074 272500973
3603B72500973N2528o32744r99965r29089m57020K42329R19227J327458J294403P82337
3613B74100437o8474r40380j415710j141644k8267J620407L152714L818589L129711
3622B82227383J146698j482754l785114m903374m487991k828885o66675J194095K244568
3631B68657951K424546K026996J467953J080589J030789J337719J915798K574634L006211
3640B85523186K834816J777649j41659k475891m461041n344295m770642k994213p70034
3649B69177876J026859J831646J623325Q45833R9506j84364R9907P89032J619377K364368
3659B79293365K866078L001537K673226J867656P32346m25663j268501j621781j595649
3668B85522614j523915j738376k322045l015861l351555k931214j669597J50528K027855
$$ plain form
3603 272500973 272553501 271920757 270920792 269991703 269534683 269777012 270696239 272023697 273318100 274100437
3613 274100437 274031963 273091583 271675873 270534229 270505962 272126369 275279083 279097672 282227383
3622 282227383 283374081 281891327 278106213 273202839 268714848 265885963 265219288 266413383 268657951
3631 268657951 271082497 273109493 274577446 275658035 276688824 278026543 279942341 282516975 285523186
3640 285523186 288358002 290135651 289993992 287518101 283057060 277712765 272942123 269947910 269177876
3649 269177876 270204735 272036381 273659706 274505539 274605045 274420681 274520588 275309620 276928997 279293365
3659 279293365 282159443 285160980 287834206 289701862 290434208 290008545 288740044 287118263 285522614
3668 285522614 283998699 282260323 279938278 276922417 273570862 270639648 268970051 269120579 271148434
3677B71148434L483295M231453M204445L467522K135448L70312j560517l255062m260063
3686B79965267m251442l211040j472378M07352J883946K633514K623291K038193J142502
3695B81759205J84021o24199j081677j016616l72086O86436J747246K278900J879635
3704B85440865N18493j384296l108196l953534l566436k091790q4686J760464K909069
3713B76439953L163185K655640J707973O57787k49195q77056j160221j067524o02741
3722B80667801J63898J066246J846829K208557J903400Q38662q34370k691174m110393
3731B81059456m472122l431721j149712J665593L987426M909439M089413J945973n33600
3740B88070145k302342k798405k211818j305485r04045j364307k362977l126068k945537
$$ plain form
3677 271148434 274631729 278863182 283067627 286535149 288670597 289040909 287480392 284225330 279965267
3686 279965267 275713825 272502785 271030407 271437759 273321705 275955219 278578510 280616703 281759205
3695 281759205 281943226 281319027 280237350 279220734 278848648 279535084 281282330 283561230 285440865
3704 285440865 285959358 284575062 281466866 277513332 273946896 271855106 271770420 273530884 276439953
3713 276439953 279603138 282258778 283966751 284624538 284375343 283498287 282338066 281270542 280667801
3722 280667801 280831699 281897945 283744774 285953331 287856731 288695393 287861023 285169849 281059456
3731 281059456 276587334 273155613 272005901 273671494 277658920 282568359 286657772 288603745 288070145
3740 288070145 285767803 282969398 280757580 279452095 278548050 277183743 274820766 271694698 268749161
3749B68749161j646481K91615K020187K820549K495957J430797L13778k75040j53026
3758B76047497M40006J050739J288414J003209L01780n56412j288013j671391j586418
3767B75029411j031952j41048Q26130J544628J743774J335335M76284m86412j174812
3776B78121338j357479j049805m79889N5313L54443M00696L30734L17135M47140O77986
3786B77817612Q89740R88197R75246R33381R34448R48944Q34427M29630l06358j213742
3796B83231525j985778k338391k187481j703491j194076q85926p58533n58529K022
3805B71621342R97066K166100L021641L127708K365723J011886m26807j503468k055206
3814B80325985k217808k244434k272721k216663j852226j027565J67065J398468K263755
$$ plain form
3749 268749161 267102680 267394295 269414482 272235031 274730988 276161785 276475563 276200523 276047497
3758 276047497 276487503 277538242 278826656 279829865 280131645 279575233 278287220 276615829 275029411
3767 275029411 273997459 273856411 274682541 276227169 277970943 279306278 279782562 279296150 278121338
3776 278121338 276763859 275714054 275234165 275289478 275643921 276044617 276375351 276692486 277139626 277817612
3786 277817612 278707352 279695549 280670795 281604176 282538624 283487568 284321995 284751625 284445267 283231525
3796 283231525 281245747 278907356 276719875 275016384 273822308 272936382 272177849 271619320 271621342
3805 271621342 272618408 274784508 277806149 280933857 283299580 284311466 283884659 282381191 280325985
3814 280325985 278108177 275863743 273591022 271374359 269522133 268494568 268661633 270060101 272323856
3823B72323856K523060K231960J688309J231899J028367R75570P88117K01206q32863
3832B82159481k078686l119812l569450l266831k344436j127224O9580J116352K097588
3841B69936562L164444M303913N186157N231914L906880J101398k638492o203995q347073
3850B75641708q241214n887909k145443J648750M265518N087090M281883K601051R39217
3859B78190651r2373l76816k19154q2035k93465q79841j585827k040329j963119j308250
3869B69349442k78283P78962J531505J796932J589928J071949M47769j27392n80959
3878B75579853q94604j056537j041184q36925m92344j29910J03283J28861Q030o9657
3888B71298866J06888O24981J358185J995621K185001J714573O25934p94277k140503
$$ plain form
3823 272323856 274846916 277078876 278767185 279999084 281027451 282003021 282791138 282992344 282159481
3832 282159481 280080795 276960983 273391533 270124702 267780266 266653042 266722622 267838974 269936562
3841 269936562 273101006 277404919 282591076 287822990 291729870 292831268 290192776 283988781 275641708
3850 275641708 267400494 261512585 259367142 261015892 265281410 270368500 274650383 277251434 278190651
3859 278190651 278098278 277721462 277502308 277420273 277126808 276246967 274661140 272620811 270657692 269349442
3869 269349442 269071159 269850121 271381626 273178558 274768486 275840435 276288204 276160812 275579853
3878 275579853 274685249 273628712 272587528 271750603 271258259 271128349 271231632 271360493 271368523 271298866
3888 271298866 271405754 272030735 273388920 275384541 277569542 279284115 279910049 279115772 276975269
3897B76975269l052692l337517l000107k197323j153583q8596Q25710J481361J834011
3906B68286533J894951J711750J345806Q53596K87590k85644p71237j057548j061001
3915B71204796p81994l28159J21936M04053M52919L29056J66569P6961P3052O9732
3925B71788921m0588k92091n99595p97939p42187m00467J19438O24638R34543R60522
3935B71555195P27978L44028o0673l79085n51892n71613m76856l36552k24228j82953
3945B69843349k03361k28729j92299o5060J22471K97108L90854L79695K88277J60599
3955B70792904K6646j05629k29264l17249l27778k39773q6937M8981Q8844J4515j14364
3966B69550896k06890k13013j61457j27735j57776k19212k26688j26553L9425J54038
$$ plain form
3897 276975269 273922577 270585060 267584953 265387630 264234047 264145451 264971161 266452522 268286533
3906 268286533 270181484 271893234 273239040 274092636 274380226 274094582 273323345 272265797 271204796
3915 271204796 270422802 270094643 270216579 270620632 271073551 271402607 271569176 271646137 271719189 271788921
3925 271788921 271748333 271456242 270856647 270058708 269316521 268916054 269035492 269660130 270594673 271555195
3935 271555195 272283173 272627201 272566528 272187443 271635551 271063938 270587082 270250530 270026302 269843349
3945 269843349 269639988 269411259 269218960 269153900 269276371 269573479 269964333 270344028 270632305 270792904
3955 270792904 270819550 270713921 270484657 270167408 269839630 269599857 269512920 269561901 269650745 269665260 269550896
3966 269550896 269344006 269130993 268969536 268841801 268684025 268464813 268238125 268111572 268150997 268305035
3976B68305035J25522k2411j57509j55373k7694O2694o3476m19922p95365r06658o63776
3987B65281067l15609k98977q52051j699619k139950j607704l78761J38435k084560
3996B56042271q510723j8839112l0608730m0016861
4000A58066845
$$ plain form
3976 268305035 268430557 268408146 268250637 268095264 268067570 268130264 268066788 267646866 266851501 265944843 265281067
3987 265281067 264965458 264666481 263814430 262114811 259974861 258367157 257988396 258126831 256042271
3996 256042271 247531548 228692436 198083706 158066845
4000 158066845
##END=$$ End of the data block
