##TITLE=$$ Begin of the data block
##JCAMP-DX=5.00 $$ ACD/SpecManager v 10.08
##SPECTROMETER/DATA SYSTEM=16PC
##DATE=Mon Sep 02 16:38:58 2013
##DATA TYPE=INFRARED SPECTRUM
##DATA CLASS=XYDATA
##ORIGIN=
##OWNER=
##NPOINTS=3601
##FIRSTX=400.00000000
##LASTX=4000.00000000
##MAXX=4000.00000000
##MINX=400.00000000
##MAXY=39.96852875
##MINY=5.37250614
##XFACTOR=1.0000000000
##YFACTOR=0.000000100000000
##FIRSTY=20.14988899
##DELTAX=1.00000000
##XUNITS=1/CM
##YUNITS=TRANSMITTANCE
##XYDATA=(X++(Y..Y))
400B01498890M9312267L9930191K7179947J4661675N257911J97640j026230J9836J679535
409C38711662K930069L549195L786888L878746L765907L180275J971321L87421r34487
418C61226997j293449l66058J528282L523063M622536M207916K344284k71453k674637
427C72847481m094391m265862l455352k234002j155929n25169l46566m40140o16149
436C55713921p98111j037751j440467k063179k852402l650398m259377m525757m406128
445C30680351l982200l427544k933922k629566k522316k494545k355957j932659j152058
454C07249584q2359J095600K166367K967815L445110L647347L680725L652458L638382
463C31461029L681221L803864M012146M277381M516106M597588M396209L871117L126106
$$ y = [201498890, 250811157, 290741348, 317921295, 332582970, 337840881, 338038521, 337012291, 337032127, 338711662, 341641731, 345190926, 348977814, 352856560, 356622467, 359802742, 361774063, 362161484, 361226997, 359933548, 359567490, 361095772, 364618835, 369241371, 373449287, 375793571, 375522118, 372847481, 368753090, 364487228, 361031876, 358797874, 357641945, 357116776, 356770210, 356330070, 355713921, 354915810, 353878059, 352437592, 350374413, 347522011, 343871613, 339612236, 335086479, 330680351, 326698151, 323270607, 320336685, 317707119, 315184803, 312690258, 310334301, 308401642, 307249584, 307167225, 308262825, 310429192, 313397007, 316842117, 320489464, 324170189, 327822647, 331461029, 335142250, 338946114, 342958260, 347235641, 351751747, 356349335, 360745544, 364616661, 367742767]
472C67742767K398148J959228J972695K381515K905617L162384K861481J966553P30667
481C88081055m23928j121063j226768r14421n64995n55840j058578j957894k931518
490C77326050l639260l905029l788299l506470l267441l117371k906837k391968j410751
499C49392624k4185J467781K644882L147354K814331J703682j335k115974m515610
508C54513550p080918r573364j1542778j2370624j1473198q583851l965073J582051
516B91505795O946258J1079655J3348121J3696862J2570266J0648957Q552131O647759
524C74995804N036354L670082K500496J558380R28345O61201O99005Q74024R83314
533C91907005Q89740N82543J65863k15111m56314n38254n12619m50630l98750l66822
$$ y = [367742767, 370140915, 372100143, 374072838, 376454353, 379359970, 382522354, 385383835, 387350388, 388081055, 387657127, 386536064, 385309296, 384394875, 383829880, 383274040, 382215462, 380257568, 377326050, 373686790, 369781761, 365993462, 362486992, 359219551, 356102180, 353195343, 350803375, 349392624, 349368439, 350836220, 353481102, 356628456, 359442787, 361146469, 361145134, 359029160, 354513550, 347432632, 337859268, 326316490, 313945866, 302472668, 293888817, 289923744, 291505795, 298452053, 309531708, 322879829, 336576691, 349146957, 359795914, 368348045, 374995804, 380032158, 383702240, 386202736, 387761116, 388689461, 389350662, 390049667, 390923691, 391907005, 392796745, 393379288, 393545151, 393330040, 392873726, 392335472, 391822853, 391372223, 390973473, 390606651]
543C90606651l51829l71590m76112p25098j145134j694221k261200k704583k910194
552C77966690k844963k574806k244606k025681k052917k371750k914353l511123l937798
561C53488693l983040l515358k526321j134720M49829J983528L246956M080582M399567
570C56489716M193077L522491K521401J387252L48931l91197p24221o77070m01879
579C66268501j08337L1967m1618k66648n11818o63223o90231o51016o42281p29332
589C61995964r06944j117020j305847j476326j690140k013626k443504k869110l108178
598C45065269l006744k538834j844482j165123p07550n15900m33235j85089M51317
607C35119629J490707K689057L637504L957711L495864K410851J106720M7913m46549
$$ y = [390606651, 390254822, 389883232, 389407120, 388682022, 387536888, 385842667, 383581467, 380876884, 377966690, 375121727, 372546921, 370302315, 368276634, 366223717, 363851967, 360937614, 357426491, 353488693, 349505653, 345990295, 343463974, 342329254, 342779083, 344762611, 348009567, 352090149, 356489716, 360682793, 364205284, 366726685, 368113937, 368462868, 368071671, 367347450, 366670380, 366268501, 366160164, 366192131, 366150513, 365883865, 365372047, 364708824, 364018593, 363367577, 362725296, 361995964, 361089020, 359972000, 358666153, 357189827, 355499687, 353486061, 351042557, 348173447, 345065269, 342058525, 339519691, 337675209, 336510086, 335802536, 335286636, 334853401, 334668312, 335119629, 336610336, 339299393, 342936897, 346894608, 350390472, 352801323, 353908043, 353955956, 353509407]
616C53509407l27377J98440P96128J166725J159363P87735J65481n78461j345329k051430
626C53480682k582550k773666k450295j526451j02005J511956K874183L578682L427162
635C55437698K516671J193809j03378j035881j489411j577072j532058j560212j739082
644C50111084k011070k261544k420272k518540k671890l006630l581429m353828n204277
653C22081604n986996o572876o852760o720200o063594m802533k958946p21569J552925
662B82955055L428478M543515M756450M206238L249645K301941J660443J396866J366291
671C09864922J318512J043529M78840k70615r96113j489677j636734j459637j101646
680C05751381p68108o50521q58574j386375k122784k909221l626404m267903m958801
$$ y = [353509407, 353182030, 353380470, 354176598, 355343323, 356502686, 357290421, 357455902, 356877441, 355532112, 353480682, 350898132, 348124466, 345674171, 344147720, 344045715, 345557671, 348431854, 352010536, 355437698, 357954369, 359148178, 359044800, 358008919, 356519508, 354942436, 353410378, 351850166, 350111084, 348100014, 345838470, 343418198, 340899658, 338227768, 335221138, 331639709, 327285881, 322081604, 316094608, 309521732, 302668972, 295948772, 289885178, 285082645, 282123699, 281402130, 282955055, 286383533, 290927048, 295683498, 299889736, 303139381, 305441322, 307101765, 308498631, 309864922, 311183434, 312226963, 312705803, 312435188, 311439075, 309949398, 308312664, 306853027, 305751381, 304983273, 304332752, 303474178, 302087803, 299965019, 297055798, 293429394, 289161491, 284202690]
689B84202690n888862p182484q764687j0307598j1308784j1287232j0005111p598229
697B11859703m529972j381073J420002L777466N914173Q166351J0703831J3339596
705B49270077J5549125J6696969J6352977J4523411J1671124Q514480N718804L642387
713C41939354K262115J295624M27857m95606j408310k111740k435417k365150k060853
722C35047874j768074j684379j863861k211609k561150k778625k831803k789936k762565
731C13795872k824765k972412l133010l221837l206539l142681l159389l396664l926582
740B84811993m694195n511379o113282o263122n862351n018062m028244l281727l104782
749B40934849l617134m665165n862026o728020o866226o104184m540977k490254l53145
$$ y = [284202690, 278313828, 271131344, 262366657, 252059059, 240750275, 229463043, 219457932, 211859703, 207329731, 205948658, 207368660, 211146126, 217060299, 225226650, 235930481, 249270077, 264819202, 281516171, 297869148, 312392559, 324063683, 332578163, 338296967, 341939354, 344201469, 345497093, 345924950, 345429344, 344021034, 341909294, 339473877, 337108727, 335047874, 333279800, 331595421, 329731560, 327519951, 324958801, 322180176, 319348373, 316558437, 313795872, 310971107, 307998695, 304865685, 301643848, 298437309, 295294628, 292135239, 288738575, 284811993, 280117798, 274606419, 268493137, 262230015, 256367664, 251349602, 247321358, 244039631, 240934849, 237317715, 232652550, 226790524, 220062504, 213196278, 207092094, 202551117, 200060863, 199707718]
758A99707718J512623K879753L666324L898259L656902L041248K160244J139221J21632
767B21783924p48863j360951j663551j674652j463814j120376p25575l40385q717K36473
777B12913513L75118M14257M01192M22344N77660R37939J506881K207814K909717L479462
787B26145897L835773L976727L967819L896065L819713L740178L611984L385391L052197
796B59431744K671566K353401K209091K295952K582893K961064L291626L468704L464050
805B84730091L330498L164234L047066L000545K974835K878875K629605K195053J606560
814C09557362R34429K49195m11949j044865j649151k186336k555466k607880k202396
823B98082943j275120J08662J751518L375015M704438N551796N860385N697136N201531
$$ y = [199707718, 201220341, 204100094, 207766418, 211664677, 215321579, 218362827, 220523071, 221662292, 221783924, 221035061, 219674110, 218010559, 216335907, 214872093, 213751717, 213026142, 212685757, 212677040, 212913513, 213288631, 213702888, 214104080, 214526424, 215104084, 216042023, 217548904, 219756718, 222666435, 226145897, 229981670, 233958397, 237926216, 241822281, 245641994, 249382172, 252994156, 256379547, 259431744, 262103310, 264456711, 266665802, 268961754, 271544647, 274505711, 277797337, 281266041, 284730091, 288060589, 291224823, 294271889, 297272434, 300247269, 303126144, 305755749, 307950802, 309557362, 310491791, 310740986, 310329037, 309284172, 307635021, 305448685, 302893219, 300285339, 298082943, 296807823, 296916485, 298668003, 302043018, 306747456, 312299252, 318159637, 323856773, 329058304]
832C29058304M521522L767891L002472K260132J576881J005936O04553M03862L80555
841C46582108M55017N23262N07927M03061K82745K65007M47731Q47511J378060J881103
851C53573532K195778K231865K008133J634636J251297R56116P61642O04858L98941
860C65616798R6322k75193o26755q61473r37080q97980q57544r38911j207657j634026
870C57476501k102432k462921k592926k436218k002068j334495m77295N38254J672554
879C46278954K844543L911057M687767N009040M802475M136696L212662K291908J596680
888C78771782J225128J124573J136436J085625Q71696N13077J25160j50985k30255
897C84472237j30425M0321J43319Q5716j32599m24232o65589p67021p19032n93491
$$ y = [329058304, 333579826, 337347717, 340350189, 342610321, 344187202, 345193138, 345797691, 346201553, 346582108, 347037125, 347560387, 348068314, 348471375, 348754120, 349019127, 349466858, 350314369, 351692429, 353573532, 355769310, 358001175, 360009308, 361643944, 362895241, 363851357, 364612999, 365217857, 365616798, 365713120, 365437927, 364811172, 363949699, 363012619, 362114639, 361257095, 360318184, 359110527, 357476501, 355374069, 352911148, 350318222, 347882004, 345879936, 344545441, 344068146, 344606400, 346278954, 349123497, 353034554, 357722321, 362731361, 367533836, 371670532, 374883194, 377175102, 378771782, 379996910, 381121483, 382257919, 383343544, 384215240, 384728317, 384853477, 384702492, 384472237, 384341812, 384382133, 384525452, 384611168, 384478569, 384054337, 383388748, 382621727, 381902695, 381309204]
907C81309204m96941n10177o41670q28514r75686j013298r35402p96203o68640n89524
917C73853149n28717m03442j34087K91367P83730J175346J294556J055030N11399j52283
927C77746048o98662r44938q44651n05104j30005Q1139K3498k73742o79093j036453
937C72738037j245041j298828j271896j260567j323204j452141j587639j666336j666679
946C59965706j624451j608429j669845j796837j902313j856270j546288r38492j05857
955C46916924P89489J554451K036095K173386K009811J663513J273422R47609P36466
964C60101166O36253O15807O41975O92520P49436P82966P47109N92918K97547j08719
974C65748978n40963q91418j083069j116218j076432j094398j272240j616669k019195
$$ y = [381309204, 380812263, 380302086, 379660416, 378831902, 377856216, 376842918, 375907516, 375111313, 374442673, 373853149, 373324432, 372920990, 372786903, 373078270, 373862000, 375037346, 376331902, 377386932, 377898331, 377746048, 377047386, 376102448, 375257797, 374752693, 374622688, 374703827, 374727325, 374453583, 373774490, 372738037, 371492996, 370194168, 368922272, 367661705, 366338501, 364886360, 363298721, 361632385, 359965706, 358341255, 356732826, 355062981, 353266144, 351363831, 349507561, 347961273, 347022781, 346916924, 347706413, 349260864, 351296959, 353470345, 355480156, 357143669, 358417091, 359364700, 360101166, 360737419, 361353226, 361995201, 362687721, 363437157, 364220123, 364967232, 365560150, 365857697, 365748978, 365208015, 364316597, 363233528, 362117310, 361040878, 359946480, 358674240, 357057571, 355038376]
983C55038376k299919k295723j948929j344833o77796j62010O4545q011k79312o10772
993C45475616r07859j160622j423302j749382k125435k451210k581100k405243j923790
1002C28747673j268616o54907k88734k74773n75409j037674j473465j749229j840172
1011C19584694j825333j832599j964665k248936k630653l011131l303871l477078l558159
1020B95732269l598423l619461l571129l328952k738591j690197j89228J611252L437081
1029B82044621M970626N949650O245747N892448N053120L951626K795944J729393Q22887
1038C19456062R5749m52709q27808j042443j130523j153202j185017j283779j463528
1047C11012802j686478j885643k004413k032375k014256k025986k131786k347393k632065
$$ y = [355038376, 352738457, 350442734, 348493805, 347148972, 346471176, 346309166, 346373711, 346365700, 346086388, 345475616, 344567757, 343407135, 341983833, 340234451, 338109016, 335657806, 333076706, 330671463, 328747673, 327479057, 326824150, 326535416, 326260643, 325685234, 324647560, 323174095, 321424866, 319584694, 317759361, 315926762, 313962097, 311713161, 309082508, 306071377, 302767506, 299290428, 295732269, 292133846, 288514385, 284943256, 281614304, 278875713, 277185516, 276996288, 278607540, 282044621, 287015247, 292964897, 299210644, 305103092, 310156212, 314107838, 316903782, 318633175, 319456062, 319551811, 319099102, 318271294, 317228851, 316098328, 314945126, 313760109, 312476330, 311012802, 309326324, 307440681, 305436268, 303403893, 301389637, 299363651, 297231865, 294884472, 292252407]
1056B92252407k912369l126239l256398l338775l438073l609104l867683m186993m520607
1065B59996166m835300n132599n446053n816879o264667o772576p294464p780647q202534
1074B02450447q562927q883667r179859r436169r601336r602308r374151q885422q150453
1083A20774155p221146o166496n050726l920527k806024j728020p07960K31781J075134
1092I4480171J826973K525368L244562M082470N132332O444149P988252R636012J1171693
1101A46531982J2340937J2924948J2818870J2081299J0930710R683533Q649235Q024311
1109B33985825P826805P897663P971325P783642P173881O141377M839592L516826K433739
1118B89570675J789169J677342K077770K872295L875695M871635N653210O063442O029587
$$ y = [292252407, 289340038, 286213799, 282957401, 279618626, 276180553, 272571449, 268703766, 264516773, 259996166, 255160866, 250028267, 244582214, 238765335, 232500668, 225728092, 218433628, 210652981, 202450447, 193887520, 185003853, 175823994, 166387825, 156786489, 147184181, 137810030, 128924608, 120774155, 113553009, 107386513, 102335787, 98415260, 95609236, 93881216, 93173256, 93405037, 94480171, 96307144, 98832512, 102077074, 106159544, 111291876, 117736025, 125724277, 135360289, 146531982, 158872919, 171797867, 184616737, 196698036, 207628746, 217312279, 225961514, 233985825, 241812630, 249710293, 257681618, 265465260, 272639141, 278780518, 283620110, 287136936, 289570675, 291359844, 293037186, 295114956, 297987251, 301862946, 306734581, 312387791, 318451233, 324480820]
1127C24480820N578766M823570L918648L001365K145310J345634N47562l00598j196137
1136C44344940k064094k781296l229294l347168l154106k730904k177200j567612r38415
1145C22354851l05329L01819Q15888J143341J205330R86633N59921O3858l55491o11687
1155C26159134p15828p60803q63838j095925j441574j808910k085610k203254k173500
1164C13009892k075787k003079k006359k070026k138577k174911k210350k346821k699013
1173B93284969l303470m049149m677143m867783m381198l184147j497078K71206J675663
1182B69271870K405700K394085J817456R91249K19288l31650o71711r38378j292858
1191B73865051j823673k505608l227310l861332m332695m650058m887352n137406n464249
$$ y = [324480820, 330059586, 334883156, 338801804, 341803169, 343948479, 345294113, 345841675, 345541077, 344344940, 342280846, 339499550, 336270256, 332923088, 329768982, 327038078, 324860878, 323293266, 322354851, 322049522, 322351341, 323167229, 324310570, 325515900, 326502533, 327062454, 327126312, 326770821, 326159134, 325443306, 324682503, 323818665, 322722740, 321281166, 319472256, 317386646, 315183392, 313009892, 310934105, 308931026, 306924667, 304854641, 302716064, 300541153, 298330803, 295983982, 293284969, 289981499, 285932350, 281255207, 276387424, 272006226, 268822079, 267325001, 267596207, 269271870, 271677570, 274071655, 275889111, 276880360, 277099648, 276767998, 276096287, 275157909, 273865051, 272041378, 269535770, 266308460, 262447128, 258114433, 253464375, 248577023, 243439617, 237975368]
1200B37975368n882263o366272o878509p393990p909736q435765q980369r537621j0084305
1209A66506538j0582656j0982943j1223841j1232757j0932608j0258827r183197p733088
1217H4376621n998187m115591k238889n01694J012506K282825L346195M276609N157643
1226H7598038O055612O999941P975197Q928089R785195J0477972J0962896J1230907
1234A60013847J1302033J1208305J0977688J0625610J0160466R597816Q973599Q343715
1242B41203079P772656P309799O970863O730671O532459O308804O003590N586853N057964
1251B99476738M438610L759213L043499K294616J486817N66635n32074j859360l413887
1260C09260807n115490o799564q244362r222965r565850r206066q194294o676311m850102
$$ y = [237975368, 232093105, 225726833, 218848324, 211454334, 203544598, 195108833, 186128464, 176590843, 166506538, 155923882, 144940939, 133717098, 122484341, 111551733, 101292906, 92109709, 84376621, 78378434, 74262843, 72023954, 71522260, 72534766, 74817591, 78163786, 82440395, 87598038, 93653650, 100653591, 108628788, 117556877, 127342072, 137820044, 148782940, 160013847, 171315880, 182524185, 193501873, 204127483, 214287949, 223885765, 232859364, 241203079, 248975735, 256285534, 263256397, 269987068, 276519527, 282828331, 288831921, 294418774, 299476738, 303915348, 307674561, 310718060, 313012676, 314499493, 315066128, 314534054, 312674694, 309260807, 304145317, 297345753, 289101391, 279878426, 270312576, 261106510, 252912216, 246235905, 241385803]
1269B41385803k920475j072445N35851J764793K490635K615357K090663R44748p06462
1278B47128468k670536m713040o598186q124791r142665r553776r304848q385105o831741
1287A81803780m742337k281952L23124K811222M925156O457443P287903P405205O906376
1296B10895920N973739M830227L684063K670574J812687J015664J06811j085834k639332
1305B27264519m463654o282673p687683q247318p640133n760117k758827R88636M973736
1314A90386486Q670216J1635036J3574524J4371548J4080620J2902298J1141376R149303
1322B85911407P254200N693417M565697L823852L311310K828446K198982J312828J33514
1331C17033653j314640k958088m665298o225166p337780p650891o855697m814892j672287
$$ y = [241385803, 238465328, 237392883, 237928734, 239693527, 242184162, 244799519, 246890182, 247834930, 247128468, 244457932, 239744892, 233146706, 225021915, 215879250, 206325474, 197020626, 188635521, 181803780, 177061443, 174779491, 175102615, 177913837, 182838993, 189296436, 196584339, 203989544, 210895920, 216869659, 221699886, 225383949, 228054523, 229867210, 230882874, 230989685, 229903851, 227264519, 222800865, 216518192, 208830509, 200583191, 192943058, 187182941, 184424114, 185412750, 190386486, 199056702, 210691738, 224266262, 238637810, 252718430, 265620728, 276762104, 285911407, 293165607, 298859024, 303424721, 307248573, 310559883, 313388329, 315587311, 316900139, 317033653, 315719013, 312760925, 308095627, 301870461, 294532681, 286881790, 280026093, 275211201, 273538914]
1340B73538914K121315N895881Q946610J0746879J1104947J0197296Q469925O453590
1348C37475357M577789L056641J885033R22470Q735r53178j979637l046837m147072
1357C37799301n311928o581230p933121r218044j0150947j0379467r615689p772884
1365B70835991n044880j886024J110572L387108M581318M612389L666153K099838L12424
1374B83674889j363697k718049l660011m184379m331131m160481l744926l166714k508583
1383B53836918j835842j179257n32150J32084Q27618J526813K152634K599334K775326
1392B60303478K644463K247181J686535J087265N45234R4319k97318o97994j167984
1401B66445179j722565k318649k874222l304539l560390l645782l610936l525085l447743
$$ y = [273538914, 275660229, 281556110, 290502720, 301249599, 312354546, 322551842, 331021767, 337475357, 342053146, 345109787, 346994820, 347917290, 347926025, 346972847, 344993210, 341946373, 337799301, 332487373, 325906143, 317973022, 308754978, 298604031, 288224564, 278608875, 270835991, 265791111, 263905087, 265015659, 268402767, 272984085, 277596474, 281262627, 283362465, 283674889, 282311192, 279593143, 275933132, 271748753, 267417622, 263257141, 259512215, 256345501, 253836918, 252001076, 250821819, 250289669, 250421753, 251249371, 252776184, 254928818, 257528152, 260303478, 262947941, 265195122, 266881657, 267968922, 268514156, 268608475, 268311157, 267613163, 266445179, 264722614, 262403965, 259529743, 256225204, 252664814, 249019032, 245408096, 241883011, 238435268]
1410B38435268l410339l416920l452606l491936l496379l405781l138523k610398j773395
1419B10238991o56910O15406J852398K860050L517494L822994L883019L848019L826427
1428B33807888L826962L758716L490582K935199K110730J146087K32125m58222q35323
1437B50014744r20372q28610p24983p72743j089459j713714k585716l548127m379139
1446B33451881m860401m864444m421254l724975l061981k682858k681370k945041l213540
1455B00996017l216552k821236k103290j301251o78272l70388l09468k67925K899O20175
1465A90550709J491775K358895K932853L048611K750187K260647J860065J740475J918030
1474B10912247K244529K506485K551098K368870K089577J899872J930275K177772K507000
$$ y = [238435268, 235024929, 231608009, 228155403, 224663467, 221167088, 217761307, 214622784, 212012386, 210238991, 209582081, 210197487, 212049885, 214909935, 218427429, 222250423, 226133442, 229981461, 233807888, 237634850, 241393566, 244884148, 247819347, 249930077, 251076164, 251308289, 250850067, 250014744, 249094372, 248265762, 247540779, 246768036, 245678577, 243964863, 241379147, 237831020, 233451881, 228591480, 223727036, 219305782, 215580807, 212518826, 209835968, 207154598, 204209557, 200996017, 197779465, 194958229, 192854939, 191553688, 190875416, 190505028, 190195560, 189927635, 189930534, 190550709, 192042484, 194401379, 197334232, 200382843, 203133030, 205393677, 207253742, 208994217, 210912247, 213156776, 215663261, 218214359, 220583229, 222672806, 224572678, 226502953, 228680725, 231187725]
1483B31187725K729511K716046K479896K181168K045307K240295K780419L517189M226837
1492B56104393M751587N108566N495033O170292P269440Q651295R882583J0388890
1500C13822079R717540P784119M971428K018738k60582j302643j006317K58903J845208
1509C37848473L115501L687744L530388K885780K088395J383552Q40263L82653r8496
1518C55664253o33087j125145j396789j292420p81212J679P99026J342430J475945
1527C54054680J231117Q14896N11017N36003R18159J459465J805496J603699O78749
1536C63613281q52279k588501l982315m555512m098244k764434j013718N78003J557731
1545C45894012J778450J440545R72480P99866J113968J749802K242622K048912Q37021
$$ y = [231187725, 233917236, 236633282, 239113178, 241294346, 243339653, 245579948, 248360367, 251877556, 256104393, 260855980, 265964546, 271459579, 277629871, 284899311, 293550606, 303433189, 313822079, 323539619, 331323738, 336295166, 338313904, 338053322, 336750679, 335744362, 336003265, 337848473, 340963974, 344651718, 348182106, 351067886, 353156281, 354539833, 355380096, 355762749, 355664253, 355031166, 353906021, 352509232, 351216812, 350435600, 350437279, 351236305, 352578735, 354054680, 355285797, 356100693, 356611710, 357147713, 358065872, 359525337, 361330833, 362934532, 363613281, 362761002, 360172501, 356190186, 351634674, 347536430, 344771996, 343758278, 344336281, 345894012, 347672462, 349113007, 350085487, 350885353, 351999321, 353749123, 355991745, 358040657, 358877678]
1554C58877678j291504l767281n744705o450424n537491l272171m54941J904641L017616
1563C37281418K646599J181183n78957j820984k100143j514473n99823j2360j77917
1572C34304543j087494k338066l372689l776359l467179k691116j847916j262855j035538
1581C13425331j039467j048641r02595o08521l29800k82344o10390j313496k255573
1590C05034504l235607m066029m616871m812393m606151l969708k915268j537800m3144
1599B75231533J273518K108593K259616J715107O74267n19390j509056k064457k168255
1608B77001476k009163j885204k059555k634754l504276m402008n027314n186863m884662
1617B45407677m320145l794537l574218l773995m316120m979057n506554n724277n611458
$$ y = [358877678, 357586174, 353818893, 348074188, 341623764, 336086273, 332814102, 332359161, 334263802, 337281418, 339928017, 341109200, 340530243, 338709259, 336609116, 335094643, 334494820, 334482460, 334304543, 333217049, 330878983, 327506294, 323729935, 320262756, 317571640, 315723724, 314460869, 313425331, 312385864, 311337223, 310434628, 309826107, 309496307, 309213963, 308603573, 307290077, 305034504, 301798897, 297732868, 293115997, 288303604, 283697453, 279727745, 276812477, 275274677, 275231533, 276505051, 278613644, 280873260, 282588367, 283262634, 282743244, 281234188, 279169731, 277001476, 274992313, 273107109, 271047554, 268412800, 264908524, 260506516, 255479202, 250292339, 245407677, 241087532, 237292995, 233718777, 229944782, 225628662, 220649605, 215143051, 209418774, 203807316]
1626B03807316n300179n013580m975071n325680o077556p108899q197631r081145r529972
1635A43197603r419336q774395p770624o674128n738888n099401m709606m364529l798523
1644H6848173k815628j380520L75824K240992M041052N724907P356929R023552J0713320
1653A22128601J2253523J3349733J3719559J3242836J2039738J0428600Q780651P355271
1661B13298512O208515N218734M208165L077469J870784P37343j75400q19835j268235
1670B32356052j644382k017746k340660k481156k338275j964894j610546j636314k338715
1679B13983364l773594n687561p602386r018498r635200r474430q851738q215247p940177
1688A43784533q180047q834667r628162j0242214j0432043j0083113r206634p901044
$$ y = [203807316, 198507137, 193493557, 188518486, 183192806, 177115250, 170006351, 161808720, 152727575, 143197603, 133778267, 125003872, 117233248, 110559120, 104820232, 99720831, 95011225, 90646696, 86848173, 84032545, 82652025, 83027849, 85268841, 89309893, 95034800, 102391729, 111415281, 122128601, 134382124, 147731857, 161451416, 174694252, 186733990, 197162590, 205943241, 213298512, 219507027, 224725761, 228933926, 232011395, 233882179, 234619522, 234444122, 233624287, 232356052, 230711670, 228693924, 226353264, 223872108, 221533833, 219568939, 217958393, 216322079, 213983364, 210209770, 204522209, 196919823, 187901325, 178266125, 168791695, 159939957, 151724710, 143784533, 135604486, 126769819, 117141657, 106899443, 96467400, 86384287, 77177653, 69276609]
1696F9276609o312108m605302k943840j461935k28363P79519J672736K603068L686295
1705F2466679M925279O175251P168894P596550P211180N916309L807507J156082j654349
1714A04769382m217405o192627p371530p703925p281966o284876m908599l305355j559848
1723E5943251K91710K214407M130636N910578P406129Q512307R216222R602709R805403
1732A13033352R932499J0008993R973011R731426R239798Q556003P831707P239857
1740A85546646O880493O721592O612644O367550N870266N145607M354000L714524L399315
1749B34612637L455753L793125M233856M595433M757099M687233M427509M059429L675804
1758B72297878L366852L212185L265820L527698L917732M276181M406795M154911L488045
$$ y = [69276609, 62964501, 58359199, 55415359, 53953424, 53725061, 54504580, 56177316, 58780384, 62466679, 67391958, 73567209, 80736103, 88332653, 95543833, 101460142, 105267649, 106423731, 104769382, 100551977, 94359350, 86987820, 79283895, 72001929, 65717053, 60808454, 57503099, 55943251, 56234961, 58449368, 62580004, 68490582, 75896711, 84409018, 93625240, 103227949, 113033352, 122965851, 132974844, 142947855, 152679281, 161919079, 170475082, 178306789, 185546646, 192427139, 199148731, 205761375, 212128925, 217999191, 223144798, 227498798, 231213322, 234612637, 238068390, 241861515, 246095371, 250690804, 255447903, 260135136, 264562645, 268622074, 272297878, 275664730, 278876915, 282142735, 285670433, 289588165, 293864346, 298271141, 302426052, 305914097]
1767C05914097K534427J552659Q38222O06155R03264J590671K401848L047981L323841
1776C22713165L170357K679558K046814J495971J205674J255226J598854K079162K473755
1785C40718536K572480K261657J582909P36580J3771l22342j55144M22631J142730
1794C48973808J679688J800537J472626Q73184K97890J4114J37634N89371J150818
1803C56989670J579857J722831J569252J229935Q65631O07949N14984N73654P28836
1812C66382599R18884J095810J227760J298371J306686J270714J222610J190567J175805
1821C77089806J139259J016655P60574L84979j6632l02505l50151j26305K88506P38640
1831C80622826J077194J246109J296539J338844J447106J584930J606674J342621P22351
$$ y = [305914097, 308448524, 310001183, 310839405, 311445560, 312348824, 313939495, 316341343, 319389324, 322713165, 325883522, 328563080, 330609894, 332105865, 333311539, 334566765, 336165619, 338244781, 340718536, 343291016, 345552673, 347135582, 347872162, 347885933, 347563591, 347408447, 347831078, 348973808, 350653496, 352454033, 353926659, 354799843, 355097733, 355111847, 355249481, 355838852, 356989670, 358569527, 360292358, 361861610, 363091545, 363957176, 364565125, 365080109, 365653763, 366382599, 367301483, 368397293, 369625053, 370923424, 372230110, 373500824, 374723434, 375914001, 377089806, 378229065, 379245720, 380006294, 380391273, 380374641, 380072136, 379721985, 379595680, 379884186, 380622826, 381700020, 382946129, 384242668, 385581512, 387028618, 388613548, 390220222, 391562843, 392285194]
1840C92285194j41601r70650j440697j346626p16629J89934J006317J437035J394195
1849C91696472J016922N71785K93961K65999L99894N22766N07088L58124K05955K07711
1859C96046677M27551P70302J018295R49478M72984l01399j101455j617814j654014
1868C95010605j217728n10750J72043N80521O11687L32908p4730m15992n68886n21088
1878C93398590l50799j67771n6152m1771r6932j68991k15034k21863k05307j92337
1888C91681633j99699k20948k30102j98021j13259O829J20849J85929J82075J27335
1898C91342621P0915O4621J28937K35023L14484K99530J68457k8992j87187j97449
1908C92210960j2321L17192O54449Q41179P77512M75960N8250l05595m83666m43725
$$ y = [392285194, 392143593, 391172943, 389732246, 388385620, 387668991, 387858925, 388865242, 390302277, 391696472, 392713394, 393285179, 393579140, 393845139, 394245033, 394767799, 395274887, 395633011, 395838966, 396046677, 396474228, 397244530, 398262825, 399212303, 399685287, 399383888, 398282433, 396664619, 395010605, 393792877, 393282127, 393454170, 394034691, 394646378, 394979286, 394904556, 394488564, 393919678, 393398590, 393047791, 392880020, 392823868, 392782097, 392685165, 392516174, 392301140, 392079277, 391873970, 391681633, 391481934, 391260986, 391030884, 390832863, 390719604, 390726433, 390847282, 391033211, 391215286, 391342621, 391413536, 391478157, 391607094, 391842117, 392156601, 392456131, 392624588, 392595596, 392408409, 392210960, 392198639, 392515831, 393170280, 394011459, 394788971, 395264931, 395323181, 395017586, 394533920, 394090195]
1918C94090195k60163o1683M7302M3182j3084k5635O5422K37808L94860M24270K70958
1929C95213432j8692l12538m60663l80439j06926K17743M15191L63388O1646l67050
1939C94625092p37725q96377p95517n13420k08016l3188o0844k50893m80270o15540
1949C90033302n84945m12178j95160m3297j1101o7139j15051n5237J48926M41437O96297
1960C89835854P83996O42891L17268o1607l41720m25148l15133j05476P5607J37825
1970C90544357P4120m3373j13487o9085Q1749K62833L77197L67813K52915J16386N6343
1981C91907768J25504K94838M66079N24865M06952J38473j72005l87268m10957k37999
1991C92656250M4861L04680M30298L86581K24838M7150n2986m1466M3221J19743J16997
$$ y = [394090195, 393830032, 393768349, 393815651, 393858833, 393845749, 393820114, 393885536, 394123344, 394518204, 394942474, 395213432, 395194740, 394882202, 394421539, 394041100, 393934174, 394151917, 394567108, 394930496, 394992142, 394625092, 393887367, 392990990, 392195473, 391682053, 391474037, 391440849, 391380005, 391129112, 390648842, 390033302, 389448357, 389036179, 388841019, 388797722, 388786621, 388719482, 388604431, 388549194, 388698120, 389139557, 389835854, 390619850, 391262741, 391580009, 391518402, 391176682, 390751534, 390436401, 390330925, 390406532, 390544357, 390618477, 390575104, 390461617, 390392532, 390474281, 390737114, 391114311, 391482124, 391735039, 391851425, 391907768, 392033272, 392328110, 392794189, 393319054, 393726006, 393864479, 393692474, 393305206, 392894249, 392656250, 392701111, 393005791, 393436089, 393822670, 394047508, 394094658, 394041672, 394000206, 394043427, 394163170, 394280167]
2002C94280167J7967j29891k44484k59552j66893k3803P8888O8245o7482k71187m46549
2013C92835426n11169m40369k78435j11923j9340k9526j07918j81694j85051r9411
2023C90870590L5210J45111J66359Q4228n6457j76544k07787j33018K288J15014J31416
2034C90976410K9335j47362l11775l81393l23258j71318o561Q9073P7667j4763j16844
2045C89699211j55678j01318J5297J20582J42556N5351j03989k55584l22457k76336
2055C88817635j55030m1733j6708j10550k84691m52232n26123m69551l16963j56250
2065C86287804q0262j34468k92434m69056n65757n24483l55721j32179N2452J33286
2075C83919182J06048K4834l3226j2932Q6365K12746K91519K70347J49002j9035j56708
$$ y = [394280167, 394298134, 394168243, 393923759, 393664207, 393497314, 393473511, 393552399, 393620644, 393553162, 393281975, 392835426, 392324257, 391883888, 391605453, 391493530, 391474190, 391444664, 391336746, 391155052, 390970001, 390870590, 390905800, 391050911, 391217270, 391301498, 391245041, 391068497, 390860710, 390727692, 390729980, 390844994, 390976410, 391005745, 390858383, 390546608, 390165215, 389841957, 389670639, 389664078, 389753151, 389830818, 389816055, 389699211, 389543533, 389442215, 389457512, 389578094, 389720650, 389776001, 389672012, 389416428, 389093971, 388817635, 388662605, 388620872, 388604164, 388493614, 388208923, 387756691, 387230568, 386761017, 386444054, 386287804, 386207542, 386073074, 385780640, 385311584, 384745827, 384221344, 383865623, 383733444, 383785896, 383919182, 384025230, 384050064, 384016838, 384003906, 384090271, 384303017, 384594536, 384864883, 385013885, 384994850, 384838142]
2086C84838142k06031j59760o4354Q087J831r0294k22053l20053l25737k28920p4616
2097C83156242O1303J13296O0997o0997j83563k43035k14500j24741l2768M349l4332
2108C82502251j22681k04468k26021j69372o2103L7994P7095L6201n7449j46370j76849
2119C81488228j30844l7308M3831N7716j3313j36108k44141k74658k04201o4850P3662
2130C80558014J41754J08833M58j16005j70250j28784j3695J10207J73645J41106L1280
2141C80836563r7046j79138j82571j23597n4321k7084o1722j30844j79100j58081o0539
2152C79582520O9541J59531J48964K6360j59951l24134l89481l28293j78986k5100
2162C78580971M9362M272j35803k96440l95622l86963k84042j49689n8708n5085j28746
$$ y = [384838142, 384632111, 384472351, 384407997, 384416084, 384417915, 384327621, 384105568, 383785515, 383459778, 383230858, 383156242, 383217545, 383330841, 383391838, 383330841, 383147278, 382904243, 382689743, 382565002, 382532234, 382536583, 382502251, 382379570, 382175102, 381949081, 381779709, 381717606, 381755600, 381832695, 381868896, 381811447, 381665077, 381488228, 381357384, 381320076, 381363907, 381421623, 381408310, 381272202, 381028061, 380753403, 380549202, 380484352, 380558014, 380699768, 380808601, 380809059, 380693054, 380522804, 380394020, 380380325, 380490532, 380664177, 380805283, 380836563, 380739517, 380560379, 380377808, 380254211, 380199890, 380172806, 380111084, 379980240, 379801140, 379643059, 379582520, 379652061, 379811592, 379960556, 379986916, 379826965, 379502831, 379113350, 378785057, 378606071, 378580971, 378630333, 378634605, 378498802, 378202362, 377806740, 377419777, 377135735, 376986046, 376927338, 376872253, 376743507]
2173C76743507k22892k68670k25639j05820L3036J20048J10970J3084j19781k17057
2183C75860786k29911j56823m2190N0773P4692K2621p0610j51901j79748j47629q3809
2194C74946251l3112k8877p4119j40152j85128j78299j17950l3875L1014M2419n493
2205C74222679q7890j63575j96991j77383j23940p3738o1302r8495j68686k36435k67830
2216C72566414k49481j96724j43662j23024j46065j94854k32849k26441j67236p9651
2226C70806427r155J983n9242j67007k68822l12004k73132j70746n5504J6708J5869
2237C69525375m6768j26152j69792j48048p0687J9264P1907N9777m540p6255j04981
2248C68929100o6109K1248J02997J19820M2419j07918k66990l59688l41034k21100
$$ y = [376743507, 376520615, 376251945, 376026306, 375920486, 375953522, 376073570, 376184540, 376197624, 376077843, 375860786, 375630875, 375474052, 375431862, 375482635, 375557327, 375579948, 375509338, 375357437, 375177689, 375030060, 374946251, 374913139, 374884262, 374810143, 374669991, 374484863, 374306564, 374188614, 374154739, 374185753, 374228172, 374222679, 374134789, 373971214, 373774223, 373596840, 373472900, 373399162, 373337860, 373239365, 373070679, 372834244, 372566414, 372316933, 372120209, 371976547, 371853523, 371707458, 371512604, 371279755, 371053314, 370886078, 370806427, 370797272, 370799255, 370740013, 370573006, 370304184, 369992180, 369719048, 369548302, 369492798, 369509506, 369525375, 369478607, 369352455, 369182663, 369034615, 368963928, 368983192, 369055099, 369114876, 369110336, 369034081, 368929100, 368862991, 368884239, 368987236, 369107056, 369149475, 369041557, 368774567, 368414879, 368073845, 367852745]
2258C67852745o0921N9319Q3351P858j17416k19421k43073j81961p9002o87J984p7401
2270C67025375j99813l03460l38554k92282j90697p8316Q889O2103R8572J43127K07176
2281C66142120K77138L21884L10822K33917J11122j6784j06698j34353j04561m6349
2291C66988258L281J8997K251k1706j4686N2147J81236L43933M91104N74722N69420
2302C69188957M81949L43628J91879N1689o5956j52626j82342j08414J15929M94384
2312C70359077R51729J331940J452560J191292N68199k35710r42764j304169j226272
2321C72145882q23136l60756j20124k48261o85272j205902j549721j564369j275978
2330C64312363q53043m96139l29056l64456n55573q85544j410370k206764l241501
$$ y = [367852745, 367791824, 367851143, 367934494, 367942352, 367824936, 367605515, 367362442, 367180481, 367101479, 367100792, 367102776, 367025375, 366825562, 366522102, 366183548, 365891266, 365700569, 365622253, 365631142, 365693245, 365791817, 365934944, 366142120, 366419258, 366741142, 367051964, 367285881, 367397003, 367380219, 367273521, 367139168, 367034607, 366988258, 366991539, 367010536, 367012787, 366991081, 366976395, 367028542, 367209778, 367553711, 368044815, 368619537, 369188957, 369670906, 370014534, 370206413, 370258102, 370192146, 370039520, 369857178, 369748764, 369864693, 370359077, 371310806, 372642746, 374095306, 375286598, 375854797, 375619087, 374676323, 373372154, 372145882, 371322746, 370961990, 370841866, 370593605, 369908333, 368702431, 367152710, 365588341, 364312363, 363459320, 362963181, 362634125, 362269669, 361714096, 360828552, 359418182, 357211418, 353969917]
2339C53969917m256248m766121m221878k281113R45091M816018Q325996J0460129J0584564
2348C73576355Q692665N392380J646881j602402l761215m719849m777031m417457m071503
2357C65958824l960266m077263m270782m365731m254493l926544l445015k899247k364311
2366C32395172j881561j458969j083603p34825l96576o3362K58445N58396Q32100J089401
2376C29514618J351623J636124J936417K210541K390518K411079K246132J929359J545487
2385C47171898J193695R42383P99904P18536O30112M89273L01361J16768k365k2087
2395C52339478M0397J25656J64604J17074p935j58768k71644l03498k52838j55525
2405C51637001o3896j8845l1776q4076j41220j73149j68801j39236j08490r8953j17607
$$ y = [353969917, 349713669, 344947548, 340725670, 338444557, 339389648, 344205666, 352531662, 362991791, 373576355, 382269020, 387661400, 389308281, 387705879, 383944664, 379224815, 374447784, 370030327, 365958824, 361998558, 357921295, 353650513, 349284782, 345030289, 341103745, 337658730, 334759483, 332395172, 330513611, 329054642, 327971039, 327236214, 326839638, 326776276, 327034721, 327593117, 328425217, 329514618, 330866241, 332502365, 334438782, 336649323, 339039841, 341450920, 343697052, 345626411, 347171898, 348365593, 349307976, 350107880, 350826416, 351456528, 351945801, 352247162, 352363930, 352361565, 352339478, 352379875, 352505531, 352670135, 352787209, 352779274, 352620506, 352348862, 352045364, 351792526, 351637001, 351573105, 351554260, 351522484, 351438408, 351297188, 351124039, 350955238, 350816002, 350707512, 350608559, 350490952]
2416C50490952j53275j82877j85813j56708j10932p6103p8392j26037k02637k75383
2426C48942795l11775k98996k51007k01378j83449k09961k64893l13072l21159k79312
2436C46307793k07749j44729j22681j46790j89094k04125j55868m1123J04561K24037
2446C45424232K67411K19345J06048j8158r9868j13259p0839j3198J5373q202p4386
2457C45634499j48850j92909j86615j38741q1520n2032p1221j32522k06948k59323
2467C44163818k68402k38189j94664j69526j80931k22129k64321k74086k33307j52893
2477C41965370o8168k2088m1275j19934k22320k99187l14293k63023j73950r4071o3438
2488C40283623r4528j67923k43721k84119k74010k25563j69487j35040j33705j54343
$$ y = [350490952, 350337677, 350154800, 349968987, 349812279, 349701347, 349625244, 349546852, 349420815, 349218178, 348942795, 348631020, 348332024, 348081017, 347879639, 347696190, 347486229, 347221336, 346908264, 346587105, 346307793, 346100044, 345955315, 345832634, 345685844, 345496750, 345292625, 345136757, 345095634, 345200195, 345424232, 345691643, 345910988, 346017036, 345998878, 345899010, 345785751, 345714912, 345701714, 345717087, 345708885, 345634499, 345485649, 345292740, 345106125, 344967384, 344885864, 344833832, 344762611, 344630089, 344423141, 344163818, 343895416, 343657227, 343462563, 343293037, 343112106, 342889977, 342625656, 342351570, 342118263, 341965370, 341897202, 341875114, 341833839, 341713905, 341491585, 341192398, 340878105, 340615082, 340441132, 340347061, 340283623, 340189095, 340021172, 339777451, 339493332, 339219322, 338993759, 338824272, 338689232, 338555527, 338401184]
2498C38401184j72386j68533j42365j13563j10894j50985k25602l01094l34472k96555
2508C36384735j91231n5999N4016R3956N1918m4442j42135j90811j69373r5787j6556
2519C35678291K0333p401q3656j63269j97220j61362p0114L0480Q9073P7591O599p9384
2531C35139961j28174j08642k9526O5003J18484R3613p744j44386k57569l00560k61879
2542C34178581j68533o9428q392k327l5248p2097q1711n6191j5907L509k6283j08261
2554C33537712k15111l02925l34167k98043k16522j32179q5335r2621j38626j86882
2564C31535301k00577j65252r6970l4218j5564n8136j46942k42042l00713k99454k46200
2575C29729233j74637j24970j21192j58883k09846k39754k29034j85051j35613j12610
$$ y = [338401184, 338228798, 338060265, 337917900, 337804337, 337693443, 337542458, 337316856, 337015762, 336681290, 336384735, 336193504, 336137505, 336191521, 336285477, 336337395, 336292953, 336150818, 335960007, 335790634, 335694847, 335678291, 335698624, 335691223, 335607567, 335444298, 335247078, 335085716, 335015602, 335046082, 335135155, 335212746, 335219345, 335139961, 335011787, 334903145, 334873619, 334938622, 335057106, 335150719, 335142975, 334998589, 334741020, 334440460, 334178581, 334010048, 333940620, 333932228, 333929901, 333894653, 333822556, 333740845, 333684654, 333668747, 333672256, 333645973, 333537712, 333322601, 333019676, 332685509, 332387466, 332170944, 332038765, 331953430, 331860809, 331722183, 331535301, 331334724, 331169472, 331072502, 331038284, 331022720, 330964584, 330817642, 330575600, 330274887, 329975433, 329729233, 329554596, 329429626, 329308434, 329149551, 328939705, 328699951, 328470917, 328285866, 328150253, 328037643]
2585C28037643j31874j82228k32963k51389k23846j65024j10664r8191j45149k37885
2595C26258430l39355m07295m16832l71475k99111k34375j98860j91727j93596j81770
2605C23424034j47018j00479o6452o7025j06849j67046k15378k23808j84174j14975
2615C22030830n1002k4452m7875j05819j64528j90010j67160j08376m7340j9532m2915
2626C21061821j07460j79558k20527k07711j46827p0763k0790k5292q3713j66550k31113
2637C19601517k43893j97906j15777l5514J0280J2341j2684l4504k9392L261M0799
2648C18998528N0582J1368p0152j60408k15702k05784j32256k9315N3291P6237L0307
2659C18406696n9604j48793j97677j91651j47514j00975q6174j16215j76544k35138
$$ y = [328037643, 327905769, 327723541, 327490578, 327239189, 327015343, 326850319, 326739655, 326641464, 326496315, 326258430, 325919075, 325511780, 325094948, 324723473, 324424362, 324189987, 323991127, 323799400, 323605804, 323424034, 323277016, 323176537, 323110085, 323043060, 322936211, 322769165, 322553787, 322329979, 322145805, 322030830, 321979828, 321955376, 321907501, 321801682, 321637154, 321447144, 321279984, 321171608, 321124268, 321104736, 321061821, 320954361, 320774803, 320554276, 320346565, 320199738, 320128975, 320108185, 320082893, 319999180, 319832630, 319601517, 319357624, 319159718, 319043941, 319008427, 319018707, 319031048, 319018364, 318983860, 318954468, 318957729, 318998528, 319049110, 319060478, 318990326, 318829918, 318614216, 318408432, 318276176, 318246861, 318300152, 318376389, 318406696, 318347092, 318198299, 318000622, 317808971, 317661457, 317560482, 317474308, 317358093, 317181549, 316946411]
2669C16946411k59743k36263j74942j03531n2128l6754n3139q1539r8419r1763o5689
2680C15692501l8280l0098n1728r7923j50490j88465j99566j87607j69105j64166j84135
2691C14230938k24609k67544k91157k82803k46582k01988j73321j76181k07978k49920
2701C11908855k76641k71531k36644j91861j64909j75171k22740k88219l43056l65601
2711C09372482l52859l21064k96421k98310l27739l66402l86963l70064l16639k50091
2721C06085930k04334k05689k58045l38802m10004m37546m09012l40213k67582k28615
2731C02986088k43035l02925l77350m28447m31252l84197l08266k33574j83143j62602
2741B99931297j60389j59568j50128j37138j37120j66378k28595l08342l77083m06914
$$ y = [316946411, 316686668, 316450405, 316275463, 316171932, 316119804, 316083050, 316029911, 315948372, 315849953, 315758190, 315692501, 315654221, 315624123, 315572395, 315474472, 315323982, 315135517, 314935951, 314748344, 314579239, 314415073, 314230938, 314006329, 313738785, 313447628, 313164825, 312918243, 312716255, 312542934, 312366753, 312158775, 311908855, 311632214, 311360683, 311124039, 310932178, 310767269, 310592098, 310369358, 310081139, 309738083, 309372482, 309019623, 308698559, 308402138, 308103828, 307776089, 307409687, 307022724, 306652660, 306336021, 306085930, 305881596, 305675907, 305417862, 305079060, 304669056, 304231510, 303822498, 303482285, 303214703, 302986088, 302743053, 302440128, 302062778, 301634331, 301203079, 300818882, 300510616, 300277042, 300093899, 299931297, 299770908, 299611340, 299461212, 299324074, 299186954, 299020576, 298791981, 298483639, 298106556, 297699642]
2751B97699642l86104l26233k56844k11658k11068k53830l17878l74356m01592l95870
2761B94564209l70426l46222l38688l50075l69854l82747l80021l64837l51391l55358
2771B90954590l84236m31308m78192n04379m97475m59613m06113l56026l22647l06892
2781B86807709k98558k83660k54384k13584j74046j49956j48792j66073j88866k03228
2791B84726562k03781j97010j97048k15931k53830k96154l20034l06949k54746j81808
2801B82299271j19515r7141j26000j92852k65655l10478l08323k65370k09083j72577
2811B80232277j77631k22340k83775l30048l38039l04089k44999j87340j53751j52569
2821B77837696j76773k10781k41928k65389k85968l10116l40214l70312l89995l90759
$$ y = [297699642, 297313538, 296987305, 296730461, 296518803, 296307735, 296053905, 295736027, 295361671, 294960079, 294564209, 294193783, 293847561, 293508873, 293158798, 292788944, 292406197, 292026176, 291661339, 291309948, 290954590, 290570354, 290139046, 289660854, 289156475, 288659000, 288199387, 287793274, 287437248, 287114601, 286807709, 286509151, 286225491, 285971107, 285757523, 285583477, 285433521, 285284729, 285118656, 284929790, 284726562, 284522781, 284325771, 284128723, 283912792, 283658962, 283362808, 283042774, 282735825, 282481079, 282299271, 282179756, 282082615, 281956615, 281763763, 281498108, 281187630, 280879307, 280613937, 280404854, 280232277, 280054646, 279832306, 279548531, 279218483, 278880444, 278576355, 278331356, 278144016, 277990265, 277837696, 277660923, 277450142, 277208214, 276942825, 276656857, 276346741, 276006527, 275636215, 275246220, 274855461]
2831B74855461l72753l46394l28540l33405l66402m20456m79450n25760n47734n43709
2841B70590858n22480m98066m85076m92993n24120n74627o36501p00970p60880q11290
2851B64583855q49228q72650q79860q70247q46062q12893p80506p59315p56875p74250
2861B56381969q04901q37612q61721q72002q71162q66623q65364q68549q70037q60863
2871B47803135q35629p98492p63836p50332p71808q29449r09691r89723j048336j075306
2881B39030533j076222j069488j076794j113357j180420j265602j348305j409435j439057
2890B28051853j440506j428089j420536j432171j465988j510639j544037j541233j483612
2899B14785042j367245j204929j022434q50239p13406o23627n77774n59978n49374
$$ y = [274855461, 274482708, 274136314, 273807774, 273474369, 273107967, 272687511, 272208061, 271682301, 271134567, 270590858, 270068378, 269570312, 269085236, 268592243, 268068123, 267493496, 266856995, 266156025, 265395145, 264583855, 263734627, 262861977, 261982117, 261111870, 260265808, 259452915, 258672409, 257913094, 257156219, 256381969, 255577068, 254739456, 253877735, 253005733, 252134571, 251267948, 250402584, 249534035, 248663998, 247803135, 246967506, 246169014, 245405178, 244654846, 243883038, 243053589, 242143898, 241154175, 240105839, 239030533, 237954311, 236884823, 235808029, 234694672, 233514252, 232248650, 230900345, 229490910, 228051853, 226611347, 225183258, 223762722, 222330551, 220864563, 219353924, 217809887, 216268654, 214785042, 213417797, 212212868, 211190434, 210340195, 209626789, 209003162, 208425388, 207865410, 207316036]
2908B07316036n28145m87690m31785l74870l36438l34930l79677m67415n81550o97861
2918B02695675p92523q50524q70305q62426q42552q22068q01983p72609p19548o32724
2928A94728413n13878l77331k44980j36413o0883j4248J7223M9401R2239J44978J98021
2939A93882542K37903K54402K45018K15683J77632J41086J11180Q4572N2127M063o3992
2950A95342216j46446k28786k92664l24497l21579k94113k60430k37960k35005k48356
2960A92752380k67105k82135k93598l12862l56560m36306n49679o78482p95078q74253
2970A87906322r01718q77018q07361o98452n47962l46737q7509K24819N67360R02958
2980A85334702J192150J406288J537151J595421J602612J579608J538716J485176J421757
$$ y = [207316036, 206787891, 206300201, 205868416, 205493546, 205157108, 204822178, 204442501, 203975086, 203393536, 202695675, 201903152, 201052628, 200182323, 199319897, 198477345, 197655277, 196853294, 196080685, 195361137, 194728413, 194214535, 193837204, 193592224, 193455811, 193394928, 193380680, 193397903, 193447304, 193539543, 193684521, 193882542, 194120445, 194374847, 194619865, 194835548, 195013180, 195154266, 195265446, 195350018, 195402145, 195406208, 195342216, 195195770, 194966984, 194674320, 194349823, 194028244, 193734131, 193473701, 193235741, 193000736, 192752380, 192485275, 192203140, 191909542, 191596680, 191240120, 190803814, 190254135, 189575653, 188780575, 187906322, 187004604, 186127586, 185320225, 184621773, 184073811, 183727074, 183639565, 183864384, 184431744, 185334702, 186526852, 187933140, 189470291, 191065712, 192668324, 194247932, 195786648, 197271824, 198693581]
2989A98693581J357250J307468J291199J320133J390133J478539J550407J570663J518212
2998B11477585J393223J217212J024437Q49457P15904O31008N86281N64766N49221
3007B19009094N28240M99192M65259M30413L94554L51085K89956K02140Q6403m8733
3017B22207603j86634l08685m01287m60663m92458n06668n12028n12753n09662n04379
3027B17812386n03388n17387n55535o18400o92196p51057p67593p25041o27441m99840
3037B11554508l78742k97489k73781l04203l70922m51489n30281o02703o72626p46441
3047B06925831q26073r07402r83047j046105j093387j125985j146335j156903j159553
3056A97481041j157303j155167j160125j177502j208477j247330j282997j303139j298370
$$ y = [198693581, 200050831, 201358299, 202649498, 203969631, 205359764, 206838303, 208388710, 209959373, 211477585, 212870808, 214088020, 215112457, 215961914, 216677818, 217308826, 217895107, 218459873, 219009094, 219537334, 220036526, 220501785, 220932198, 221326752, 221677837, 221967793, 222169933, 222256336, 222207603, 222020969, 221712284, 221310997, 220850334, 220357876, 219851208, 219339180, 218826427, 218316765, 217812386, 217308998, 216791611, 216236076, 215617676, 214925480, 214174423, 213406830, 212681789, 212054348, 211554508, 211175766, 210878277, 210604496, 210300293, 209929371, 209477882, 208947601, 208344898, 207672272, 206925831, 206099758, 205192356, 204209309, 203163204, 202069817, 200943832, 199797497, 198640594, 197481041, 196323738, 195168571, 194008446, 192830944, 191622467, 190375137, 189092140, 187789001, 186490631]
3065A86490631j265812j208248j133804j052952r78413r23862r03301r26781r96075
3074A77101383j101284j221027j327343j394863j408806j369496j290493j192894j095962
3083A65699215j011963r43508q85468q29677p69615p04518o40688n91297n72462n97744
3093A58152275o71282p83977r12133j024112j090384j093197j034097r31168q11615
3102A49800310p00464o12049n47276m98676m55732m11921l64618l13244k55280j85842
3112A45455208j00346O49J08156K05851K76346L09038L06139K83003K62623K67267
3122A47373934L10154L91950N01242O20298P29990Q16269Q71792Q96950Q97827Q84066
3132A54294472Q65240Q48293Q36048Q26874Q17261Q04491P89356P76405P71752P78885
$$ y = [186490631, 185224819, 184016571, 182882767, 181829815, 180851402, 179927540, 179024239, 178097458, 177101383, 176000099, 174779072, 173451729, 172056866, 170648060, 169278564, 167988071, 166795177, 165699215, 164687252, 163743744, 162858276, 162028599, 161258984, 160554466, 159913778, 159322481, 158750019, 158152275, 157480993, 156697016, 155784883, 154760771, 153670387, 152577190, 151543093, 150611925, 149800310, 149099846, 148487797, 147940521, 147441845, 146986113, 146574192, 146209574, 145896330, 145641050, 145455208, 145354862, 145355511, 145463667, 145669518, 145945864, 146254902, 146561041, 146844044, 147106667, 147373934, 147684088, 148076038, 148577280, 149197578, 149927568, 150743837, 151615629, 152512579, 153410406, 154294472, 155159712, 156008005, 156844053, 157670927, 158488188, 159292679, 160082035, 160858440, 161630192, 162409077]
3142A62409077P96032Q14647Q23365Q11748P75929P19680O52142N83610N21222M66499
3152A69373951M17156L69797L22723K75936K29264J80988J27220O4984m082p2556j29165
3163A71156216j65348j81427j88771k05593k47402l17078m01249m75482n17254n17884
3173A67938728m88853m55818m44660m67015n12771n55878n69248n40695m80309m16451
3183A63007030l79505l86448m31556m90399n33771n42870n17969m76560m42114m32139
3193A58373699m51298m92277n43737n97372o51131p06119p61223q10004q42266q50668
3203A51667604q36639q11872p94354p98178q26959q70476r11856r35964r38883r30720
3213A43011703r29565r52196j003513j073895j142244j185913j191235j159344j105041
$$ y = [162409077, 163205109, 164019756, 164843121, 165654869, 166430798, 167150478, 167802620, 168386230, 168907452, 169373951, 169791107, 170160904, 170483627, 170759563, 170988827, 171169815, 171297035, 171362019, 171357937, 171285381, 171156216, 170990868, 170809441, 170620670, 170415077, 170167675, 169850597, 169449348, 168973866, 168456612, 167938728, 167449875, 166994057, 166549397, 166082382, 165569611, 165013733, 164444485, 163903790, 163423481, 163007030, 162627525, 162241077, 161809521, 161319122, 160785351, 160242481, 159724512, 159247952, 158805838, 158373699, 157922401, 157430124, 156886387, 156289015, 155637884, 154931765, 154170542, 153360538, 152518272, 151667604, 150830965, 150019093, 149224739, 148426561, 147599602, 146729126, 145817270, 144881306, 143942423, 143011703, 142082138, 141129942, 140126429, 139052534, 137910290, 136724377, 135533142, 134373798, 133268757]
3222A33268757j050215j013451j002244j011191j024065j022520r93252r33914q53758
3231A24364147p68871o95849o44178o12783n91488n65577n22842m58212l74870k80400
3241A18849077j82619q4743J3742J14708K16923L14331L98865M66222N21279N79138
3251A21206923O59914P79237R39799J128158J319885J490593J627121J732932J824226
3260A32708788J919947K029628K147236K253132K324362K347040K324801K279605K242871
3269A52577410K243347K294035K386627K493820K578869K610150K572937K475681K347183
3278A74580059K225761K145367K121945K149372K203407K253380K275753K262516K221031
3287A94438591K166271K110844K057571K001133J934643J857796J780300J716881J677780
$$ y = [133268757, 132218542, 131205091, 130202847, 129191656, 128167591, 127145071, 126151819, 125217905, 124364147, 123595276, 122899427, 122255249, 121642466, 121050978, 120485401, 119962559, 119504347, 119129477, 118849077, 118666458, 118581715, 118595457, 118710165, 118927088, 119241419, 119640284, 120106506, 120627785, 121206923, 121866837, 122646074, 123585873, 124714031, 126033916, 127524509, 129151630, 130884562, 132708788, 134628735, 136658363, 138805599, 141058731, 143383093, 145730133, 148054934, 150334539, 152577410, 154820757, 157114792, 159501419, 161995239, 164574108, 167184258, 169757195, 172232876, 174580059, 176805820, 178951187, 181073132, 183222504, 185425911, 187679291, 189955044, 192217560, 194438591, 196604862, 198715706, 200773277, 202774410, 204709053, 206566849, 208347149, 210064030, 211741810]
3296B11741810J660213J646481J611957J538201J423778J286469J154613J051960R85756
3305B24101238R42784Q99620Q36620P51133O60286N91793N68066N92346O46152O97174
3315B31287212P16324O91033O31179N60761N05104M76513M70638M72088M66118M49161
3325B36726131M30184M23546M37317M64840M86278M78859M30489L49369K61535J99433
3335B40687981J85108K20146K83794L44639L75538L65200L20854K61002K04239J59340
3345B43407841J23386Q6575M0340j6956p9212j37063j83181k15531k36339k47708k48489
3356B42293663k32468j92165j23692l0288P7648J86558K85930L72925M52175N31941
3366B43622227O16169O99310P65820P95154P71332O91662N69648M31233L04356K08702
$$ y = [211741810, 213402023, 215048504, 216660461, 218198662, 219622440, 220908909, 222063522, 223115482, 224101238, 225044022, 225943642, 226780262, 227531395, 228191681, 228783474, 229351540, 229943886, 230590038, 231287212, 232003536, 232694569, 233325748, 233886509, 234391613, 234868126, 235338764, 235810852, 236276970, 236726131, 237156315, 237579861, 238017178, 238482018, 238968296, 239447155, 239877644, 240227013, 240488548, 240687981, 240873089, 241093235, 241377029, 241721668, 242097206, 242462406, 242783260, 243044262, 243248501, 243407841, 243531227, 243617802, 243658142, 243641186, 243561974, 243424911, 243241730, 243026199, 242789860, 242542152, 242293663, 242061195, 241869030, 241745338, 241715050, 241792698, 241979256, 242265186, 242638111, 243090286, 243622227, 244238396, 244937706, 245703526, 246498680, 247270012, 247961674, 248531322, 248962555, 249266911, 249475613]
3376B49475613J48830J16329R6684P9307O2161N0907N1861O5956Q6365J02577J09119
3387B50445709J10531J21594J58844K30846L30276M35143N18055N57461N47123M96292
3397B53951874M23698L47195K76565K12098J48792Q3122J7662l8280p2384p5207m4422
3408B55230713J2207P8659J34544J61515J49173J00232K9430l9616q4133r1114o1970
3419B55619640j2054L7651P0343Q0109P3051O1417N4912N4989N4855M4880K0066j5812
3431B56144047m9954o7501n8193k1591L2120Q5983J22490J28860J01338M4937k7275
3442B56435261r8343j51634j75133j63956j22280o0806O523O5937J08376J30195J33877
3453B56108017J25809J13716J04065R9563R9182R9659R8362R6264R8381J10798J36204
$$ y = [249475613, 249624443, 249740772, 249837456, 249916763, 249978924, 250029831, 250081692, 250147648, 250234013, 250336590, 250445709, 250556240, 250677834, 250836678, 251067524, 251397800, 251832943, 252350998, 252908459, 253455582, 253951874, 254375572, 254722767, 254999332, 255211430, 255360222, 255443344, 255461006, 255422726, 255350342, 255275135, 255230713, 255242920, 255321579, 255456123, 255617638, 255766811, 255867043, 255896473, 255856857, 255772724, 255681610, 255619640, 255607586, 255645237, 255715580, 255795689, 255868740, 255930157, 255985069, 256040058, 256094913, 256139793, 256159859, 256144047, 256094093, 256026592, 255968399, 255946808, 255978928, 256064911, 256187401, 256316261, 256417599, 256462536, 256435261, 256336918, 256185284, 256010151, 255846195, 255723915, 255663109, 255669632, 255735569, 255843945, 255974140, 256108017, 256233826, 256347542, 256451607, 256551170, 256650352, 256750011, 256848373, 256944637, 257043018, 257153816, 257290020]
3464B57290020J70135K00654K14099K02256J68037J25370R1553P8659Q5964J01929
3474B58728676J11637J06010Q6804O4239M8695M4346M8523N5809O6051Q4248J16272
3485B59561310J60274K02389K22931K09446J68819J28098J19915J61476K38991L09982
3495B61483631L25718K60220J28326j8749j19896j37806p7572J7929R5577J22891J05114
3506B62185383P8487Q4839J45664K50321L63788M48304M82750M69875M28467L77216
3516B65315094L22285K56385J66131M6062r3002k22607l04909l06453k13585m1409
3526B64923992J64147L40023M29630M09241L05137J87474J39694K15435M04472O28739
3536B68147984P75432P53040N41001K03934j36700l60813m05217k87017q4477J08891
$$ y = [257290020, 257460155, 257660809, 257874908, 258077164, 258245201, 258370571, 258462124, 258540783, 258626747, 258728676, 258840313, 258946323, 259033127, 259097366, 259146061, 259190407, 259238930, 259294739, 259360790, 259445038, 259561310, 259721584, 259923973, 260146904, 260356350, 260525169, 260653267, 260773182, 260934658, 261173649, 261483631, 261809349, 262069569, 262197895, 262179146, 262059250, 261921444, 261843872, 261861801, 261957378, 262080269, 262185383, 262263870, 262348709, 262494373, 262744694, 263108482, 263556786, 264039536, 264509411, 264937878, 265315094, 265637379, 265893764, 266059895, 266105957, 266012955, 265790348, 265485439, 265178986, 264965401, 264923992, 265088139, 265428162, 265857792, 266267033, 266572170, 266759644, 266899338, 267114773, 267519245, 268147984, 268923416, 269676456, 270217457, 270421391, 270284691, 269923878, 269518661, 269231644, 269147167, 269256058]
3546B69256058K30655K69585K55013K29568K25964K61974L49445N00508P19185R79518
3556B73277473J206379J283818J096019N89982j74046j016884j690349j967545j733780
3565B70871067j037769p8030Q68397J544075J799412J636066J194992O96812L58085
3574B77853107L11623N58739R69162J329708J427765J138153M81796l72066j162568
3583B82535419j634902j637669j182442m36764L41263R03054J098938R24072N06019
3592B81416988M2992k74448l29304j06964L15151Q06904J229687J472625J468602J202411
3602B87244644P11537R0198n14297r25084r87472o37512L9215Q01868J325493J335068
3612B88483658P52659k23065j160259j565895j119671J39942J780205L121910L523522
$$ y = [269256058, 269486713, 269756298, 270011311, 270240879, 270466843, 270728817, 271078262, 271578770, 272297955, 273277473, 274483852, 275767670, 276863689, 277453671, 277279625, 276262741, 274572392, 272604847, 270871067, 269833298, 269755268, 270623665, 272167740, 273967152, 275603218, 276798210, 277495022, 277853107, 278164730, 278723469, 279692631, 281022339, 282450104, 283588257, 284070053, 283697987, 282535419, 280900517, 279262848, 278080406, 277643642, 277984905, 278887959, 279986897, 280910969, 281416988, 281459980, 281185532, 280856228, 280749264, 281064415, 281871319, 283101006, 284573631, 286042233, 287244644, 287956181, 288046379, 287532082, 286606998, 285619526, 284982014, 285021229, 285823097, 287148590, 288483658, 289236317, 289013252, 287852993, 286287098, 285167427, 285307369, 287087574, 290209484, 293733006]
3621B93733006K669315P29980j684074l761616m812202m529476l087807j040516R20448
3630B79137058K233219K656308K314186J602192J000709Q75225J333218K183266L006553
3639B96341934L319664K769222J292153q25424l025074m666672n265751m678936l159561
3648B82101555j253109M19960J404438J569176J122379M87804J05248K45094R13639
3657B87116184J875553K771931L272533L199273K576656J598606N35374l77255j021270
3666C01547585j421681j706734k023429k444935k914486l249245l208866k599583j371555
3675B80607071L30925K188396L788052M739304M785804L878956K195072R4872j963787
3684C00644665l534489m290657m102764l066597j474915K62356J725922K592640K712116
$$ y = [293733006, 296402321, 297132301, 295448227, 291686611, 286874409, 282344933, 279257126, 278216610, 279137058, 281370277, 284026585, 286340771, 287942963, 288943672, 289818897, 291152115, 293335381, 296341934, 299661598, 302430820, 303722973, 302897549, 299872475, 295205803, 289940052, 285261116, 282101555, 280848446, 281268406, 282672844, 284242020, 285364399, 285852203, 285957451, 286202545, 287116184, 288991737, 291763668, 295036201, 298235474, 300812130, 302410736, 302946110, 302568855, 301547585, 300125904, 298419170, 296395741, 293950806, 291036320, 287787075, 284578209, 281978626, 280607071, 280937996, 283126392, 286914444, 291653748, 296439552, 300318508, 302513580, 302608452, 300644665, 297110176, 292819519, 288716755, 285650158, 284175243, 284437599, 286163521, 288756161, 291468277]
3693B91468277K136211J097680n3902r47380j293659r78528j14459R73739J840725
3702B94128704K072449J452827P5417j655579l152942l863831l489571k112293j68648
3711B83286533J721154K994060L347607K820358J727238M94537n13286j097279j226101
3720B93554821r65881m07219L59421J207904J927166K224961J821079O07929j211128
3729B99119053l103008m361401m395332l022976o15540K006569L899880M403514L424836
3738B97355595J462097o53725k161827k713356k478199j971436j713562j918182k384529
3747B82822876k645893k275391j166630L76587J789933K548103K438908J663742P11746
3756B86263981Q9416N9243N24349J110191J383286J082611K46849q15640j681041k002812
$$ y = [291468277, 293604488, 294702168, 294648266, 293700886, 292407227, 291428699, 291314240, 292287979, 294128704, 296201153, 297653980, 297729397, 296073818, 292920876, 289057045, 285567474, 283455181, 283286533, 285007687, 288001747, 291349354, 294169712, 295896950, 296391487, 295878201, 294780922, 293554821, 292588940, 292181721, 292541142, 293749046, 295676212, 297901173, 299722252, 300330181, 299119053, 296016045, 291654644, 287259312, 284236336, 283620796, 285627365, 289527245, 293930759, 297355595, 298817692, 298163967, 296002140, 293288784, 290810585, 288839149, 287125587, 285207405, 282822876, 280176983, 277901592, 276734962, 277111549, 278901482, 281449585, 283888493, 285552235, 286263981, 286353397, 286412640, 286936989, 288047180, 289430466, 290513077, 290759926, 289944286, 288263245, 286260433]
3766B86260433j654644p66811L40118J287117J774731J680412J086312K33707n74360
3775B89667015j086883j189499r29375m71706j1540L13110M67167N04017N11360N53608
3785B88327274O45142P63721Q80776R79652J046219J044121R04694N53913l2654p81975
3795B94330883j527290k071495k282429k158585j818714j417484j038532o39286r3022
3804B81284046O95000J670837K598667L146801L051949K264461R89056m09279j575298
3813B93716240k311840k620716k627545k453231k124863j585064p85103K15721J223946
3822B80647545J988087K331752K250252J905613J513805J200467R21955N08575j96533
3831B93071518j191502k267437l092556l381252l042030k207527j131688k3346J064702
$$ y = [286260433, 284605789, 283838978, 284179096, 285466213, 287240944, 288921356, 290007668, 290241375, 289667015, 288580132, 287390633, 286461258, 285989552, 285978012, 286291122, 286758289, 287262306, 287773666, 288327274, 288972416, 289736137, 290616913, 291596565, 292642784, 293686905, 294591599, 295145512, 295112858, 294330883, 292803593, 290732098, 288449669, 286291084, 284472370, 283054886, 282016354, 281377068, 281284046, 281979046, 283649883, 286248550, 289395351, 292447300, 294711761, 295700817, 295291538, 293716240, 291404400, 288783684, 286156139, 283702908, 281578045, 279992981, 279207878, 279423599, 280647545, 282635632, 284967384, 287217636, 289123249, 290637054, 291837521, 292759476, 293268051, 293071518, 291880016, 289612579, 286520023, 283138771, 280096741, 277889214, 276757526, 276734180, 277798882]
3840B77798882K208824L461151M673347N433598N196228L566475N95608l091202o438866
3849B93404045q347130q127517n817280k188740J556873M272690N305195M690285L040313
3858B87788734J199074j52340p49893p62768n99727o32496r90334j519813j905041
3867B81675396j864243j306266l71838O43501J430970J791152J686802J218758N58472
3876B85462704j17894o68239r98497j066837q91762n58319k03266K9773N6019r7065
3886B80946617k87266l16581l4924N64861J314507J920624K085075J636314O10886
3895B88440113p49321k084331l043690l399868l106308k285957j166993q01J005841
3904B73608685J726074K112789K176762J961021J523418R33037K74449l50457q35075
$$ y = [277798882, 280007706, 283468857, 288142204, 293575802, 298772030, 302338505, 302934113, 299842911, 293404045, 285056915, 276929398, 271112118, 268923378, 270480251, 274752941, 280058136, 284748421, 287788734, 288987808, 288835468, 288085575, 287322807, 286723080, 286090584, 285100250, 283580437, 281675396, 279811153, 278504887, 278133049, 278776550, 280207520, 281998672, 283685474, 284904232, 285462704, 285344810, 284676571, 283678074, 282611237, 281719475, 281161156, 280957890, 280987663, 281043682, 280946617, 280659351, 280342770, 280307846, 280872707, 282187214, 284107838, 286192913, 287829227, 288440113, 287690792, 285606461, 282562771, 279162903, 276056595, 273770638, 272603645, 272602844, 273608685, 275334759, 277447548, 279624310, 281585331, 283108749, 284041786, 284316235, 283965778, 283130703]
3913B83130703j093502j091366q64162n08919j47762J19781K53334K75765K42481J97773
3923B80514126J43223M3621j35746l84617o27594p49436o55250l29838J37520N84431
3933B78540440Q47301Q35342N69344J65081k25143m80137n52178m69417l06492j44005
3943B78780136l7174m482l2044q5811j26057j22471o6051K4280J08433J43375J06640
3954B78688774R899j06754j98803k43282k50206k47326k53849k60067k33498j48964
3964B76755924j8234J04580J52893R5139l7194j63917k10305j61666p7992n2051j36662
3975B76250515k98481m34322m48151l31249j81523j37958k68784n01709o61678o04420
3985B72382240l57284j44387k48203p76024j499519j926403j629334o73599J36643
$$ y = [283130703, 282037201, 280945835, 280081673, 279572754, 279424992, 279544773, 279798107, 280073872, 280316353, 280514126, 280657349, 280700970, 280565224, 280180607, 279553013, 278803577, 278148327, 277818489, 277956009, 278540440, 279387741, 280223083, 280792427, 280957508, 280732365, 280252228, 279700050, 279230633, 278924141, 278780136, 278742962, 278738480, 278706436, 278620625, 278494568, 278372097, 278306046, 278330326, 278438759, 278582134, 278688774, 278698673, 278591919, 278393116, 278149834, 277899628, 277652302, 277398453, 277138386, 276904888, 276755924, 276737690, 276842270, 276995163, 277090302, 277053108, 276889191, 276678886, 276517220, 276439228, 276387177, 276250515, 275952034, 275517712, 275069561, 274738312, 274556789, 274418831, 274150047, 273648338, 272986660, 272382240, 272024956, 271880569, 271632366, 270856342, 269356823, 267430420, 265801086, 265127487, 265264130]
3994B65264130n73826m150543j1125164k0663300l0598545l8133183
4000A60019569
$$ y = [265264130, 264690304, 260539761, 249414597, 228751297, 198152752, 160019569]
##END=$$ End of the data block
