##TITLE=$$ Begin of the data block
##JCAMP-DX=5.00 $$ ACD/SpecManager v 10.08
##SPECTROMETER/DATA SYSTEM=16PC
##DATE=Wed Sep 04 12:24:02 2013
##DATA TYPE=INFRARED SPECTRUM
##DATA CLASS=XYDATA
##ORIGIN=
##OWNER=
##NPOINTS=3601
##FIRSTX=400.00000000
##LASTX=4000.00000000
##MAXX=4000.00000000
##MINX=400.00000000
##MAXY=441.30432129
##MINY=5.05049229
##XFACTOR=1.0000000000
##YFACTOR=0.000001000000000
##FIRSTY=89.67390442
##DELTAX=1.00000000
##XUNITS=1/CM
##YUNITS=TRANSMITTANCE
##XYDATA=(X++(Y..Y))
400H9673904R368180J2624572k7204299l2610512j5659859n597088N787659J4899490
408E1282047K3870327K7767327L7111152J4751755o9745613n7492092O7738727Q2152253
416A77435883L704803j5634369L070908p893479m7395057n2249741l8510109n149937
424A7378902Q4501103Q2735367j4151993m3634110m5564224k3056103M2547802P9731049
432A80487793J30100433R8745087l2746796r5817321j52741379j22977325L8535953
439D3586445P1012066k483345j3426659J0518051J1483093K086907j0276581l7862465
447G4637512l9044311j6939545p04956K1821236L1148407J2208656M4764137J79055702
455C06946838J34357483j27238128j73374726m7482818q196976M380798R292816p634689
$$ y = [89673904, 99042084, 111666656, 84462357, 51851845, 36191986, 30594898, 36382557, 51282047, 75152374, 102919701, 140030853, 154782608, 85036995, 27544903, 95283630, 177435883, 181140686, 165506317, 168577225, 160683746, 113288689, 61038948, 22528839, 17378902, 101880005, 184615372, 170463379, 126829269, 81265045, 58208942, 100756744, 180487793, 310588226, 409333313, 376586517, 280769196, 128027817, 5050492, 43586445, 114598511, 112115166, 98688507, 109206558, 120689651, 122776558, 112499977, 74637512, 35593201, 18653656, 17948700, 39769936, 70918343, 83126999, 127891136, 306946838, 441304321, 314066193, 140691467, 93208649, 85011673, 89392471, 98685287, 91050598]
463I1050598q749290J161361L595208K572082N14534o140686n563332L140137M565239
472H6145851N88036q91465k253128j877647J038742J661423M49821M00574J145790
481H6407997J160164R97810l2592l304123k633286K697754L633881J430130J21452
490I0479187k207642j930236J383064K387741K256248J642991k83120q52302l82920
499I2493011k71301J49590l91960k642395k344277O32118J510285J190544Q47961j09054
509I1064522m89327m79820n24116n09263m43618k89276j89805r4917o2225r6581j21124
520H7764450k79015p4409O74217P44652J28464Q1299M55932N85411O63399N82169M41383
531I1767952m9873j307869j376824j85180K4795m70611n34249m78126j91498P05772
$$ y = [91050598, 82301308, 83462669, 87057877, 89629959, 90144493, 84003807, 78440475, 81580612, 86145851, 86733887, 85842422, 83589294, 81711647, 82750389, 84411812, 84861633, 85262207, 86407997, 87568161, 88565971, 88533379, 85229256, 82595970, 85293724, 88927605, 90357735, 90479187, 88271545, 86341309, 87724373, 90112114, 92368362, 94011353, 93728233, 92875931, 92493011, 92221710, 92371300, 91979340, 89336945, 86992668, 87624786, 89135071, 90325615, 91173576, 91064522, 90575195, 90095375, 89571259, 89061996, 88618378, 88329102, 88139297, 88044380, 87982155, 87885574, 87764450, 87485435, 87411026, 88085243, 88829895, 88958359, 89039658, 89495590, 90081001, 90744400, 91326569, 91767952, 91718079, 90410210, 89033386, 88848206, 88873001, 88402390, 87868141, 87390015, 87198517, 87904289]
541H7904289N82100p32094r27017k62855q919J11557K60780M36066M85611M65660L02696
552H8617874K213l84278j184944j138756k31842K19155O87744N96214k15294n29739
562H6438347o88744n42953O1584L59467O06628N44739P4341j48483k65198l66165m82964
573H5590599l99277q8524J26404M01932M35043K29523P3097k06016k08519J45271J37253
584H6236786k94563j84060M90281O76155O45279L62922m73495o19156k04773M7516
594H6682892N77309L48182r26491j063751k44743P1914K21276L21434L45253K82905
604H6616180Q4328m0672j19522k52365n14008n05417k98744m669N82550P50206N83343
615H6881210M54499K04536R7153J22123N6572j31530r1103J81030L21007M88976M08149
$$ y = [87904289, 88486389, 87754295, 86827278, 86564423, 86555504, 86667061, 86927841, 87363907, 87849518, 88315178, 88617874, 88620087, 88235809, 87050865, 85912109, 85680267, 85899422, 86587166, 87183380, 86968086, 86438347, 85749603, 85206650, 85268234, 85627701, 86234329, 86779068, 86853409, 86704926, 86439728, 86073563, 85590599, 85191322, 85102798, 85229202, 85631134, 86066177, 86295700, 86368797, 86162781, 85954262, 86099533, 86236786, 85942223, 85758163, 86248444, 86924599, 87569878, 87932800, 87459305, 86840149, 86635376, 86682892, 87260201, 87608383, 86681892, 85618141, 85373398, 85445312, 85666588, 85988022, 86333275, 86616180, 86700508, 86659836, 86540314, 86287949, 85773941, 85268524, 84969780, 84965111, 85547661, 86297867, 86881210, 87335709, 87540245, 87637398, 87759521, 87816093, 87684563, 87593460, 87774490, 88095497, 88584473, 88992622]
626H8992622m2724j02143J55091K66701M11293L36601r1965q3969L72223M39285L70644
637I1023659j0231j150460j085258K22465O59394P68211M91356n76546p56569k65335
647H9320686Q4587P67975O98059k94250m46060Q8409J62888o7932p6767Q5350R4917
658I0417862K9282r7634m19807m15398r3155N9990J67084K22610K07833K02865J45867
669I0427399K03895M53636M21311J10267j9500j63605J22O46065P54356M43344K59278
680I3536568p0999j076O62781N99243k06948l73748o9710k838n9586J3596J81915L30612
692I4539810O11641N31624L3020j60690j90430k16126k19154j14464J86798K44095
702I5246124P4600M9950J07956J25404J88096P6004l51021l12500K17514L54530K31171
$$ y = [88992622, 88949898, 88847755, 89002846, 89269547, 89680840, 90017441, 89925476, 89841507, 90213730, 90653015, 91023659, 91013428, 89862968, 88777710, 89000175, 89659569, 90427780, 90919136, 90342590, 89586021, 89320686, 89405273, 90173248, 90871307, 90577057, 90130997, 90219406, 90382294, 90314362, 90237595, 90322945, 90417862, 90447144, 90349510, 89929703, 89514305, 89421150, 89481140, 89648224, 89870834, 90078667, 90281532, 90427399, 90631294, 91084930, 91506241, 91616508, 91597008, 91433403, 91433525, 92079590, 92833946, 93277290, 93536568, 93465569, 93464493, 94127274, 94726517, 94519569, 94145821, 94076111, 94073273, 94013687, 94027283, 94209198, 94539810, 95151451, 95683075, 95716095, 95555405, 95364975, 95148849, 94929695, 94815231, 95002029, 95246124, 95320724, 95370674, 95478630, 95604034, 95792130, 95868134, 95517113, 95204613, 95422127, 95776657, 96007828]
713I6007828K01385J65276J68182K70485J85181j78200j70876K29081K85118M0489
723I7203949N8502L13217L45009K23618J29791j9096p3525p1335j0803J72806K18727
734I8490860J98051Q6884k41379k56706N4550J07651m0558l2806J25290R8892j94573
745I8396156r0095N32196N27527q1948k40440j36475p1884M3946J50177L65211K76352
756I9670723j53687l63281n67695m67560N6503K27310J62575J68510J86257J44790
766I9064445J5519j6136K3025N4459J12243J38405J35903J50650K20901J47797j61125
777I9886086j37352K35557L23242K80815J22139l89907l20603M34113N23163Q3992
787A01041245q2184j90468j81938r232P9018K03628J29723k59873k61596J14990K04330
$$ y = [96007828, 96209213, 96374489, 96542671, 96813156, 96998337, 96820137, 96649261, 96878342, 97163460, 97203949, 97262451, 97575668, 97920677, 98144295, 98274086, 98254990, 98181465, 98110130, 98099327, 98272133, 98490860, 98688911, 98775795, 98534416, 98277710, 98332260, 98439911, 98399353, 98366547, 98491837, 98590729, 98396156, 98306061, 98838257, 99365784, 99283836, 99043396, 98906921, 98835037, 98878983, 99029160, 99394371, 99670723, 99517036, 99153755, 98586060, 98118500, 98175003, 98402313, 98564888, 98733398, 98919655, 99064445, 99079964, 99063828, 99086853, 99141312, 99253555, 99391960, 99527863, 99678513, 99899414, 100047211, 99886086, 99748734, 99984291, 100307533, 100588348, 100710487, 100320580, 99999977, 100434090, 100957253, 101041245, 100959061, 100768593, 100586655, 100577423, 100656441, 100860069, 100989792, 100729919, 100468323, 100583313, 100787643]
798A00787643J9402J73759Q50205P03903l84613n92903j21399R102L6789K9426j2642
809A01498672j58615n62881n38994j35330J55044O34339N86532r7038k65762j12534
819A01003433j6502J36879K68364N05569M17107p6004k26547j37352j44577j61263
829A01569107j99181l24768k60597P4959P7843k58774l03650j35140p1311j6327l5553
840A00116608j63720j96739j74576j41784p3883k4582k556Q0299K78283K86056R4101
851A00077507M5639Q4709R1690J02974R2560N0804M2252K3506J03546L89618L43513
862A01448318p7484j64505J9020J7647j43219j10100J30104J71448N3215K3888M3869
873A01412201K2797k9450o2416o3942j33255k89490l57032l56553l81111m51568l91602
$$ y = [100787643, 100807045, 100980804, 101831009, 102534912, 102150299, 101557396, 101435997, 101445099, 101481888, 101511314, 101498672, 101340057, 100777176, 100238182, 100102852, 100257896, 100892235, 101478767, 101381729, 101115967, 101003433, 100986931, 101123810, 101392174, 101897743, 102314850, 102238846, 102012299, 101874947, 101730370, 101569107, 101369926, 101045158, 100784561, 100859520, 100937363, 100678589, 100374939, 100239799, 100168488, 100152161, 100116608, 99952888, 99756149, 99581573, 99439789, 99365906, 99341324, 99338768, 99419067, 99697350, 99983406, 100077507, 100123146, 100207855, 100299545, 100402519, 100495079, 100545883, 100588135, 100611641, 100715187, 101104805, 101448318, 101370834, 101206329, 101225349, 101242996, 101099777, 100989677, 101119781, 101291229, 101344444, 101368332, 101412201, 101434998, 101405548, 101343132, 101279190, 101145935, 100856445, 100499413, 100142860, 99761749, 99310181, 98918579]
884I8918579j80740p7561L0114m8111m13659m70710l18528j56211K09167K04773k04941
895I7492172l05061k50649j36375J92474K11556p8324j56379r8351j22207j78650k46956
906I6323250m20525l46802L8033J26099j5908m6989m768q0063l05222l60252k86339
917I4620514k38846j32919j52802k96287l88146n50102m70711p2502K3201r7633j57692
928I2086075k68913k61139j02379r0973j81778k57134l69209m27131m32374m69993
938H9225052n32791n64621o02776n54367m18762k91702j06835l4027r1522l6575P8392
949H6069466K20253M62623N43976M83894M65538M33182M26552M19167M76905O68007
959I0669563O53595M60297L20244J20781Q0131K21512K33650J93268J04714q2833j70631
$$ y = [98918579, 98737839, 98660278, 98690392, 98642281, 98228622, 97757912, 97439384, 97283173, 97492340, 97697113, 97492172, 97187111, 96936462, 96800087, 96992561, 97204117, 97125793, 96969414, 96871063, 96748856, 96570206, 96323250, 95902725, 95555923, 95593956, 95720055, 95704147, 95657158, 95652390, 95572327, 95267105, 94906853, 94620514, 94381668, 94248749, 94095947, 93799660, 93411514, 92861412, 92390701, 92318199, 92341400, 92243767, 92086075, 91817162, 91556023, 91453644, 91362671, 91180893, 90923759, 90554550, 90127419, 89695045, 89225052, 88692261, 88127640, 87524864, 86970497, 86551735, 86260033, 86153198, 86119171, 86027649, 85991074, 86069466, 86289719, 86752342, 87296318, 87780212, 88245750, 88678932, 89105484, 89524651, 90001556, 90669563, 91323158, 91783455, 92103699, 92224480, 92304611, 92526123, 92759773, 92953041, 93057755, 92974922, 92804291]
970I2804291k00699k03850j23237j55739k82601l82179m99535n76423o33934o46210
980H9099884n50201o23986r00077r70604q47199q91251j100517j122642r94683r20944
990H0177780q19275q14010r23348r50477r43947r06487q10440p63771p53494p23725
1000G1768806o53144o83167q36059q81554q73688q26835o68427o74461q43430r05613
1010F3922428r21463r19128q89611q41022p09961p42245j008106r81117o21723o14643
1020E5673409r52412r80450q09570o51268l94844k71748k41733k34391l02074l06084
1030E0528835k77542k30980j46126q9645j0467m6208k11616l10257m30298m15539k06448
1041D8153709j97456l62064m11988l96610m07028m16969m40739n19371m74766k66765
$$ y = [92804291, 92603592, 92399742, 92276505, 92120766, 91838165, 91455986, 90956451, 90380028, 89746094, 89099884, 88549683, 87925697, 87025620, 86055016, 85207817, 84316566, 83216049, 82093407, 81098724, 80177780, 79358505, 78544495, 77621147, 76670670, 75726723, 74820236, 74009796, 73246025, 72492531, 71768806, 71115662, 70432495, 69596436, 68714882, 67841194, 67014359, 66345932, 65671471, 64828041, 63922428, 63000965, 62081837, 61192226, 60351204, 59641243, 58898998, 57890892, 56909775, 56288052, 55673409, 54720997, 53740547, 52930977, 52279709, 51884865, 51613117, 51371384, 51136993, 50834919, 50528835, 50251293, 50020313, 49874187, 49784542, 49774075, 49727867, 49516251, 49205994, 48775696, 48360157, 48153709, 47956253, 47594189, 47182201, 46785591, 46378563, 45961594, 45520855, 45001484, 44526718, 44259953]
1051D4259953k34341l56148l78921l63228l20103k09331j81054k41424k15721j15300
1061D1644382o9759p2052k0981R8397J24786O0654N7125J03809R0931J7193k670k1485
1073D2010330N7053K77260L65471L68141L73031L26706L54958M72996M93930M03336
1083D5503212M45698O54938O50928M61723L55149K29168K24113L93223L82973K37274
1093D9538399J33896j5713l5477J32252Q0467k10811k54681q2348n6076j19518j35876
1104D8974514j51039j18229j7048K3914K8511K9877K1050l334r2057m5036J77765K15912
1116D9044800Q8333P9395J35754J86180K52655L18405L94417M53472N14439N28740
1126E1996590M54998N07328P06077P55646O97136O61564N75420O01677Q22899P45537
$$ y = [44259953, 44025612, 43669464, 43290543, 42927315, 42607212, 42397881, 42216827, 41975403, 41759682, 41644382, 41574623, 41502571, 41481590, 41579987, 41704773, 41765427, 41822552, 41926361, 42017292, 42034485, 42031815, 42010330, 42067383, 42344643, 42710114, 43078255, 43451286, 43777992, 44132950, 44605946, 45099876, 45503212, 45948910, 46603848, 47254776, 47716499, 48071648, 48300816, 48524929, 48918152, 49301125, 49538399, 49672295, 49656582, 49621105, 49753357, 49833824, 49623013, 49368332, 49285984, 49229908, 49110390, 48974514, 48823475, 48705246, 48688198, 48712112, 48740623, 48770500, 48791550, 48788216, 48696159, 48651123, 48828888, 49044800, 49133133, 49212528, 49348282, 49534462, 49787117, 50105522, 50499939, 50953411, 51467850, 51996590, 52451588, 52958916, 53664993, 54420639, 55117775, 55779339, 56354759, 56956436, 57779335, 58524872]
1136E8524872L33118K25018L46901L56434L56960K77260J00063l4359k10331k30812
1146F0045124m2915n5291k81692k58755k0717J05999J76288K97020M72405N78521N96787
1157F1612774P25365R69242J110008J192757J255203J269005J309562J373650J398445
1166G2216011J397255J379509J355103J274963J105141J030380J033203R98527R72199
1175H2762291Q85460P24869O12732N12741M47891M46777L71857K35489J25793j4404
1185H7111496m4868N4977O2347J9936k0577j12037r4742N7266Q0223Q85k4131m3053
1197H7047722j9837M7036J15234K22466K59925K25235K36534K73156K99331L39104
1207H9045906L31925K71179K43736K25136K26120K46498K76115L32093L55812L50715
$$ y = [58524872, 58857990, 59083008, 59429909, 59786343, 60143303, 60420563, 60520626, 60486267, 60275936, 60045124, 60002209, 59946918, 59665226, 59406471, 59385754, 59491753, 59668041, 59965061, 60437466, 61015987, 61612774, 62338139, 63307381, 64417389, 65610146, 66865349, 68134354, 69443916, 70817566, 72216011, 73613266, 74992775, 76347878, 77622841, 78727982, 79758362, 80791565, 81790092, 82762291, 83647751, 84372620, 84985352, 85498093, 85945984, 86392761, 86764618, 87000107, 87125900, 87111496, 87066628, 87121605, 87183952, 87203888, 87183311, 87071274, 86976532, 87033798, 87114021, 87114906, 87090775, 87047722, 87027885, 87074921, 87190155, 87412621, 87672546, 87897781, 88134315, 88407471, 88706802, 89045906, 89377831, 89649010, 89892746, 90117882, 90344002, 90590500, 90866615, 91198708, 91554520, 91905235]
1217I1905235L61466L90365L83522L54813L02315K16789J36902K9587j1612P492J6495
1228I4093369N4931L4859o3851p3097m699K0271K8725L3714K9159K6223J9050J9623
1240I4218277M9019J0612j46057j22711R7939J48155R0980M1939o9473p6943K1553
1251I4263290N1308P6294J5091j96716k20375o4469l3401p0427r8107j67541j51917
1262I3403030m9713O104O5590O1157m9210k9991J38924J41456L51n9555j11816q7265
1274I3429062O5857P1091l9483j17851k35504k54753j70448j40900r8114j56044l86833
1285I1966080l88260j86135p9635L8673L8002j05903j65299k04963j93650q9622r1141
1296I0538147j88568k22565k40036k13074r0820j04690k69745k94350j91071k01271
$$ y = [91905235, 92266701, 92657066, 93040588, 93395401, 93697716, 93914505, 94051407, 94080994, 94069382, 94076874, 94093369, 94148300, 94183159, 94119308, 94046211, 94041512, 94061783, 94090508, 94124222, 94153381, 94179604, 94198654, 94218277, 94267296, 94277908, 94131851, 94009140, 94107079, 94255234, 94346214, 94388153, 94318680, 94241737, 94263290, 94314598, 94390892, 94405983, 94209267, 93988892, 93924423, 93891022, 93820595, 93722488, 93554947, 93403030, 93353317, 93359421, 93425011, 93486168, 93436958, 93406967, 93545891, 93687347, 93687698, 93628143, 93516327, 93429062, 93494919, 93566010, 93526527, 93408676, 93173172, 92918419, 92747971, 92607071, 92508957, 92352913, 91966080, 91577820, 91391685, 91312050, 91350723, 91388725, 91282822, 91117523, 90912560, 90718910, 90629288, 90538147, 90349579, 90127014, 89886978, 89673904, 89583084, 89478394, 89208649, 88914299, 88723228, 88521957]
1306H8521957l32328l13691j56143q7044o5635k7916K8343K9923m3725l7315M5036
1317H7561462O4232L2685L9772N4123J11457K71225K59713Q1749q416q6929j03638
1328H8277435m4540j6090J4732K1957O180r087m5295m0077k0653N9395K63305K91352
1340H8758614J49917J13106J43860J16180L2570R033K2744M8927J19804J30890J05339
1351H9750984N4932n5557r7252o4965j08482k18559k82402l38013l46489k70630k98523
1362H7725044m35188m72595m50630m17832l41743l03604l08518k54822j46171o9641
1372H4524300L959M4937J2017J00067L36883M16039L71216L73817L73535L99926M72946
1383H7429642M83131M26369M28169N01877M68536L37914K49977J47301J19369K08023
$$ y = [88521957, 88189629, 87875938, 87719795, 87632751, 87567116, 87539200, 87567543, 87597466, 87553741, 87516426, 87561462, 87625694, 87658379, 87698151, 87752274, 87863731, 88134956, 88394669, 88476418, 88468002, 88381073, 88277435, 88232895, 88216805, 88231537, 88253494, 88259674, 88250587, 88205292, 88165215, 88144562, 88203957, 88467262, 88758614, 88908531, 89021637, 89165497, 89281677, 89314247, 89323280, 89346024, 89394951, 89514755, 89645645, 89750984, 89805916, 89750359, 89653107, 89588142, 89479660, 89261101, 88978699, 88640686, 88294197, 88023567, 87725044, 87289856, 86817261, 86366631, 85948799, 85607056, 85303452, 84994934, 84740112, 84593941, 84524300, 84528259, 84573196, 84585213, 84685280, 85022163, 85438202, 85809418, 86183235, 86556770, 86956696, 87429642, 87912773, 88339142, 88767311, 89269188, 89737724, 90075638, 90325615, 90472916, 90592285, 90800308]
1393I0800308J56525o0104q5213R7442O5918j76902k20635j13724p2715l0281l9200
1404I0321419j31485j26503k9640r2j2184r850r796j571M1389K403j90422j33110J89331
1417H9909889L12783L54522L09494R4895M6920J26122J54037J68229J96769K47788
1427I1921448K60566K69059J97838m746n6763N341M5296J47438J10649p9987j63917
1438I2652222k01744k11693j72188j51512j12465j35658k40830k68814k54867k17415
1448I0685036j26915q3229n6504o6688j83197j08650K13386K59514L8010L9047K04162
1459I0813972K77138L12042L48832M01062L74275K36198K10282L01483K66479L9917
1469I3581680J26427N89157O70982M28727L92196M61792N05951N86792N87113N12596
$$ y = [90800308, 90956833, 90896729, 90811516, 90908958, 90974876, 90797974, 90577339, 90463615, 90390900, 90360619, 90321419, 90189934, 90063431, 90033791, 90033699, 90021515, 90011665, 90001869, 90000298, 90041687, 90044090, 89853668, 89720558, 89909889, 90222672, 90577194, 90886688, 90981583, 91028503, 91154625, 91308662, 91476891, 91673660, 91921448, 92182014, 92451073, 92648911, 92644165, 92587402, 92592743, 92638039, 92785477, 92896126, 92816139, 92652222, 92450478, 92238785, 92066597, 91915085, 91802620, 91666962, 91426132, 91157318, 90902451, 90685036, 90558121, 90474892, 90418388, 90351700, 90168503, 90059853, 90273239, 90532753, 90570763, 90609810, 90813972, 91091110, 91403152, 91751984, 92153046, 92527321, 92763519, 92973801, 93275284, 93541763, 93581680, 93708107, 94297264, 94968246, 95396973, 95789169, 96250961, 96756912, 97343704, 97930817, 98443413]
1479I8443413M57527L71956L61107M42695M40361L94036L20244J80313J12342P4196
1489A01598190R6009K18277K48550K36465J75881j816j5999J33713J65054J38184R4818
1500A03087326R186n7465j69563j30867R5962J65207J16509J36925K37609J86516m2061
1511A03635284j13388p9422o7398l8696k0836r918N676Q797N6267J80908J94412J21971
1523A03873657N0995j05972q6640J61240J66176l6949j16516j87424j21979J81534
1533A03778122J88446q0322j73806k32765j45294K02866K42805l189n5748j2802L8101
1544A03746414J74072J74164M0627j4687m3014n1255j7410k3002o7711p1648n4909
1555A03791641j7090N6359J06643J83777J46340l6049j00640j00349q6357m5227K0294
$$ y = [98443413, 98900940, 99272896, 99634003, 100076698, 100517059, 100911095, 101231339, 101411652, 101523994, 101598190, 101694199, 101912476, 102161026, 102397491, 102573372, 102571556, 102555557, 102689270, 102854324, 102992508, 103087326, 103096512, 103039047, 102869484, 102738617, 102834579, 102999786, 103116295, 103253220, 103490829, 103677345, 103635284, 103521896, 103442474, 103375076, 103336380, 103315544, 103305626, 103311302, 103320099, 103376366, 103557274, 103751686, 103873657, 103924652, 103818680, 103732040, 103893280, 104059456, 104022507, 103905991, 103718567, 103596588, 103778122, 103966568, 103886246, 103712440, 103479675, 103334381, 103537247, 103780052, 103776863, 103721115, 103708313, 103746414, 103920486, 104094650, 104135277, 104120590, 104077576, 104026321, 104008911, 103985909, 103918198, 103846550, 103791641, 103774551, 103830910, 103937553, 104121330, 104267670, 104231621, 104130981, 104030632, 103944275, 103899048, 103919342]
1566A03919342J68228J68961N1147p0267l29780l04360L1182J52992J86707J53610
1576A04127762k6154n4451N1972O1729J8334k1080r6390j05210m1893l1517o9908m8919
1588A03764275O0386L3737j47888j84250j28601o8145O5231Q6357J5686m3655j50177
1599A03302956j73088j04218j07384j82625j66351o0768k0836j8860j0658J2657k8869
1610A02441956j49201k12913k84478k41447l0922J2871o5232j10405j83326j96335
1620A00980568j69228j10771M3175M4495j20430j49056p5531o6139o2416j32088l67615
1631I9814964l31619K792R0622M746j625J3710K8610P3051M9141o2515q6494o3469
1643I9531914o226J62316J46652n7671j37565k10648j19591K13127L19695K89154K32933
$$ y = [103919342, 104087570, 104256531, 104307678, 104237411, 103907631, 103603271, 103634453, 103787445, 103974152, 104127762, 104101608, 104047157, 104099129, 104160858, 104179192, 104158112, 104061722, 103956512, 103914619, 103883102, 103813194, 103764275, 103824661, 103858398, 103710510, 103526260, 103397659, 103329514, 103394745, 103481102, 103496788, 103453133, 103302956, 103129868, 103025650, 102918266, 102735641, 102569290, 102508522, 102487686, 102468826, 102458168, 102470825, 102441956, 102292755, 102079842, 101795364, 101553917, 101522995, 101535866, 101470634, 101360229, 101176903, 100980568, 100811340, 100700569, 100743744, 100788239, 100667809, 100518753, 100443222, 100377083, 100314667, 100182579, 99814964, 99483345, 99486137, 99576759, 99581505, 99579880, 99593590, 99622200, 99695251, 99744392, 99681877, 99595383, 99531914, 99525688, 99688004, 99834656, 99776985, 99639420, 99428772, 99309181, 99522308, 99842003, 100131157, 100364090]
1654A00364090O1035K1813J01707J06552M7234P4196K10929K12738R4674M0939k8297
1665A01307610K1789K40257K95967K47765J91139L5240M7852K57019K82784J67228
1675A03094650J21735J03256P2342N0232q797j77170j19613K07069K94754K27120J77475
1686A04043053N8700M5731J57493J43219R08j1017Q8006J17324J42311Q2016j34086
1697A04733658j43051L9817J12626J70997J34346l9818j01181j16012o9863Q3710J44364
1708A04949593J58287J40907P3502J5304p1495r4894o9260k9091N3001J01830J57593
1719A05385277J34712K289l0808J7044J0163m5182l8528L8193M2061n867m7112j42959
1731A05319283j06881R9419J36185K4200J9837J06498R4086j2283m3198k6344k0577
$$ y = [100364090, 100425125, 100446938, 100548645, 100655197, 100702431, 100776627, 100987556, 101200294, 101294968, 101335907, 101307610, 101329399, 101569656, 101865623, 102113388, 102304527, 102339767, 102387619, 102644638, 102927422, 103094650, 103216385, 103319641, 103391983, 103442215, 103433418, 103256248, 103136635, 103343704, 103638458, 103865578, 104043053, 104101753, 104147484, 104304977, 104448196, 104449104, 104438087, 104526093, 104643417, 104785728, 104867744, 104733658, 104590607, 104630424, 104743050, 104914047, 105048393, 105008575, 104907394, 104791382, 104721519, 104805229, 104949593, 105107880, 105248787, 105322289, 105337593, 105266098, 105171204, 105101944, 105072853, 105125854, 105227684, 105385277, 105519989, 105522278, 105491470, 105508514, 105518677, 105473495, 105434967, 105473160, 105515221, 105509354, 105462242, 105319283, 105212402, 105311821, 105448006, 105472206, 105492043, 105598541, 105692627, 105680344, 105637146, 105610802, 105590225]
1742A05590225p889j411M410K90j9051k3506k4895o080M3586O4064P4524N8152K502
1755A05754921k6222o2256l4996Q7044J07147M8324J5023l9482l2830N4718O1539J5732
1767A05948662l3737j47744j31965L2402P5722L6499L0181K6207L1281M8393N8724
1778A05974625Q5594N4481n8510q3374m2778j6449L2357L6094p888k1462l7910k381
1790A05912399J39473J15135q9500j45721j20766p4387M5159R0362Q4664Q1611O6994
1801A06105423M3991J785j9813k5986l5858m5395n1926p2883m1298N9128R6084J03302
1813A06116554P8011j2039l5233l36m058l3951m3175n6122k2316Q7662J05698N1826
1825A06232521J3809n8799n2094N3192O5689J0491k1485o3705p3311n8914k8992M5776
$$ y = [105590225, 105582336, 105580925, 105585335, 105585625, 105566574, 105543068, 105518173, 105512093, 105555679, 105619743, 105694267, 105752419, 105754921, 105728699, 105666443, 105631447, 105718491, 105825638, 105873962, 105888985, 105849503, 105816673, 105871391, 105932930, 105948662, 105914925, 105767181, 105635216, 105667618, 105743340, 105779839, 105810020, 105836227, 105867508, 105915901, 105974625, 106060219, 106114700, 106056190, 105972816, 105930038, 105913589, 105945946, 105982040, 105974152, 105952690, 105914780, 105912399, 106051872, 106167007, 106077507, 105931786, 105811020, 105736633, 105781792, 105872154, 105956818, 106038429, 106105423, 106149414, 106151199, 106131386, 106105400, 106069542, 106024147, 105972221, 105899338, 105858040, 105917168, 106013252, 106116554, 106194565, 106182526, 106147293, 106146957, 106142899, 106108948, 106065773, 106009651, 105987335, 106074997, 106180695, 106232521, 106246330, 106187531, 106135437, 106188629, 106254318, 106264809, 106243324, 106179619, 106106308, 106047394, 106018402, 106064178]
1837A06064178N6313L006o798K1530K121q2542p6622K7321M3274j5473j6189J4160
1849A06034279N0667J42379J17997n2048p8560J7830L0189r010k2987k7443l6385n9028
1861A06107880m4678K6840K4033o1035o5346j6121L2211J33660J26358o913l5644J7525
1873A06238770J2542l9169m3610j2733P080K7847M7638Q2184P0335M906k4460l0182
1885A06341148n2620j16394q2710P2052J14555R1988M8851p1503q6975P485R300p0282
1897A06204895p3936j7716N104K5177J3107n4138n5313K14K8396N0255O5399R7824
1909A06289268N1644j08292j45767r8450n2093N2170O4468j7715l4760j7738k220L8406
1921A06018921L3119l4019k8397N1285O4987L7674R323m7180o3568l9025m5013q7456
$$ y = [106064178, 106120491, 106123497, 106116699, 106138229, 106140350, 106057808, 105981186, 106008507, 106051781, 106036308, 106020119, 106034279, 106084946, 106227325, 106345322, 106293274, 106214714, 106232544, 106262733, 106253723, 106230736, 106203293, 106166908, 106107880, 106063202, 106090042, 106114075, 106053040, 105987694, 105971573, 106003784, 106137444, 106263802, 106256889, 106221245, 106238770, 106251312, 106212143, 106168533, 106155800, 106162880, 106190727, 106238365, 106320549, 106390884, 106395790, 106371330, 106341148, 106288528, 106172134, 106089424, 106161476, 106276031, 106368019, 106416870, 106345367, 106258392, 106265877, 106275177, 106204895, 106130959, 106113243, 106118347, 106143524, 106156631, 106102493, 106047180, 106047394, 106075790, 106126045, 106191444, 106289268, 106340912, 106232620, 106086853, 105988403, 105936310, 105988480, 106052948, 106035233, 106000473, 105982735, 105980515, 106018921, 106052040, 106018021, 105989624, 106040909, 106105896, 106143570, 106152893, 106105713, 106042145, 106003120, 105958107, 105870651]
1933A05870651p1426J335M2580R4345P6645l5546o2370k9396j4404K365J9546N4222
1945A05948547L9193m9927m8660N3070N0376n5114o5354R056J2375m7111m7203R865
1957A05809113J0612l8078n0514m9668k9419L0518M2846O676J2535O3683N6366n890
1969A05858780l3714m5227n7557o6680p1816r1576n2307Q0750R4627J267l4378o5018
1981A05517151m4731P3433N5435j08627j45218j06072n8082L9962Q9882J20285J14914
1992A05548332O6689K0004o0867p7606k8473j8906m1794k0408P4508M9141j31966j33422
2004A05245232M3823O8115k3552m7569n2429k8061O4949N8838n0659p8660o1988l8170
2016A05099869L6979K4102q9264j13983q2070n4764m219J9051K2575K6680K5132K2483
$$ y = [105870651, 105799225, 105800560, 105843140, 105937485, 106014130, 105978584, 105916214, 105886818, 105872414, 105874779, 105894325, 105948547, 105987740, 105937813, 105889153, 105942223, 105992599, 105937485, 105872131, 105881187, 105893562, 105846451, 105799248, 105809113, 105819725, 105781647, 105731133, 105681465, 105652046, 105682564, 105725410, 105732086, 105744621, 105808304, 105864670, 105858780, 105825066, 105779839, 105722282, 105655602, 105583786, 105492210, 105439903, 105520653, 105615280, 105616547, 105582169, 105517151, 105472420, 105545853, 105601288, 105492661, 105347443, 105241371, 105183289, 105223251, 105313133, 105433418, 105548332, 105615021, 105635025, 105574158, 105496552, 105468079, 105449173, 105407379, 105386971, 105461479, 105510620, 105378654, 105245232, 105289055, 105357170, 105333618, 105286049, 105233620, 105205559, 105270508, 105329346, 105278687, 105200027, 105138039, 105099869, 105136848, 105160950, 105071686, 104957703, 104875633, 104820869, 104816650, 104835701, 104858276, 104884956, 104910088, 104932571]
2028A04932571J2276J5785M2702L2852j6334l4684l8795l2616n172L242K220o370l8742
2041A04868935l1830K4368K6772l0060k1439O0852N9265k1980m2129k1096k0271k4178
2053A04827209l3348o6375m8760L5599M7798n836j1635K5314J1398p7224n1949J21689
2065A04773880J16920n2284j15349j54899j11267M9591J31485K20535J68205q3137
2075A04943680j54450j04042p7820k3155m814k7962p248P6294O1463n9227r4765r9640
2087A04428314m7180J21445J43982L7765m455l6408l6194j716L6644J16302J17951
2098A04876450M6485J603n9510o5590J4733j5427j85058j81511j9692M7089Q9577P7934
2110A04627083j2016n3689r0866p5149L578N6389J29646J26702M3724p676q3564p1411
$$ y = [104932571, 104944847, 104960632, 105003334, 105036186, 105019852, 104985168, 104946373, 104913757, 104908585, 104911827, 104914047, 104907677, 104868935, 104837105, 104861473, 104888245, 104858185, 104836746, 104897598, 104956863, 104934883, 104892754, 104871658, 104851387, 104827209, 104793861, 104727486, 104678726, 104714325, 104762123, 104756287, 104744652, 104769966, 104781364, 104704140, 104652191, 104773880, 104890800, 104838516, 104723167, 104568268, 104457001, 104506592, 104638077, 104858612, 105026817, 104943680, 104789230, 104685188, 104607368, 104584213, 104579399, 104551437, 104544189, 104620483, 104681946, 104622719, 104527954, 104428314, 104381134, 104502579, 104646561, 104684326, 104679871, 104643463, 104607269, 104605553, 104642197, 104758499, 104876450, 104922935, 104924538, 104865028, 104799438, 104814171, 104798744, 104613686, 104432175, 104412483, 104459572, 104549149, 104627083, 104615067, 104561378, 104470512, 104395363, 104398941, 104455330, 104584976, 104711678, 104755402, 104747726, 104664162, 104592751]
2122A04592751O1874P1381k8656n0263l7117k769R3910J01761K9823p057m7089n2521
2134A04726028j3824p179k3125k3537k0546l845M1062M5967J3801P86j6022j190O1775
2147A04780151P1259M7256J1086q4015p2334O2202Q9478M1526K0081j7548k578Q8241
2159A05034805R2789L1876j5824r6893j03760m0253J290P0572O0753n6961o0868N4077
2171A04971603M5960q5091r7870j9477J7166N5839N4283K411j7425l7484j1131R3796
2183A04972580J01822K0843n340p080o989J3542K411n4100m9042J9051L7170K7749
2195A05072617J3710l2113k4345L9574O4041Q9172M9759j02447j09200K5345N9410
2206A05145523L4050K6703K2621L082n9608l6171J12152J00952q0757j04851p415K7603
$$ y = [104592751, 104654625, 104726006, 104697350, 104647087, 104609970, 104607201, 104701111, 104802872, 104832695, 104825638, 104778549, 104726028, 104712204, 104705025, 104681900, 104658363, 104637817, 104633972, 104675034, 104721001, 104734802, 104735588, 104719566, 104718376, 104780151, 104851410, 104898666, 104909752, 104825737, 104753403, 104815605, 104905083, 104946609, 104966690, 104949142, 104946564, 105034805, 105127594, 105159470, 105143646, 105046753, 104942993, 104902740, 104904030, 104974602, 105035355, 104978394, 104917526, 104971603, 105017563, 104932472, 104834602, 104815125, 104832291, 104888130, 104942413, 104944824, 104927399, 104889915, 104878784, 104972580, 105074402, 105095245, 105089905, 105082825, 105075836, 105089378, 105091789, 105037689, 104988647, 105007698, 105044868, 105072617, 105086327, 105054214, 105029869, 105069443, 105133484, 105222656, 105272415, 105169968, 105060768, 105086113, 105145523, 105179573, 105206276, 105228897, 105231979, 105172371, 105136200, 105248352, 105349304, 105268547, 105163696, 105156281, 105183884]
2218A05183884O6475K8106j39618j47125j9096N3596J50444J44051Q034k4964J526
2229A05305313K8900J05637R6397k311m1413n4985n5855l2646j8211J694K525k3201
2241A05311844k1217O843J2993J762K915J9424R323m4845l1685N8792P5172L4310K0057
2254A05455688J2230P630J9119j907p1862p6744m936j7143j30699j15631K5741P2624
2266A05174110O1417O6879Q7998N3932o4514p9872J0559Q323q5380p7004K1027O4613
2278A05242088J07788P8392o4827q4732J1445J5449m3320p4249j17203j03332k0790
2289A04946709J4068L1922K6062j1925m1817q5953r5436p2189n7800l7430k8969l0014
2301A04557228l2425m1534m4441m1153m4816m7164o8398j38451j17446L8024J4191
$$ y = [105183884, 105250359, 105278465, 105138847, 104991722, 104972626, 105026222, 105176666, 105320717, 105328751, 105303787, 105305313, 105334213, 105439850, 105536247, 105533936, 105492523, 105437538, 105381683, 105349037, 105330826, 105332520, 105335045, 105311844, 105290627, 105297470, 105310463, 105312225, 105315140, 105334564, 105343887, 105299042, 105267357, 105326149, 105401321, 105435631, 105455688, 105467918, 105475548, 105494667, 105492760, 105420898, 105344154, 105339218, 105322075, 105191376, 105075745, 105101486, 105174110, 105235527, 105302406, 105390404, 105444336, 105379822, 105299950, 105310509, 105318832, 105233452, 105156448, 105177475, 105242088, 105349876, 105428268, 105363441, 105278709, 105290154, 105305603, 105262283, 105188034, 105070831, 104967499, 104946709, 104960777, 104992699, 105018761, 105006836, 104965019, 104879066, 104783630, 104711441, 104653641, 104616211, 104587242, 104557228, 104524803, 104483269, 104438828, 104397675, 104352859, 104305695, 104237297, 104098846, 103981400, 104019424, 104033615]
2312A04033615k00485k46239j66992j46843j52634j33155q8479o9618j11534k3437
2322A02694199K98004K48550k01874l29010k98362j72570K37137K38228j45653l16642
2332A02252007m99444l93363J36016K50130M5441k5559q6738r5269j04332N5695N04799
2343A02039383N93185M04671K53410M7234j59287m36546n57777n49584n32531n30457
2353A00571701l27537J84608L56583L34114J83609k81311l81829j94191r2338J9668
2363A00373077J31676K48505L60969N38086N12696K33551J72546K69791K92686L07205
2373A03440788K81998J92047J68633K23068J78695M197J281J69800K08481J79382J35186
2384A05183556M3914j9386r7107r4795K36M2511P9972O6162k2843m4967l5385M318
$$ y = [104033615, 103833130, 103586891, 103419899, 103273056, 103120422, 102987267, 102898788, 102829170, 102717636, 102694199, 102992203, 103240753, 103038879, 102709869, 102411507, 102238937, 102476074, 102714302, 102568649, 102252007, 101752563, 101359200, 101495216, 101745346, 101790787, 101765228, 101678490, 101583221, 101478889, 101534584, 102039383, 102632568, 103037239, 103290649, 103337883, 103178596, 102742050, 102184273, 101634689, 101102158, 100571701, 100244164, 100428772, 100785355, 101119469, 101303078, 101021767, 100639938, 100445747, 100353409, 100373077, 100504753, 100753258, 101114227, 101652313, 102165009, 102398560, 102571106, 102840897, 103133583, 103440788, 103722786, 103914833, 104083466, 104306534, 104485229, 104489426, 104490707, 104660507, 104868988, 105048370, 105183556, 105227470, 105208084, 105110977, 105016182, 105016418, 105058929, 105138901, 105205063, 105182220, 105137253, 105101868, 105106186]
2396A05106186J29394J20133l1876p3356n3460k9014M2320M7920o813l0853n6557m5776
2408A05118248J9096K9160j3397q751L5263M9949O7589K7710r2506j41358j61148j34567
2420A04795288m9896K8465J65749J65245R445l4981q583j5831m5204l8452J6159J3115
2432A05000519m7447o0631n6908j9623Q8356J01639L0327p10l1929k6725L5957L4996
2444A05047821k3315m2962m6257m0245q819r583m9812m2862J9882J7098n3650o1554
2456A04705742j9936o462j4587O889O1318Q4114R9159P5294n272m0527o3614m4319
2468A04837799M7180O1157J3161r468l1586m1061k8511m3510j05523q7310J8425N4931
2480A04685684N8274M0725k5589m1412j8425r422J3397q461j12435r0599P4669J04927
$$ y = [105106186, 105235580, 105355713, 105323837, 105250481, 105197021, 105168007, 105210327, 105258247, 105251434, 105220581, 105164024, 105118248, 105137344, 105166504, 105153107, 105144356, 105179619, 105229568, 105297157, 105324867, 105232361, 105091003, 104929855, 104795288, 104745392, 104773857, 104939606, 105104851, 105114296, 105079315, 105070732, 105054901, 105009697, 104971245, 104987404, 105000519, 104953072, 104892441, 104835533, 104815910, 104904266, 105005905, 105036232, 105035522, 105003593, 104976868, 105012825, 105047821, 105024506, 104981544, 104935287, 104895042, 104886223, 104876640, 104826828, 104783966, 104803848, 104820946, 104767296, 104705742, 104685806, 104679344, 104664757, 104671646, 104732964, 104817078, 104916237, 104991531, 104986259, 104945732, 104882118, 104837799, 104884979, 104946136, 104959297, 104949829, 104918243, 104877182, 104848671, 104805161, 104699638, 104612328, 104630753, 104685684, 104743958, 104784683, 104759094, 104717682, 104699257, 104689835, 104703232, 104694771, 104582336, 104491737, 104566406, 104671333]
2492A04671333L3692N241k3147k4842J0224J4953J0132k0363j09100j10008l5645J7883
2504A04440353J01166J07926L4286K075k7656k1004N5382L4118r7847j21162p0000
2515A04437637k7397N4886O6666N432q652L502N272M791O104O599J2405L1991K5062
2528A04624298j8410j8402M1939J4847j25885j27670o18M2869N7717L6285n9387p0000
2540A04397583m196J3260M692N226K594J0612M4823K9106n7861n4833M0146N7694K5108
2553A04513954K388l5721m8538l9909l5218l4523j2397M4349N7289L6736J9913m219
2565A04464104k8923p4601o6444J0895K1072k3079l6812m3220l4668L006N310k0668
2577A04175972l8742p6744n9845J6258N9296J17347R0127o4995p7439M2511O5354L2608
$$ y = [104671333, 104705025, 104710266, 104687119, 104662277, 104672501, 104687454, 104697586, 104677223, 104568123, 104458115, 104422470, 104440353, 104541519, 104649445, 104683731, 104685806, 104658150, 104637146, 104692528, 104726646, 104628799, 104507637, 104437637, 104410240, 104465126, 104531792, 104537224, 104528572, 104532074, 104537346, 104542137, 104548241, 104554840, 104567245, 104599236, 104624298, 104605888, 104587486, 104629425, 104644272, 104518387, 104390717, 104390099, 104432968, 104490685, 104526970, 104467583, 104397583, 104393387, 104406647, 104411339, 104416565, 104419159, 104429771, 104474594, 104503700, 104445839, 104391006, 104431152, 104488846, 104513954, 104516342, 104480621, 104432083, 104392174, 104356956, 104322433, 104310036, 104354385, 104411674, 104448410, 104468323, 104464104, 104435181, 104360580, 104294136, 104305031, 104326103, 104303024, 104266212, 104222992, 104188324, 104191330, 104196640, 104175972, 104137230, 104060486, 104000641, 104016899, 104076195, 104193542, 104283669, 104218674, 104141235, 104183746, 104249100, 104281708]
2589A04281708P469m8309m5082L8169K7512q2176r6512m1016q011L8460M6707J4138
2601A04133057K838p63m769q224o844P18M501K2987p866j11557j30127q5571m8042
2614A03760338K4437L3859l2402k6016L6003P3387J29250J11145N386m0978o5475o5109
2626A03943825j6953j5831m7806p4096j32202j11107k312M8904Q9432P6836j0079m4067
2638A03704544n9006m6730J6167K7679J786j5663m4274n1498n3147j8638P5172J04759
2650A03641151J08406N6199j03592j34209n3116k7489j8333j4427k5604k4056r682
2661A03395248j0780k9991k8465n791k487k3766q156N9655N6793j0040m5060q9149
2673A03258011p4837J9097L9985J9020j5922j02448j18446q3687m1367M2252P5295
$$ y = [104281708, 104289177, 104240868, 104195786, 104233955, 104261467, 104179291, 104082779, 104041763, 104033752, 104072212, 104118919, 104133057, 104135895, 104135132, 104130363, 104122139, 104115295, 104116013, 104120514, 104143501, 104135635, 104024078, 103893951, 103808380, 103760338, 103784775, 103818634, 103786232, 103760216, 103796219, 103869606, 103998856, 104110001, 104115387, 104074409, 104008934, 103943825, 103926872, 103911041, 103863235, 103789139, 103656937, 103545830, 103543518, 103592422, 103681854, 103758690, 103748611, 103704544, 103645538, 103598808, 103614975, 103642654, 103644440, 103628777, 103584503, 103533005, 103479858, 103461220, 103536392, 103641151, 103749557, 103805756, 103702164, 103567955, 103514839, 103487350, 103469017, 103454590, 103428986, 103404930, 103395248, 103384468, 103354477, 103326012, 103320221, 103317734, 103293968, 103285812, 103345467, 103402260, 103392220, 103347160, 103258011, 103183174, 103202271, 103242256, 103261276, 103245354, 103142906, 103024460, 102940773, 102899406, 102941658, 103016953]
2684A03016953Q0795N8342j8242m3892m1748k4483L3097M2625K548P248P1816M1435
2696A03226494j18828j14365O3752Q5067k4841l7987L0495J2993r4673j08383n0599
2707A02869125j5663M2465L3829n5763p9727o7307m8157k388J9982M2007K1126o9282
2719A02690247q0567k8152R99M5418L7979l6812n0140j7594n867R324k549n4458o4224
2732A02443604m5159k6489J5427J5068m3488l1067O1035O8497J6907l1761j29151j30699
2744A02182724k6947l05l5790j1299R4460P4058q6975j23718q2062m3465M6921N0926
2756A02038528l3477o0273p0304m6380M0131N7579K9297o531r0408r8869l7171q110
2768A01714012L0495J2497r1171r8374k9587J4664R1194P3143p0000q9332O576L083
$$ y = [103016953, 103097748, 103156090, 103137848, 103093956, 103052208, 103027725, 103060822, 103103447, 103105995, 103113243, 103185059, 103226494, 103107666, 102993301, 103057053, 103142120, 103117279, 103079292, 103109787, 103122780, 103028107, 102919724, 102869125, 102853462, 102895927, 102929756, 102873993, 102794266, 102726959, 102678802, 102676414, 102696396, 102738403, 102759529, 102690247, 102609680, 102581528, 102582527, 102627945, 102665924, 102629112, 102578972, 102561378, 102555511, 102564835, 102562286, 102507828, 102443604, 102398445, 102371956, 102387383, 102402451, 102358963, 102327896, 102388931, 102457428, 102474335, 102442574, 102313423, 102182724, 102155777, 102155472, 102119682, 102108383, 102202843, 102276901, 102189926, 102066208, 101984146, 101940681, 101987602, 102038528, 102005051, 101944778, 101874474, 101828094, 101868225, 101925804, 101955101, 101948570, 101858162, 101759293, 101722122, 101714012, 101744507, 101757004, 101665833, 101567459, 101537872, 101552536, 101643730, 101716873, 101646873, 101557541, 101564117, 101567200]
2780A01567200q0757j06980j03828r6558p2456n7411m1985l8147l8414o1081j30867
2791A00738716j30653n5626m2244n6267r8442j90430k45163l17527k75086m6944m9186
2802I9231148k65267l45535l68858l69622l17977k99027l02765k84340k36511k33292
2812I6207954k82119k79312k42493k04872j28556j31942k30217k44568j87660j87806
2822I4088409k43614k32414j50482j35452j70304j85440k03537k03728j92070j65412
2832I2205956j17829p6340k7755K052P843L6194R0668J10412J11557R0073K0317Q942
2844I2462090N8242N2216N028k4247m9186p4669j04859j18255j01929j29242k02774
2855I1772415k39181k56638k66098k69554k48291j80290j72425k10502k44400k99599
$$ y = [101567200, 101486443, 101379463, 101275635, 101179077, 101106621, 101049210, 101007225, 100969078, 100930664, 100869583, 100738716, 100608063, 100552437, 100510193, 100453926, 100355484, 100165054, 99919891, 99602364, 99327278, 99280334, 99231148, 98965881, 98620346, 98251488, 97881866, 97563889, 97264862, 96962097, 96677757, 96441246, 96207954, 95925835, 95646523, 95404030, 95199158, 95070602, 94938660, 94708443, 94463875, 94276215, 94088409, 93844795, 93612381, 93461899, 93326447, 93156143, 92970703, 92767166, 92563438, 92371368, 92205956, 92088127, 92011787, 91984032, 91986084, 91993927, 92030121, 92120789, 92231201, 92342758, 92432831, 92453148, 92462090, 92520332, 92572548, 92577576, 92553329, 92504143, 92429474, 92324615, 92206360, 92104431, 91975189, 91772415, 91533234, 91276596, 91010498, 90740944, 90492653, 90312363, 90139938, 89929436, 89685036, 89385437]
2865H9385437l24585l25508l29567l42300l14331k16935k14485l17215l20122k50557
2875H6429832k04444j36300j32179k12959k09351j34521j05423q9317j00564j62620
2885H4942154j67420j18591j09794j29342j30630j28288j10367n8457n8204j17180
2895H3813881j19591q4709n1331P676K2461q797r041K3674M250q2253r1293l0449j4137
2908H3380341k0836k2339l0922k6016P438j1635j08505j01349J7807L5126l8582l3020
2920H3047508N4383M2846o3392j00686j20452q0635O5780Q8547q652j0559O7635P1266
2932H3053589p561J7143J17112K19253L93723M32899L35762L13996L26683L25775L18268
2943H5846642L24127L46992L52074L54217L28736K69127K25944J61034J76163K97073
$$ y = [89385437, 89060852, 88735344, 88405777, 88063477, 87749146, 87532211, 87317726, 87000511, 86680389, 86429832, 86225388, 86089088, 85956909, 85743950, 85534599, 85400078, 85294655, 85205338, 85104774, 84942154, 84774734, 84656143, 84546349, 84417007, 84286377, 84158089, 84047722, 83989265, 83931061, 83813881, 83694290, 83609581, 83558250, 83565926, 83588387, 83579590, 83570549, 83594223, 83598473, 83516220, 83424927, 83394478, 83380341, 83359505, 83337166, 83306244, 83280228, 83287666, 83276031, 83167526, 83066177, 83083984, 83119110, 83080528, 83047508, 83101891, 83144737, 83081345, 82980659, 82860207, 82779572, 82845352, 82933899, 82925247, 82914688, 82982323, 83053589, 83046028, 83063171, 83180283, 83399536, 83793259, 84226158, 84561920, 84875916, 85202599, 85528374, 85846642, 86170769, 86517761, 86869835, 87224052, 87552788, 87821915, 88047859, 88208893, 88385056, 88682129]
2953H8682129L19099K86385K26906Q0253N9746J58020J91002K20444J83365M9781K480
2964I0459610m837L0136J52062J79954J41525J06858J8264L6072J70975K19795K31316
2975I1741730K13310J10413J36138L12920L37441K31712K10884K31407K52129L01719
2985I4079803L06534K45980K76016M19021M29390L23319K81525K63145K50816K38945
2995I7114494K67144L73558L65776K48436J95312J54259J60004K47497K42096J68175
3005I9536751J02447j9615j6670J21712J72569J93687J76720Q6830P1457J28647J18568
3016A00673103O0013J7426n2811m0749Q8074Q5877m7158o4109N844L2493N5840M5967
3028A00859810q537l2380m6562m2434j671o363p2693n3909O3560P8705K9800l5621
$$ y = [88682129, 89001228, 89287613, 89514519, 89594772, 89654518, 89812538, 90003540, 90223984, 90407349, 90457130, 90459610, 90454773, 90484909, 90636971, 90816925, 90958450, 91065308, 91083572, 91119644, 91290619, 91510414, 91741730, 91955040, 92065453, 92201591, 92514511, 92851952, 93083664, 93294548, 93525955, 93778084, 94079803, 94386337, 94632317, 94908333, 95327354, 95756744, 96080063, 96361588, 96624733, 96875549, 97114494, 97381638, 97755196, 98120972, 98369408, 98564720, 98718979, 98878983, 99126480, 99368576, 99536751, 99639198, 99619583, 99602913, 99724625, 99897194, 100090881, 100267601, 100354431, 100425888, 100554535, 100673103, 100733116, 100750542, 100697731, 100656982, 100745056, 100830933, 100783775, 100719666, 100725510, 100758003, 100813843, 100859810, 100851273, 100818893, 100772331, 100729897, 100728226, 100721863, 100649170, 100595261, 100658821, 100737526, 100767326, 100731705]
3040A00731705j90018j91406l6453J9218K2797M0863P3387N3924k8251o4034p7278
3051A00354454q1894n8510p0907j27861j30844j03089n0476P9628Q2497n2498p8514
3062I9761986m0245n890R3506N0140j80717k12502o7093m3678r9419j06621j01806
3073I9047661o6925M1244L1548j14487j32133n1094j7502K4460k427j42364j41357
3084I8476624p843L7529N8097K1035j11153j55830j35712j42830j77101j47034l9406
3095I7676376J236J1185j0468j09649j01685L4188L0113r6894j47079j78650j58813
3106I6949860n4352l0899o2683q7334j33583j49231j47652j27670p5363m7974j6166
3117I6016953m0268j53756j62651q0940m6989o462l8437j86943j97075o9596n6388
$$ y = [100731705, 100541687, 100350281, 100313828, 100333046, 100355843, 100396706, 100470093, 100524017, 100495766, 100431732, 100354454, 100272560, 100214050, 100143143, 100015282, 99884438, 99781349, 99730873, 99810501, 99892998, 99840500, 99761986, 99721741, 99715851, 99809357, 99859497, 99678780, 99466278, 99399185, 99355507, 99256088, 99149467, 99047661, 98980736, 99021980, 99053528, 98939041, 98806908, 98755814, 98738312, 98762772, 98760345, 98617981, 98476624, 98468781, 98506310, 98564407, 98585442, 98474289, 98318459, 98182747, 98039917, 97862816, 97715782, 97676376, 97677612, 97688797, 97678329, 97568680, 97466995, 97501183, 97531296, 97434402, 97287323, 97108673, 96949860, 96895508, 96864609, 96801926, 96714592, 96581009, 96431778, 96284126, 96156456, 96081093, 96033119, 96016953, 95976685, 95822929, 95660278, 95579338, 95532349, 95525887, 95487450, 95300507, 95103432, 95033836, 94977448]
3128I4977448j28075j50322j67084j37070k0935j7448j34728j41769n7671l6979m1245
3139I3944122o9999j53283j71707j36039j22933j14822j05591r3514r1812r3559j13678
3150I2677185j71539j74973j19049j15822j64695j56167q6639q0086j23359j45073
3160I1339783j80176j60622n5649n6526j61415j86729j68106j46797j00518p7194m7714
3171H9998337q0727k12761k29126j41144j18469j33774j26861j10459r4032n9891o9404
3182H8621689j22238j58715k04513k16606k05612j72356r5268n9822n1186m3488l1570
3193H7260315o2271j62888j77742j12274j00395j04073j41548k65549k47283n9823
3203H5826469l9718j66893j85158j32660j13129r1667j04309j60026j86898k08137
$$ y = [94977448, 94849373, 94699051, 94531967, 94394897, 94373962, 94356514, 94221786, 94080017, 94022346, 93985367, 93944122, 93874123, 93720840, 93549133, 93413094, 93290161, 93175339, 93069748, 92976234, 92884422, 92790863, 92677185, 92505646, 92330673, 92211624, 92095802, 91931107, 91774940, 91688301, 91608215, 91484856, 91339783, 91159607, 90998985, 90943336, 90886810, 90725395, 90538666, 90370560, 90223763, 90123245, 90046051, 89998337, 89917610, 89704849, 89475723, 89334579, 89216110, 89082336, 88955475, 88845016, 88750984, 88691093, 88621689, 88499451, 88340736, 88136223, 87919617, 87714005, 87541649, 87446381, 87386559, 87335373, 87291885, 87260315, 87198044, 87035156, 86857414, 86745140, 86644745, 86540672, 86399124, 86133575, 85886292, 85826469, 85786751, 85619858, 85434700, 85302040, 85188911, 85097244, 84992935, 84832909, 84646011, 84437874]
3213H4437874k02851j57119j47461j63170j70563k01233j62529k4696L36o1585j01929
3224H3045074j72874j74263r5123p9705j02638j21307j54930j69510j75881j64962
3234H1633881j25534j11695j07452j22978j78269j83174j45439j24619r6443r8755
3244H0339523j49482j39382o7711m6920n2765p0046j17035j35856j20064j53450k81784
3255G9005028k38442J6686N6267o5445j38306k53006k56973j48033q7548j3397j3016
3266G7863815r9662j33202j55090j39977n6457n5794j41831j48254r1881p1647o0967
3277G6709053o7520r9846j16447j28075j33156j28174j28937j31797j35826j64681
3287G5474594j24832J2611L8216j2375p2334k15241k13958o7902o699M9378J0986j67770
$$ y = [84437874, 84235023, 84077904, 83930443, 83767273, 83596710, 83395477, 83232948, 83208252, 83208588, 83147003, 83045074, 82872200, 82697937, 82602814, 82523109, 82420471, 82299164, 82144234, 81974724, 81798843, 81633881, 81508347, 81396652, 81289200, 81166222, 80987953, 80804779, 80659340, 80534721, 80438278, 80339523, 80190041, 80050659, 79982948, 79936028, 79883263, 79813217, 79696182, 79560326, 79440262, 79286812, 79005028, 78766586, 78783272, 78839539, 78774094, 78635788, 78382782, 78125809, 77977776, 77890228, 77876831, 77863815, 77764153, 77630951, 77475861, 77335884, 77279427, 77223633, 77081802, 76933548, 76841667, 76770020, 76709053, 76641533, 76541687, 76425240, 76297165, 76164009, 76035835, 75906898, 75775101, 75639275, 75474594, 75349762, 75362373, 75400589, 75388214, 75315880, 75100639, 74886681, 74818779, 74812080, 74861458, 74872444, 74704674]
3299G4704674k13913j61835j47087j53152j10512P011K5101k2644r6588k70249k89100
3310G3271706j65612j04492l9505l1044r2552j10085j17538r3414q09q919j23161j52710
3322G2231865j20163j26122j57836j66054j66825j45385q9028o3614m7653o1416j36620
3333G0951149j26381k6848p40j7258l7033q1680j04256j15707j19232j16661r7534
3344G0107819m5250l7079p4387p4531l5950m7592j04569j37497j79931j67153q3786
3355F9120094n6076p1808n4000N050k434p9437j06552j11031j03324o3019o1608j07528
3367F8308327r5887j1184k0386j26862j50489j27098r3682o767l387r4223r9778k6916
3379F7451668k7680r5680j04523p8102m7447K9015J5762j01524j30196j02737q2062
$$ y = [74704674, 74490761, 74328926, 74181839, 74028687, 73918175, 73925186, 73950287, 73927643, 73831055, 73560806, 73271706, 73106094, 73001602, 72962097, 72931053, 72838501, 72728416, 72610878, 72517464, 72516655, 72507736, 72384575, 72231865, 72111702, 71985580, 71827744, 71661690, 71494865, 71349480, 71260452, 71196838, 71149185, 71087769, 70951149, 70824768, 70797920, 70797180, 70779922, 70742889, 70661209, 70556953, 70441246, 70322014, 70205353, 70107819, 70062569, 70025490, 69951103, 69876572, 69840622, 69793030, 69688461, 69550964, 69371033, 69203880, 69120094, 69064018, 68992210, 68938210, 68943260, 68940826, 68861389, 68754837, 68643806, 68540482, 68477463, 68415855, 68308327, 68212440, 68201256, 68180870, 68054008, 67903519, 67776421, 67682739, 67675972, 67672585, 67578362, 67478584, 67451668, 67423988, 67328308, 67223785, 67145683, 67098236, 67127251, 67143013, 67041489, 66911293, 66808556, 66726494]
3390F6726494l6957k9488o0104o5285o2965m5158K937J4015J930k1644p4456r7351
3402F6251968j07360r5559n1117k6489j6182R941O5232O6108K4796k4170j19331j41144
3414F5836693j12869o1295O4087Q7807J4518Q62L1258J1063n8487q7906j02135r1247
3426F5532349m1314j8150l883m174m2221j9599P8727R3987L5782K4391M5059L6453
3438F5717407M555j3420m6013j6617J05568J20621M3892J3756l792j1277p705N272
3450F5912247L0807N7572J05117J06430M6303N2475J29372J31363O2088N2643R0644
3461F6777061R4323P2715P1312P0664J03073K04201J98768P3578N6534J22612J43936
3472F7988777J43265J57120J93687J83464R8610J19881K49313K97905L23174K83722
$$ y = [66726494, 66689537, 66660049, 66599945, 66534660, 66471695, 66426537, 66429474, 66443489, 66445419, 66423775, 66349319, 66251968, 66144608, 66049049, 65997932, 65971443, 65955261, 65965202, 66030434, 66096542, 66121338, 66097168, 65977837, 65836693, 65723824, 65662529, 65726616, 65814423, 65828941, 65829803, 65861061, 65872124, 65813637, 65725731, 65623596, 65532349, 65491035, 65472885, 65469002, 65464828, 65422607, 65403008, 65481735, 65575722, 65611504, 65635895, 65680954, 65717407, 65721962, 65708542, 65662529, 65645912, 65751480, 65872101, 65915993, 65929749, 65925957, 65914680, 65906975, 65912247, 65943054, 66000626, 66105743, 66212173, 66258476, 66310951, 66440323, 66571686, 66633774, 66686417, 66777061, 66871384, 66944099, 67015411, 67086075, 67189148, 67393349, 67592117, 67665695, 67722229, 67844841, 67988777, 68132042, 68289162, 68482849, 68666313, 68764923, 68884804, 69134117, 69432022, 69755196, 70038918]
3482G0038918J23024J08284K34367K54440J93787J97792K50458K70271K78282K71797
3492G2221420K36588K32025K66052K47597J53732J66992K98760L20671K55180K40731
3502G4639748K48695K54921K59041K86438L60489L62037K91062K66739K67318K60544
3512G7497032K57851K45544K15531K13882K29340K60780L43033L37623K27646K18819
3522H0047081K95975L13804K97356K91679K95525K68700J89758J84601K58804K63931
3532H2707214K13532K01744J99562K28806L13423L35556L21861K83508J75255J66702
3542H5147163K61765K74803K18147K28096L00316L15758L03627K66243J73973J43005
3552H7632896J61026J60767J51657J62911K11380K00347J12557J13701J70448K50221
$$ y = [70038918, 70161942, 70270226, 70504593, 70759033, 70952820, 71150612, 71401070, 71671341, 71949623, 72221420, 72458008, 72690033, 72956085, 73203682, 73357414, 73524406, 73823166, 74143837, 74399017, 74639748, 74888443, 75143364, 75402405, 75688843, 76049332, 76411369, 76702431, 76969170, 77236488, 77497032, 77754883, 78000427, 78215958, 78429840, 78659180, 78919960, 79262993, 79600616, 79828262, 80047081, 80343056, 80656860, 80954216, 81245895, 81541420, 81810120, 81999878, 82184479, 82443283, 82707214, 82920746, 83122490, 83322052, 83550858, 83864281, 84199837, 84521698, 84805206, 84980461, 85147163, 85408928, 85683731, 85901878, 86129974, 86430290, 86746048, 87049675, 87315918, 87489891, 87632896, 87793922, 87954689, 88106346, 88269257, 88480637, 88680984, 88793541, 88907242, 89077690, 89327911]
3562H9327911M23096M41094L14308K50221J96770J54709J04667J23161K32247K67029
3572I1835213K63618K42233J75713J52206J66443J51253R9159J07048J66916K13669
3582I3573471K91016K89177K15393J50512L0281L0732J44882K24327L46306L50235
3592I5646332K32178J68464R3170R3651J91643K12501J86135J67442J29341J25122
3602I7245979J49346J70204K17560K03537J08741R8519J71158J68113J00655Q1902
3612I8715714Q6997J01853J34300J66725K33033K14881R5635O0150O3591J00372J85318
3623A00158569K64794M38286L61198o5514j01043K25235K89726J83250J65963K10640
3633A02131104J65847K7054l6568q1848n1094J07834J28533K5604O675J9265O5307
$$ y = [89327911, 89751007, 90192101, 90506409, 90756630, 90953400, 91108109, 91212776, 91335937, 91568184, 91835213, 92098831, 92341064, 92516777, 92668983, 92835426, 92986679, 93085838, 93192886, 93359802, 93573471, 93864487, 94153664, 94369057, 94519569, 94549850, 94580582, 94725464, 94949791, 95296097, 95646332, 95878510, 96046974, 96140144, 96233795, 96425438, 96637939, 96824074, 96991516, 97120857, 97245979, 97395325, 97565529, 97783089, 97986626, 98095367, 98193886, 98365044, 98533157, 98633812, 98715714, 98802711, 98904564, 99038864, 99205589, 99438622, 99653503, 99749138, 99809288, 99872879, 99973251, 100158569, 100423363, 100861649, 101222847, 101157333, 101056290, 101281525, 101571251, 101754501, 101920464, 102131104, 102296951, 102324005, 102287437, 102205589, 102154495, 102262329, 102390862, 102416466, 102423141, 102442406, 102507713]
3644A02507713J96144K04400Q5540O4682R8419J35163K16766K27379J86089J32347
3654A04054642J2016K144J15181J24046O7856J7120q2779q4236K0439N2781L9939N1545
3666A04390694R1598P4150m4418l693K24564K66792J77384J12320n722k3514Q3114
3677A05343269O3973q9241r3392N7892N5878r3842j04950j8119M2656J50848J36444
3688A05451416l1731n8982L5972L3333n2025o0203k3530K7207J31416J62102J60927
3699A05775902Q8005j12579j77483j57593j12633j281P0755J54091J51969L3997J8456
3710A05731606J01356Q0055k9228q8859j60218j35589J5113O3736O8879K3933j40381
3721A05530403j40404K8565O4064k0104K3102K27387K10540l6712r4986l8674J0109
$$ y = [102507713, 102703857, 102908257, 102993797, 103058479, 103156898, 103292061, 103508827, 103736206, 103922295, 104054642, 104066658, 104068802, 104183983, 104308029, 104375885, 104393005, 104310226, 104225990, 104246429, 104299210, 104339149, 104390694, 104482292, 104556442, 104512024, 104508331, 104732895, 104999687, 105177071, 105289391, 105283669, 105260155, 105343269, 105407242, 105318001, 105224609, 105282501, 105338379, 105244537, 105139587, 105121468, 105164124, 105314972, 105451416, 105419685, 105360703, 105396675, 105430008, 105377983, 105317780, 105294250, 105321457, 105452873, 105614975, 105775902, 105863907, 105751328, 105573845, 105416252, 105303619, 105302338, 105373093, 105527184, 105679153, 105713150, 105731606, 105832962, 105913017, 105883789, 105794930, 105634712, 105499123, 105514236, 105577972, 105646851, 105670784, 105530403, 105389999, 105418564, 105482628, 105462524, 105485626, 105713013, 105923553, 105886841, 105791855, 105753181, 105763290]
3732A05763290J37574J20704m4822j18828j86608j47415M1390J08223J30790O9481
3742A05873779j55380j85631q1901M0130L15667L19503O0417p1792k27638j95176J00495
3753A05792473J47865l837m0314k2385k1416k9655o866O1035P7484O6589K8160o8092
3765A05981041j00853r8679o8786P461O2661J57638J16234j17905j43501K5467M3556
3776A05864334o9191m7493J15158J27175J7356l7956j05026r5512K2079L3142p4051
3787A05750015l8200J65512J76239N127l1593L8032R865j14769j36925r4246l5385
3798A05693672R8992J19926K8015R850N0949K2529p3196j16470j64193j08505J11359
3809A05672928J44531J6022k3483k4437l5881o5087l4073Q4618J03134L5530J3352
$$ y = [105763290, 105900864, 106021568, 105976746, 105857918, 105671310, 105523895, 105565285, 105673508, 105804298, 105873779, 105718399, 105532768, 105450867, 105490997, 105806664, 106126167, 106186584, 106114792, 105887154, 105691978, 105792473, 105940338, 105936501, 105896187, 105873802, 105852386, 105822731, 105815865, 105876900, 105954384, 106020973, 106049133, 105981041, 105880188, 105781509, 105712723, 105720184, 105782845, 105940483, 106056717, 105938812, 105795311, 105820778, 105864334, 105795143, 105747650, 105862808, 105989983, 106007339, 105969383, 105864357, 105768845, 105790924, 105824066, 105750015, 105711815, 105877327, 106053566, 106058693, 106027100, 106065132, 106074997, 105960228, 105823303, 105729057, 105693672, 105792664, 105912590, 105940605, 105950455, 106001404, 106023933, 105950737, 105834267, 105670074, 105561569, 105672928, 105817459, 105833481, 105809998, 105785561, 105749680, 105684593, 105650520, 105735138, 105838272, 105873802, 105887154]
3820A05887154J1039p17q987l6408j30706p8484J65459K06756R3796K7328o7047r2529
3832A05976654m4868l8224n9532m7012l151K0004L7956M0528J8814J8455L6431L9169
3844A05995224N9273m05k21420j80481J85204K00866j18446j58333M96O6185J34613
3855A05962776J13777l5125o4988K716O440k6184m4320p6843n9173K7633M3175j167
3867A05848717j0559j3687R223R5993P5554o8595r9396n6221j8715P7347N4496j20971
3879A05773186j37017k456N676q6670j06384j17371l7452K10113K35870O1753j0895
3890A05788353o8619o6826r9O5041K06306J79337n3810r7084J7547K1836m7249o9290
3902A05875443q1749n5222M5349N0140m8141n0613M3319L2311q5808j01234l1113j6953
$$ y = [105887154, 105898193, 105897476, 105888489, 105852081, 105721375, 105642891, 105808350, 106015106, 106108902, 106136230, 106069183, 105976654, 105931786, 105893562, 105834030, 105787018, 105783867, 105803871, 105841827, 105882355, 105901169, 105919624, 105956055, 105995224, 106054497, 106054092, 105832672, 105652191, 105837395, 106038261, 105919815, 105761482, 105761978, 105828163, 105962776, 106076553, 106041428, 105976440, 105979156, 105985596, 105959412, 105915092, 105838249, 105779076, 105806709, 105849884, 105848717, 105838158, 105824471, 105833694, 105929687, 106005241, 105936646, 105837250, 105781029, 105762314, 105839661, 105894157, 105773186, 105636169, 105633713, 105639389, 105552719, 105446335, 105328964, 105291512, 105501625, 105737495, 105799248, 105788353, 105719734, 105652908, 105652809, 105717850, 105924156, 106103493, 106049683, 105952599, 105970146, 105991982, 105944733, 105875443, 105793694, 105738472, 105783821, 105833961, 105785820, 105735207, 105778526, 105810837, 105725029, 105623795, 105592682, 105575729]
3914A05575729m4708k9343M2481L1929q4808p3838O0509J01570J01921O7833l9055
3925A05710220p1975o7330k6298R9586J17516M8515J030p6439q6548j5449j6159p9377
3937A05537292q9378p3341l8719L9672O8337P1716M5250l6407o7307n4741p5699j62979
3949A05163696j08505J44882J60149o5277q4404N4359R7420R7656R6916J01952M3625
3960A05702469j36757j35445N7221R8541M8874R323p5409q5312j7334l975k9182k4704
3972A05408310L670J0589M074k929k5963j5999M6753L4096p0214p3028N073N3215J27556
3985A05505203J14296N890n3734j12915j22574p9109m6226J0658J6708l8429l8460
3996A05161308k3K7131N8364Q1681
$$ y = [105575729, 105531021, 105501678, 105544159, 105576088, 105491280, 105417442, 105477951, 105579521, 105681442, 105749275, 105710220, 105638245, 105570915, 105544617, 105644203, 105761719, 105810234, 105811264, 105734825, 105648277, 105632828, 105616669, 105537292, 105447914, 105374573, 105335854, 105375526, 105443863, 105515579, 105560829, 105524422, 105457115, 105402374, 105326675, 105163696, 105055191, 105200073, 105360222, 105294945, 105210541, 105264900, 105362320, 105459976, 105556892, 105658844, 105702469, 105565712, 105430267, 105487488, 105586029, 105634903, 105644226, 105568817, 105483505, 105466171, 105462196, 105433014, 105408310, 105411980, 105422569, 105426643, 105423714, 105397751, 105381752, 105428505, 105462601, 105392387, 105319359, 105324432, 105377647, 105505203, 105619499, 105625389, 105571655, 105458740, 105336166, 105257057, 105210831, 105221489, 105238197, 105199768, 105161308, 105161285, 105188416, 105246780, 105328461]
4000A05328461
$$ y = [105328461]
##END=$$ End of the data block
