##TITLE=$$ Begin of the data block
##JCAMP-DX=5.00 $$ ACD/SpecManager v 10.08
##SPECTROMETER/DATA SYSTEM=16PC
##DATE=Tue Sep 03 10:53:45 2013
##DATA TYPE=INFRARED SPECTRUM
##DATA CLASS=XYDATA
##ORIGIN=
##OWNER=
##NPOINTS=3601
##FIRSTX=400.00000000
##LASTX=4000.00000000
##MAXX=4000.00000000
##MINX=400.00000000
##MAXY=36.78114319
##MINY=13.06362724
##XFACTOR=1.0000000000
##YFACTOR=0.000000100000000
##FIRSTY=20.29204941
##DELTAX=1.00000000
##XUNITS=1/CM
##YUNITS=TRANSMITTANCE
##XYDATA=(X++(Y..Y))
400B02920494N2458744M0611992K4343739Q640022k286759o562538n041198m75560
408C14608936L971577O089172N268097K313614j282348m138375n486946n273743l958931
417C12111053k209320o26106M26808Q85353R40952R00192R95102J229096J357231J034450
427C17044811O4926j400413k857399l669758l405075k091332k33650J428891K291812
436C07172813K168255J335469L32336l55396n33428l35751o1493O2599L6640O6414
446C09888458L87573J058198J859397K380753K251663J384812Q2950j073170j512661
455C16707973r85584K76699J655865K458191K276268J203575k23617j323090j633492
464C20412788j144027k59953M60873O36940K58751l49655p62768p18823k54631L60184
$$ plain form
400 202920494 255379238 295991230 320334969 328974991 326688232 320125694 315084496 314608936
408 314608936 318580513 324669685 329937782 332251396 330969048 326830673 321343727 316069984 312111053
417 312111053 309901733 309275627 309702435 310587788 311528740 312428932 313424034 314653130 316010361 317044811
427 317044811 317109737 315709324 312851925 309182167 305777092 303685760 303452110 304881001 307172813
436 307172813 309341068 310676537 311008873 310653477 310120049 309784298 309722805 309785404 309822044 309888458
446 309888458 310276031 311334229 313193626 315574379 317826042 319210854 319293804 318220634 316707973
455 316707973 315722389 315999088 317654953 320113144 322389412 323592987 323369370 322046280 320412788
464 320412788 319268761 319008808 319469681 320106621 320365372 320015717 319252949 318534126 318279495 318639679
474C18639679Q26569J012954J016465J059646J304474J713524K053718K037888J513481
483C31178398N76134m61769j228104j483192j233178p08847k23541L281m2801j84097
493C26192284j77498J20468O46934J151581J332970J022110L05405m92745r66225q46824
503C28288460j61553P65915J479950J637001J192856M22287k39563m46129j32522M56314
513C33263016R19494R38836M62684k73323q94623j113090q90999m50783j27106j57432
523C31676674n37109j025353j295547j138268n93872O3858M84428M45443j4267o14472
533C27451515r95178r29146m59747J20659M42390K85835k71148q80203j115304p29522
543C22920151J76697J179161J746215J532364N82886o72340j640282j883736j357841
$$ plain form
474 318639679 319466248 320479202 321495667 322555313 323859787 325573311 327627029 329664917 331178398
483 331178398 331754532 331292763 330064659 328581467 327348289 326639442 326415901 326419182 326376381 326192284
493 326192284 326014786 326135254 326782188 327933769 329266739 330288849 330594254 330101509 329135284 328288460
503 328288460 328126907 328892822 330372772 332009773 333202629 333624916 333385353 332939224 332806702 333263016
513 333263016 334182510 335121346 335584030 335310707 334416084 333302994 332411995 331961212 331834106 331676674
523 331676674 331139565 330114212 328818665 327680397 327086525 327150383 327634811 328080254 328065987 327451515
533 327451515 326456337 325527191 325067444 325188103 325630493 325916328 325645180 324764977 323649673 322920151
543 322920151 323096848 324276009 326022224 327554588 328137474 327465134 325824852 323941116 322583275
552C22583275m30374L27949M65889r8152j037407j811275j976586j438694m97913L28903
562C16415615O07090K27509n41134j216755j383991r30176j01071O45791R04197N44224
572C15171299k25220r84344j343899j157303n86567R594K96059J58329k35825n44052
582C10558071m62589Q2283Q75091J523419J679745J245956M44775k90108n47657j69239
592C14939747O54373J475010J823864J462612N14336n98564j375866j496849r77917
601C16420746j45855N51166P86953N18094j7891m59996n38692k23923K74429O46649
611C17811680O78272L81508j0719j88084M5433O41766J320800J722641J616822J046982
621C25067101L25508j28975k5711O24313J495056K111397K105370J422119L55377o11534
$$ plain form
552 322583275 322152901 322480850 322946739 322848587 321811180 319999905 318023319 316584625 316086712 316415615
562 316415615 317022705 317250214 316709080 315492325 314108334 313178158 313077087 313722878 314627075 315171299
572 315171299 314946079 313961735 312617836 311460533 310873966 310883560 311179619 311337948 311102123 310558071
582 310558071 310095482 310177765 311052856 312576275 314256020 315501976 315946751 315656643 315108986 314939747
592 314939747 315594120 317069130 318892994 320355606 320869942 320271378 318895512 317398663 316420746
601 316420746 316274891 316826057 317613010 318131104 318113213 317653217 317114525 316890602 317165031 317811680
611 317811680 318489952 318871460 318860741 318672657 318718090 319359856 320680656 322403297 324020119 325067101
621 325067101 325392609 325263634 325237923 325862236 327357292 329468689 331574059 332996178 333351555 332740021
631C32740021j071701r15489l77427J17722K18391j42784p13272j086349r59168l27911
641C27482033N03540J104507J173821P14836K4452m91791n59616j85241L65982P39555
651C30872078O96106K32696m37126j012192j253318j074448n43671J74790Q88405J420288
661C29963608J632118J443939Q65326J8387q73261j545486j785316j509819p89986
670C27419510J86653J189575K009583K492485K549629K168159J434670N51186j96763
679C39804687n34629l31955L04451J049499J507683J422768Q29544M6615m97551n13458
689C43087654k4032O47621J072426R76371M09470k84538o78482n24445R2506Q03910
699C45578461J179886R88731L38783l83415p38716m94003K37731J058236J507263J323433
$$ plain form
631 332740021 331668320 330752831 330375404 330493126 330711517 330568733 329855461 328769112 327809944 327482033
641 327482033 327985573 329090080 330263901 330978737 331003189 330511398 329951782 329766541 330132523 330872078
651 330872078 331568184 331800880 331363754 330351562 329098244 328023796 327480125 327654915 328543320 329963608
661 329963608 331595726 333039665 333904991 333923378 333050117 331504631 329719315 328209496 327419510
670 327419510 327606163 328795738 330805321 333297806 335847435 338015594 339450264 340001450 339804687
679 339804687 339270058 338938103 339242554 340292053 341799736 343222504 344052048 344098663 343601112 343087654
689 343087654 343063622 343711243 344783669 345760040 346169510 345884972 345206490 344682045 344774551 345578461
699 345578461 346758347 347747078 348085861 347702446 346963730 346469727 346707458 347765694 349272957 350596390
709C50596390N94711k86751q39004p55730p5111Q40225J502685J567269J019478J79252
719C54343414m81224o04133j44844O08139J203308J287994Q11081M8332n63469o85196
729C55823402k76184L82805Q57239Q19359K48146n49965j112518j088181m43230N10712
739C55171585J286659J492119J048775K32849m81224o90460k89765M70696J130447
748C59371681J284104Q14209l7156q03299j056251o51169J89400R96857J318740R71718
758C62398834J45684p04194j110344q53195q2092P71561J232986J045876L08227n87616
768C62565727j173134j157798n77393K39067Q60748R93462O33850N6229l52631l17001
778C61771126J73874Q64448J379357J435165R94873K83508l43780o00243m23355J984
$$ plain form
709 350596390 351191101 350904350 350065346 349309616 349234505 350074730 351577415 353144684 354164162 354343414
719 354343414 353862190 353258057 353113213 353721352 354924660 356212654 357023735 357072067 356508598 355823402
729 355823402 355547218 355930023 356787262 357606621 357854767 357304802 356192284 355104103 354660873 355171585
739 355171585 356458244 357950363 358999138 359231987 358750763 358060303 357770538 358241234 359371681
748 359371681 360655785 361469994 361432838 360629539 359573288 358922119 359111519 360108376 361427116 362398834
758 362398834 362544518 361840324 360729980 359876785 359794693 360566254 361799240 362845116 363153343 362565727
768 362565727 361392593 360234795 359657402 359896469 360757217 361750679 362384529 362440758 362088127 361771126
778 361771126 361945000 362809448 364188805 365623970 366618843 366902351 366558571 365958328 365534973 365536957
788C65536957L59878L92189N0240m76723q71811q75091m37813K41356Q17337R86175
798C65722694O48766l2234p16324j065674r20181l78380K62718O72493O66046L02086
808C65162010j57318l99818k44484K49328Q10814J107598R36927L46375l82996q88977
818C66539459r26895n07965J06659N50766N58090J09520n59387j093598j219596q95348
828C62661705l28522J47972K65694l0403n58662j012002j135787q70362l77579O0502
838C58822556K06985N722l93982p31773p95288n47409j47133J48773J43433j74370
848C56537514o15235q95042q01811l25966L24669Q35800R62219O65207J32713l30848
858C56489220m80042k66037J41525M63105M79660J65825k94648o18972n95475k13317
$$ plain form
788 365536957 365896835 366289024 366339264 365862541 364990730 364115639 363677826 363919182 364736519 365722694
798 365722694 366371460 366339226 365622902 364557228 363637047 363258667 363521385 364193878 364859924 365162010
808 365162010 365004692 364604874 364360390 364609718 365420532 366528130 367465057 367811432 367428436 366539459
818 366539459 365612564 365104599 365211258 365762024 366320114 366429634 365870247 364776649 363557053 362661705
828 362661705 362333183 362481155 362746849 362716446 362157784 361145782 360009995 359139633 358762054 358822556
838 358822556 359029541 359035263 358641281 357909508 357114220 356566811 356419678 356568451 356711884 356537514
848 356537514 355922279 355027237 354225426 353899460 354224129 355059929 356022148 356687355 356820068 356489220
858 356489220 356009178 355743141 355884666 356347771 356827431 356993256 356698608 356079636 355484161 355270844
868C55270844L23905P11441P15027L04985l25965q69599j073151q77304m44030o1570
878C53674583K0562k70844p93419j271934j451760j237106p38182k05040J13373J01852
888C47942085j65748m78936o14852m65050r3727L01323N01251L87420O447m55742p74154
899C46090317q04367n57022j87798Q9798J22948r7237m31595o72035o61354l87268
909C42504387M806K88086K83547l3455n09987q94508r77364p13463k55546J26266J96572
920C40019341j06888o30646j083527j198120q83560k82059L02162N65987L70522j83945
930C36889267q12607j199341j164398p54890k11869J66016J86386j33209n78842q60558
940C31525955p74002l15170L12805Q07686R30214O33659R1019l98445n71060l39928
$$ plain form
868 355270844 355594749 356306190 357021217 357326202 357000237 356130638 355057487 354180183 353736153 353674583
878 353674583 353695145 353424301 352630882 351358948 349907188 348670082 347931900 347726860 347840233 347942085
888 347942085 347776337 347297401 346682549 346217499 346123772 346425095 346926346 347313766 347320213 346864471 346090317
899 346090317 345285950 344728928 344541130 344630928 344753876 344656639 344225044 343553009 342891655 342504387
909 342504387 342509193 342797279 343080826 343047371 342537384 341642876 340665512 339952049 339696503 339822769 340019341
920 340019341 339912453 339281807 338198280 337000160 336116600 335834541 336136703 336702690 337073212 336889267
930 336889267 336076660 334877319 333712921 332958031 332746162 332912178 333098564 332965355 332386513 331525955
940 331525955 330751953 330436783 330749588 331557274 332487488 333121147 333212166 332813721 332242661 331902733
950C31902733J59798O49681Q65173P01599K69203j75438l81088k47078J17645M60167
960C34322395N29251K20986l60718r63173j326218j324691j032677o73790m91333o11954
970C28288078r79500j393547j626777j552849j215057p97921n24063n31883q03604
979C18862877j179867j449547j464233j214829q30535n03350l83053m98390p48501
988C10590572r65232j009942q50792n75523l37391k63710l82099o05412p85312p99446
998C04015713o25401l53088j32256q2473k20757m49371o11668n85861l61557n3082
1008C00540199J59588J29929j68457o20137j021671j184063j028404o24199j51501
1017B96031284J91994K87056J44444j14117l28961l88698k82021r1629O2104R3116
$$ plain form
950 331902733 332062531 332712212 333577385 334278984 334548187 334372749 333991661 333744583 333862228 334322395
960 334322395 334851646 335072632 334711914 333748741 332422523 331097832 330065155 329391365 328900032 328288078
970 328288078 327308578 325915031 324288254 322735405 321520348 320722427 320198364 319666481 318862877
979 318862877 317683010 316233463 314769230 313554401 312723866 312220516 311837463 311339073 310590572
988 310590572 309625340 308615398 307764606 307189083 306851692 306587982 306205883 305600471 304815159 304015713
998 304015713 303390312 303037224 302904968 302822495 302601738 302152367 301540699 300954838 300593281 300540199
1008 300540199 300699787 300829716 300661259 300041122 299019451 297835388 296806984 296182785 296031284
1017 296031284 296223278 296510334 296654778 296540661 296211700 295823002 295540981 295449352 295511456 295604572
1027B95604572l929j57451k65217k56863j34430L1929J47953J51997N1498q3771j66149
1038B94920139j46694m8008M7054M6101r1820l22075n30395n93224m49733j44177J89839
1049B92877007L95259L78094J60446j25694l06473k59990J6555M03061P18632Q19015
1059B95075912O72856L77178J02749j679J08681L50094N58872N85022L79658K6188
1069B98235531l02105m36726l07560J6804L64666N56603N04474K61803o485j17436
1079B98769569K2068L58086P12605Q80622P45392L49903j18427m23355m05731p0687
1089C00820045M11530P94430Q83446O38542J91745k26383m12903l00693R308L07903
1099C03116970L97739K04182j82037n55973p13425n66692j95484J95465L89442K79770
$$ plain form
1027 295604572 295600643 295443192 295177975 294921112 294786682 294818611 294966564 295118561 295170059 295086288 294920139
1038 294920139 294773445 294725437 294772491 294818592 294726772 294404697 293874302 293281078 292831345 292687168 292877007
1049 292877007 293272266 293650360 293810806 293685112 293378639 293118649 293135204 293538265 294256897 295075912
1059 295075912 295748768 296125946 296228695 296227016 296335697 296685791 297244663 297829685 298209343 298235531
1069 298235531 297933426 297496700 297189140 297205944 297570610 298127213 298631687 298893490 298887005 298769569
1079 298769569 298791637 299149723 299862328 300742950 301488342 301838245 301719818 301296463 300890732 300820045
1089 300820045 301231575 302026005 302909451 303547993 303739738 303513355 303100452 302799759 302809067 303116970
1099 303116970 303514709 303718891 303536854 302980881 302267456 301700764 301505280 301700745 302090187 302369957
1109C02369957o9618m58050o59370n49946j80397K48890M98085M19712M3029m40368
1119C01221924p79705q00095m94976k4853L75214N25723L97834J21231r6969r3498
1129C00351830J57871N32570Q28285Q78658O46839K45362j25981k87227j72844J37405
1139C03192768M65222O30149N43518K49081j06888l58352m07315k70576o1665P9174
1149C03955116O6872q1177k56615l25756k09312O7463L82633N81169N59368L23391
1159C05063152r746k70615l24936j42326J89113N11418O81095O43597M58736K62299
1169C07061787J88770K95010N30452P68414Q80985Q14037O19049M23985L56903M70429
1179C12409821P08408R35802J016045Q88634O04000K93598R3193O6700J72558K93941
$$ plain form
1109 302369957 302300339 301842289 301182919 300632973 300452576 300701466 301199551 301619263 301662292 301221924
1119 301221924 300442219 299642124 299147148 299122295 299497509 300023232 300421066 300542297 300445328 300351830
1129 300351830 300509701 301042271 301870556 302749214 303396053 303641415 303515434 303228207 303055363 303192768
1139 303192768 303657990 304288139 304831657 305080738 304973850 304615498 304208183 303937607 303875942 303955116
1149 303955116 304021988 303940811 303684196 303358440 303149128 303216591 303599224 304180393 304739761 305063152
1159 305063152 305053406 304782791 304457855 304315529 304504642 305016060 305697155 306340752 306799488 307061787
1169 307061787 307250557 307545567 308076019 308844433 309725418 310539455 311158504 311582489 311939392 312409821
1179 312409821 313118229 314054031 315070076 315958710 316562710 316856308 316949501 317016201 317188759 317482700
1189C17482700L11413J76048o1969k83127l68328k67716k7713K35958M02088M07333
1199C18006687K74677R4910k7885l1586P3986K18010L12328L01915J95751O2256q927
1210C19472122M2381K10877M24271N80520O02913M85726L00254J57280J45874K79084
1220C22701302M84390O43349O60820N23300L10440J50146J43738L02849N39436P13730
1230C27173500P14722N26314K37884k251p0991O2218L18374N53284O36215N21393K71339
1241C30942001K1515r3689j3084K18239M74739O18706N75675L76435J40724J1597P3356
1252C33346214K98195N53475O67877N24635J30653l77388p95173r52797p99408m27246
1262C32169037k0523K41852K78320J38283l5286r4681K7122K79694N29518O40068N53398
$$ plain form
1189 317482700 317794113 317970161 317908192 317625065 317256737 316989021 316961308 317197266 317599354 318006687
1199 318006687 318281364 318376274 318348389 318316803 318390789 318608799 318921127 319223042 319418793 319481049 319472122
1210 319472122 319514503 319725380 320149651 320730171 321333084 321818810 322119064 322276344 322422218 322701302
1220 322701302 323185692 323829041 324489861 325013161 325323601 325473747 325617485 325920334 326459770 327173500
1230 327173500 327888222 328414536 328652420 328650169 328579178 328641396 328959770 329513054 330149269 330670662 330942001
1241 330942001 330963516 330869827 330856743 331074982 331549721 332168427 332744102 333120537 333261261 333272858 333346214
1252 333346214 333644409 334197884 334865761 335390396 335521049 335143661 334348488 333395691 332596283 332169037
1262 332169037 332148514 332390366 332668686 332806969 332771683 332677002 332704124 332983818 333513336 334153404 334706802
1273C34706802L22991Q2702l1967L7270K38037M37126M97475L57132O5956k40822m17747
1284C36054955l89443j92184M7035J82190J29928q3999l39699m90379m45366k21825
1294C34251213O2714K54478K46506L8299k62680m98848n46150l82766r9564J46866
1304C33210068K19993P7324k05345m73137n75981m48685j48735J74027L57246L11966
1314C32498741P0038k33879m36745m32968k28462O8130L07885L82690K77672O9580
1324C32342682j23787k11868j74790o2980M3106Q3732N0202k1515q4229j14212j25580
1335C31600761j54686k28729l39470m40674m71038l89748k00729M2762K61345L82843
1345C30062637L72200K45629O1645j02043j78871j38321M082J92566L53355M23698
$$ plain form
1273 334706802 335029793 335112495 335080528 335117798 335355835 335792961 336290436 336647568 336713524 336472702 336054955
1284 336054955 335665512 335473328 335520363 335702553 335832481 335748482 335408783 334918404 334473038 334251213
1294 334251213 334313927 334568405 334814911 334853210 334590530 334091682 333545532 333162766 333063202 333210068
1304 333210068 333430061 333507385 333302040 332828903 332252922 331804237 331655502 331829529 332186775 332498741
1314 332498741 332568779 332334900 331898155 331465187 331236725 331304855 331612740 331995430 332273102 332342682
1324 332342682 332218895 332007027 331832237 331769257 331812363 331896095 331946297 331924782 331840553 331726341 331600761
1335 331600761 331446075 331217346 330877876 330437202 329966164 329576416 329375687 329418449 329679794 330062637
1345 330062637 330434837 330680466 330742111 330640068 330461197 330322876 330326958 330519524 330872879 331296577
1355C31296577L75138K22740J4496j93024l58963m69780n32989n60685n54008n03578
1365C28735924m04244k74887j62849j28365k10838l98407o22711p84073p99332o42280
1375C24307938l57438l6163K27432L76664M07180L51868K54784J49917O0349R460K7809
1386C25779800J42899L54195O12297Q22944Q84819P40738M17023J9913l10326m65546
1396C28998756m20112k36511k6665J06163J13029P744j55830l18756m39873m95644
1406C27132301m68826l41148j03493K21519N64309Q15849Q64296O45828J83792m05083
1416C29109344r43641j256600j235618q81653l08342K99797P56531R47456Q73947O47545
1426C28008766M32015L56674M47960O11343O82449N19677Q8653n08003j072273j401100
$$ plain form
1355 331296577 331671715 331894455 331908951 331715927 331356964 330887184 330354195 329793510 329239502 328735924
1365 328735924 328331680 328056793 327893944 327765579 327554741 327156334 326533623 325749550 324950218 324307938
1375 324307938 323950500 323914337 324141769 324518433 324925613 325277481 325532265 325682182 325742531 325751991 325779800
1386 325779800 325922699 326276894 326889191 327712135 328596954 329337692 329754715 329774628 329464302 328998756
1396 328998756 328578644 328342133 328315468 328421631 328534660 328542404 328386574 328067818 327627945 327132301
1406 327132301 326663475 326322327 326218834 326440353 327004662 327820511 328684807 329330635 329514427 329109344
1416 329109344 328165703 326909103 325673485 324791832 324483490 324783287 325539818 326487274 327361221 328008766
1426 328008766 328440781 328797455 329245415 329856758 330539207 331058884 331147537 330639534 329567261 328166161
1436C28166161j373215r92355l73345L06816Q61893J135063J030808N51414j67084
1445C29146156q54416j178436q96606j9951J110344J920852J873208P73773j050949
1454C30823975k850342l801651l442803j939468j6079J427860J804238J145248N1117
1463C23202095o88515n69801L35617J444893K029800J654435M24957j084938k167053
1472C24581490k362175j674157n12466N70602J180306J250076J009140P98798Q54568
1481C25696182J177559J548538J665535J326523N63584l40615r71260r89532l31841
1490C29344673P09648J594773J803131J138267j07460j247215j541748o22063J246414
1499C32318420L229599M317627L847924J871452q44498l185577m232712l682098j932183
$$ plain form
1436 328166161 326792946 325800591 325427246 325734062 326595955 327731018 328761826 329313240 329146156
1445 329146156 328291740 327113304 326216698 326196747 327307091 329227943 331101151 331874924 330823975
1454 330823975 327973633 324171982 320729179 318789711 318773632 320201492 322005730 323150978 323202095
1463 323202095 322513580 321943779 322279396 323724289 325754089 327408524 327833481 326748543 324581490
1472 324581490 322219315 320545158 320032692 320603294 321783600 323033676 324042816 324841614 325696182
1481 325696182 326873741 328422279 330087814 331414337 331977921 331637306 330666046 329676514 329344673
1490 329344673 330054321 331649094 333452225 334590492 334483032 333235817 331694069 331072006 332318420
1499 332318420 335548019 339865646 343713570 345585022 344740524 341554947 337322235 333640137 331707954
1508C31707954J82152J834336K576179K454224J855735J218415P87086N41420K95754
1517C43453255j22795p36428j391945j840286j867409j402092n59578L95966J148796
1526C37077484J460419J277885P73773K85492J58272N58739J350555K118836K353210
1535C47414665J712227K31171j645584l242340l957406l539772k196769m80461R81216
1544C35276947J768112J829186J454353J091728J106758J597977K342529K888337K752761
1553C52108688J650887l33786k715035m738655n660438n063935l076820l67584K106285
1562C33909607L501587L457832K242661N96122o52504r93614m60205M45290J066131
1571C43112907R61419J28898j027336j944771k207107j740189q07304J63307Q02421
$$ plain form
1508 331707954 331890106 333724442 336300621 338754845 340610580 341828995 342616081 343157501 343453255
1517 343453255 343330460 342594032 341202087 339361801 337494392 336092300 335532722 335928688 337077484
1526 337077484 338537903 339815788 340589561 340875053 341033325 341592064 342942619 345061455 347414665
1535 347414665 349126892 349358063 347712479 344470139 340512733 336972961 334776192 334295731 335276947
1544 335276947 337045059 338874245 340328598 341420326 342527084 344125061 346467590 349355927 352108688
1553 352108688 353759575 353425789 350710754 345972099 340311661 335247726 332170906 331803322 333909607
1562 333909607 337411194 340869026 343111687 343707809 343055305 342061691 341601486 342046776 343112907
1571 343112907 344074326 344203224 343175888 341231117 339024010 337283821 336476517 336639824 337442245
1580C37442245R53255O92520K40059j72157l97911m09928k73208r4185L0403M5281
1590C38056374n0621k11487l68958m65278m79699m33578l71246l27301l08342l00675
1600C34739189k98271l24440m19121n96695q02498r13009p99446m23623R4834N01709
1610C30758629N28488N0125q14628j731263k305450k284584j690102q07266l5477L10707
1620C21979179J43929l80936r68284j327916j287441q29620o7806P97901J516571J824035
1630C21399612J507683N08347r80568k496052l429851l282071j936149K03972K327633
1639C13822556L571414L450337K134132L89328q13789q37021K47307J665039K360878
1648C25990181J613770n03274l092994m878483m885311k982006L0174K835617M292221
$$ plain form
1580 337442245 338395500 339088020 339328079 339155922 338758011 338348083 338074875 337980690 338011093 338056374
1590 338056374 338005753 337794266 337425308 336960030 336480331 336046753 335675507 335348206 335039864 334739189
1600 334739189 334440918 334116478 333697357 333100662 332298164 331385155 330585709 330162086 330256920 330758629
1610 330758629 331287117 331337242 330522614 328791351 326485901 324201317 322511215 321703949 321668472 321979179
1620 321979179 322123108 321742172 320773888 319445972 318158531 317328911 317261105 318059006 319575577 321399612
1630 321399612 322907295 323415642 322435074 319939022 316509171 313227100 311290951 311494923 313822556
1639 313822556 317393970 320844307 322978439 323367767 322553978 321716957 321964264 323629303 325990181
1648 325990181 327603951 327100677 324007683 319129200 314243889 311261883 311292057 314127674 318419895
1657C18419895M001713K451210O66428l95241l49693M89387J400986J743889J329727
1666C29758301M65088l19825o46667n08041k01989n2375j34163k05002J03874R71031
1676C29230232K169152L115577L177033K055778J5526k194481l686180l858337k670517
1685C27353783o27785J494141L018684L633537L432198K752342J934967J154289M01345
1694C44547501m02985j262207k033691k480622k409172j801491q55789R4986P43752
1703C34140282R60693Q50487O84929P44896J154823J794624K338753K405853J753006
1712C46828346M21944j237564k685471l410339l152886k027854m81987R06028J691475
1721C36851692J764221J377831R85222R64432J386756J961136K198296J706238M49333
$$ plain form
1657 318419895 322421608 324872818 325539246 325144005 324794312 325283699 326684685 328428574 329758301
1666 329758301 330223389 329903564 329256897 328748856 328546867 328494492 328360329 328155327 328259201 329230232
1676 329230232 331399384 334514961 337691994 339747772 339763298 337568817 333882637 330024300 327353783
1685 327353783 326725998 328220139 331238823 334872360 338304558 341056900 342991867 344146156 344547501
1694 344547501 344144516 342882309 340848618 338367996 335958824 334157333 333301544 333396530 334140282
1703 334140282 335100975 335951462 336636391 337381287 338536110 340330734 342669487 345075340 346828346
1712 346828346 347250290 346012726 343327255 339916916 336764030 334736176 334254189 335160217 336851692
1721 336851692 338615913 339993744 340978966 341943398 343330154 345291290 347489586 349195824 349645157
1730C49645157j183090k553215l099518k631607j425476o6071Q69789J107102P79419
1739C41442490K98881Q0948K93236P74460J157570J109924N41038l43055j157647j549224
1749C42648621j371499p36579O8817P37915J073456J037788P18040K55852k08969n58205
1759C43665237o93473n45197j05133N34019J171799J552315J468620Q69141r4605j113205
1769C46709518j843109k049408j696281r45129o9657O61163J072693J117554Q54073
1778C43811417M05120p7972m39339n45539l27721J70250P72247J211395J238747P54013
1788C46972618j12762j028443j598510j560174r24758J3580Q16612J120377Q16612
1797C44515152J01204o35986j017762q69941k95945L96691Q67920R17892N70870L4637
$$ plain form
1730 349645157 348462067 345908852 342809334 340177727 338752251 338686180 339555969 340663071 341442490
1739 341442490 341741371 341822319 342115555 342890015 344047585 345157509 345698547 345355492 344197845 342648621
1749 342648621 341277122 340540543 340609360 341347275 342420731 343458519 344176559 344432411 344223442 343665237
1759 343665237 342971764 342426567 342321434 342855453 344027252 345579567 347048187 347917328 347822723 346709518
1769 346709518 344866409 342817001 341120720 340175591 340105934 340767097 341839790 342957344 343811417
1778 343811417 344216537 344138565 343699226 343153687 342825966 342996216 343768463 344979858 346218605 346972618
1788 346972618 346859856 345831413 344232903 342672729 341747971 341761551 342578163 343698540 344515152
1797 344515152 344616356 343980370 342962608 342092667 341796722 342193413 343061333 343979225 344550095 344584732
1807C44584732m26369o27899n40542k71759J6899K02675K51922K11601J60027J55563
1817C43716850K10648K99721L80859M15001L73230K37389O027k91596n89790p99065
1827C43959274q43200p02744m32625j38092Q6365K15187L04718M45557O79588R38797
1837C44512825J056595Q58803K84805n37758j322136j752395j646424j056289k48147
1846C40149879M34876P46307O49796L12195j3123j38016l5934J69487L05061K70806
1856C42851334J05056m5929l1013J96304N32341P70874P18651L11165l37219r79996
1866C44091568j356277j318360r00040k92205K55165N52902N47867L24402L8490j69106
1876C41774406k32009j65329l0442J11542K24838K96364L17497K75422J61438r423
$$ plain form
1807 344584732 344158363 343530464 342989922 342718163 342735062 342937737 343189659 343401260 343561287 343716850
1817 343716850 343927498 344227219 344608078 345023079 345396309 345633698 345639725 345348129 344758339 343959274
1827 343959274 343116074 342413330 341980705 341842613 341928978 342144165 342448883 342894440 343574028 344512825
1837 344512825 345569420 346428223 346713028 346175270 344853134 343100739 341454315 340398026 340149879
1846 340149879 340584755 341331062 341980858 342293053 342279930 342141914 342105980 342275467 342580528 342851334
1856 342851334 342956390 342910461 342879448 343075752 343608093 344378967 345097618 345408783 345071564 344091568
1866 344091568 342735291 341416931 340516891 340224686 340479851 341032753 341580620 341905022 341943512 341774406
1876 341774406 341542397 341377068 341346626 341458168 341683006 341979370 342296867 342572289 342733727 342724304
1886C42724304j91116l21159l54958k93388j84632r5482p0610j06773j58730j71661
1896C40775795j15852o11J36376K54135L24859L35427K78053J47781m5356k59056m17138
1907C41414413m36096k72751L5401L70941N84412N69572L20892o1416m23622o37703
1917C41464043o59676n36804l63770k21252j35918q2817k1324O4316J49574J86920
1927C39843292J42746K5978j09291j89552j61018j9989J81312L54767M14162L12385
1937C40794792O3896k56958n44166p01714o82831n09605k61040l5209R5253J13296
1947C38075714N6992j0796m1122k6169K556J144n4054j47972k34528k64091k14272
1958C37143402j03836J7204R3117R1400J5640r9449k07214k71950k80838k44713j86081
$$ plain form
1886 342724304 342533188 342212029 341857071 341563683 341379051 341283569 341212959 341106186 340947456 340775795
1896 340775795 340659943 340659332 340795708 341049843 341374702 341710129 341988182 342135963 342090607 341831551 341414413
1907 341414413 340978317 340705566 340740967 341111908 341696320 342265892 342586784 342525368 342101746 341464043
1917 341464043 340804367 340267563 339903793 339682541 339546623 339463806 339442482 339506798 339656372 339843292
1927 339843292 339986038 340012016 339902725 339713173 339552155 339532166 339713478 340068245 340482407 340794792
1937 340794792 340858688 340601730 340057564 339355850 338673019 338163414 337902374 337867165 337962418 338075714
1947 338075714 338132706 338121910 338080788 338054619 338057175 338058319 338004265 337856293 337621765 337357674 337143402
1958 337143402 337039566 337056770 337149887 337241287 337256927 337157478 336950264 336678314 336397476 336152763 335966682
1969C35966682j25923p4119k8191J8730O9275J15738J40495J26267O6986k4567j17492
1980C36133881j75705j74141j13793k3689M9171O0616r117j44692k99987m17290m52042
1991C34433212l92074k62604j13297L701N7449M8752N836l3989m5852k9564o943o447
2003C33658180m3945j10931j78528k13738j97716j38015o4011j1482l090l7041q9607
2014C32570076j29242j35193j07879o8589m5738n8861j07040j69220k15874k24914
2024C31307526j93711j39236q9111o5423p3547j00708j25236j30234j13068q5830o5690
2035C30125732o3476p6370r1668r5825q5563p0153o5994q5945j29204j81961k23312
2046C28956261k36054k14348j64146r8763l2386K4032O3668Q2550P9765N7983K3804
$$ plain form
1969 335966682 335840759 335766640 335738449 335757179 335826454 335942192 336082687 336208954 336275940 336251373 336133881
1980 336133881 335958176 335784035 335670242 335646553 335695724 335756340 335747223 335602531 335302544 334885254 334433212
1991 334433212 334041138 333778534 333665237 333668938 333726387 333775139 333780975 333746986 333701134 333671570 333664627 333658180
2003 333658180 333614235 333503304 333324776 333111038 332913322 332775307 332711296 332699814 332696724 332659683 332570076
2014 332570076 332440834 332305641 332197762 332129173 332083435 332024574 331917534 331748314 331532440 331307526
2024 331307526 331113815 330974579 330885468 330820045 330746498 330645790 330520554 330390320 330277252 330191422 330125732
2035 330125732 330062256 329985886 329894218 329798393 329712830 329642677 329576683 329490738 329361534 329179573 328956261
2046 328956261 328720207 328505859 328341713 328242950 328210564 328234596 328298264 328380814 328460579 328518562 328542366
2057C28542366j2627m2495o1570p3242q4495j01548j25007j49040j64223j63498j45416
2068C27419205j15013q0529m8752k4147p171K212N417L662l05k289P25Q469J4801R537
2082C27185822j6404o5384j27716j83525k10075j91574j29585m4594L1090O7062M9820
2093C26364937r690q0337j25427j21651p1144J53N6533P2060M3907o447m8675o1112
2105C26013107m3831j6899p171k9450p6790j23329j39313j07879l5629N1384J20010
2116C25604210J46332J24855O8321r92o1989j01700j18026j14861r9563p8240n5961
2127C25312386l6545k3499j9455k5062l9368n9013p9804r7961j10626j15815j13525
2138C24591713j04065q9035p0457n0278k9488r460R155K4223L2311K9640J3886j3848
$$ plain form
2057 328542366 328529739 328487244 328425674 328352432 328267937 328166389 328041382 327892342 327728119 327564621 327419205
2068 327419205 327304192 327223663 327174911 327150764 327143593 327145805 327151222 327154884 327154579 327152290 327153015 327161484 327176285 327185822
2082 327185822 327169418 327104034 326976318 326792793 326582718 326391144 326261559 326216965 326248055 326315117 326364937
2093 326364937 326355247 326274910 326149483 326027832 325956688 325956841 326013374 326085434 326129341 326122894 326074219 326013107
2105 326013107 325969276 325952377 325945206 325915756 325838966 325715637 325576324 325468445 325432816 325484200 325604210
2116 325604210 325750542 325875397 325943718 325942726 325880737 325779037 325661011 325546150 325446587 325368347 325312386
2127 325312386 325275841 325252342 325232887 325207825 325168457 325109444 325029640 324931679 324821053 324705238 324591713
2138 324591713 324487648 324398613 324328156 324277878 324248390 324238930 324248085 324272308 324304619 324334259 324348145 324334297
2150C24334297m7874p9079r8572j00822q7166o3705l8872j8578l204J0681K6703M3907
2162C23877716N5618N2262K7694j4724o1341r3002r3956o1569q240M2992O7863N1994
2174C23843307l890q4801j68152k32086k61727k51045k03094j27716m0245M1084R9029
2185C22610664J22452J11008P5493L3912L090r651j0147j3466l5019p9880j38969j91002
2197C22478485k13127j90811j25961l5782N3215J15661J35994J12915N9204l929n4588
2208C22331276p7744p1296m5662j9036p667j7014l8147n1727m0398J069N8784J06316
2220C22128754J17836Q3160J4534n8861j04713j05591o5613p782L9292N5732L8453
2231C22135201l44m2000p1182q1406p4119n5771l1815p133J4992L0784L6278K9106
$$ plain form
2150 324334297 324286423 324207344 324108772 324007950 323920784 323857079 323818207 323799629 323796425 323807106 323833809 323877716
2162 323877716 323933334 323985596 324013290 323998566 323937225 323844223 323750267 323688698 323680458 323723450 323791313 323843307
2174 323843307 323839417 323754616 323586464 323354378 323092651 322841606 322638512 322510796 322470551 322511635 322610664
2185 322610664 322733116 322844124 322919617 322953529 322956619 322946968 322936821 322923355 322888336 322808456 322669487 322478485
2197 322478485 322265358 322074547 321948586 321912804 321966019 322081680 322217674 322330589 322389793 322385864 322331276
2208 322331276 322253532 322182236 322136574 322117538 322109871 322092857 322054710 322002983 321962585 321963654 322022438 322128754
2220 322128754 322246590 322329750 322344284 322285423 322180710 322075119 322009506 322001724 322041016 322096748 322135201
2231 322135201 322134857 322092857 322021675 321940269 321866150 321810379 321778564 321771431 321786423 321817207 321853485 321882591
2243C21882591J0033j6060m0474n4703n1574k9107Q736N1727Q5755R7618Q0490L8338
2255C22063370j4153n7182p5226o5079l8795j8349k2926n9509j16806j70289j95007
2266C21230049j78375j27144o4354j8082p438l3837p9918j19209j27144r2506k0371
2277C20361671P0534J56632K18239K45513K38991K07138J61171J11466O4659K4719
2287C21860733n989k4872k8114j2131K2926P0954J18713J50147J54495J35116J12267
2298C22554245J16768J74332K86636M22783N26237N38140M26445K06871n7297k76337
2308C24918823l67393k83814l2692L26233O94428R57260J013412Q06313L54538k38457
2318C28148651q04901j171684j233979j010818o45065l37830k46010m00467o93245
$$ plain form
2243 321882591 321892624 321876564 321836090 321781387 321729813 321700706 321709442 321761169 321846924 321944542 322025032 322063370
2255 322063370 322049217 321992035 321916809 321851730 321812935 321794586 321771660 321712151 321595345 321425056 321230049
2266 321230049 321051674 320924530 320860176 320842094 320834656 320800819 320720901 320601692 320474548 320382042 320361671
2277 320361671 320432205 320588837 320807076 321052589 321291580 321498718 321659889 321771355 321836014 321860733
2287 321860733 321854744 321829872 321801758 321789627 321812553 321883507 322002220 322152367 322306862 322441978 322554245
2298 322554245 322671013 322845345 323131981 323554764 324081001 324619141 325045586 325252457 325195160 324918823
2308 324918823 324551430 324267616 324234924 324561157 325255585 326212845 327226257 328032570 328387108 328148651
2318 328148651 327343750 326172066 324938087 323927269 323282204 322944374 322698364 322297897 321604652
2327C21604652r44480j012135q72154o22216m08802l31134l94898n47790p65019j109085
2337C14596939j694794k560806l528309m162750l907166k356605M67949M006100P302360
2346C08162918R362621R560795P891655M950371J655846j135178k933121l713531l798447
2355C30003929l620415l504943l568287l745709l894291l895969l707810l356628k902870
2364B97807007k407818j917553j462097j056767p02877l88393r4242J94015M77848
2373B90449123P46746R88732J203136J402455J602115J803379J982594K097206K104950
2382C04380436J986389J756287J457405J142387Q54607O17485M36363L05939K17037
2391C13154335J59969J23158R4929O6433L6239J2283O524K7122P1850J26457J71719
$$ plain form
2327 321604652 320660172 319648037 318775883 318153667 317744865 317413731 317018833 316471043 315706024 314596939
2337 314596939 312902145 310341339 306813030 302650280 298743114 296386509 296854458 300860558 308162918
2346 308162918 317525539 327086334 334977989 339928360 341584206 340449028 337515907 333802376 330003929
2355 330003929 326383514 322878571 319310284 315564575 311670284 307774315 304066505 300709877 297807007
2364 297807007 295399189 293481636 292019539 290962772 290259895 289871502 289777260 289971275 290449123
2373 290449123 291195869 292184601 293387737 294790192 296392307 298195686 300178280 302275486 304380436
2382 304380436 306366825 308123112 309580517 310722904 311577511 312194996 312631359 312937298 313154335
2391 313154335 313314304 313437462 313532391 313598824 313635063 313647346 313653870 313680992 313752842 313879299 314051018
2402C14051018J92070J82152J47628R9774M8713l81m6673q9931j27163j52245j59378
2413C14145584j46999j20583r1667p2308o9370p9994r2888r4128p4863l8452J011K5100
2425C13290443K2335l929l6010n1842l8738l434K9717L1471j4095r7904j87321k42291
2437C12698402k35958j70822p7877k212J9512k2907j09482k00959k57129k55223j98364
2448C11186981j11675k9869J8005J8559k2297q4210j42650j78013j82953j62773j31016
2459C10178089j02024q4228p7172p4081o7330n4111l9158l1986m1828p1202j13907
2470C09421062j57432j88599k00710j96152j84765j77784j81427j92298j99967j92318
2480C07549610j63650j19152p2918m1352l3397m4556n8823n6953k8248K1362P1164
$$ plain form
2402 314051018 314243088 314425240 314572868 314672642 314721355 314720974 314674301 314584370 314457207 314304962 314145584
2413 314145584 313998585 313878002 313786335 313714027 313644657 313564663 313471775 313377647 313302784 313264332 313265343 313290443
2425 313290443 313312778 313308849 313272839 313220997 313182259 313178825 313208542 313240013 313225918 313128014 312940693 312698402
2437 312698402 312462444 312291622 312213745 312211533 312231045 312208138 312098656 311897697 311640568 311385345 311186981
2448 311186981 311075306 311045437 311063442 311082001 311059704 310975494 310832844 310654831 310471878 310309105 310178089
2459 310178089 310076065 309991837 309914665 309840584 309773254 309719143 309679985 309647999 309606171 309534969 309421062
2470 309421062 309263630 309075031 308874321 308678169 308493404 308315620 308134193 307941895 307741928 307549610
2480 307549610 307385960 307266808 307193890 307152538 307119141 307074585 307015762 306958809 306930561 306951923 307023087
2491C07023087R5729P9308K6073m1198r2240j06392q4266m6749k3365l4104p6866j29185
2503C06589832j60389j51157j05057m7130r671j2645n2510j04084j35536j27849q5049
2514C05598755l1719K422O29l0918o7367q0109n3978K957O4010R8133Q6537L2310m2477
2527C05579185j08585j44348j45149j22624r6187q1501q2341r0618r1953p5836m2172
2538C04497871k021K6989L0555N513l7880q0166j02597r7427p1964m5681l9158o2199
2550C04021835j07059j51768j71909j54457j05915m8905j0242n570l1070o6987r0351
2561C03077602q9607p1068n4416n8976r0408j36490j73588j81694j56211j11103p0992
2572C01883049n6324p2002j05305j33934j38931j15128p3071l2577j2665k1477n4454
$$ plain form
2491 307023087 307118816 307198124 307224197 307182999 307090759 306984367 306900101 306853352 306829987 306795883 306719017 306589832
2503 306589832 306429443 306278286 306173229 306126099 306116428 306103783 306051273 305947189 305811653 305683804 305598755
2514 305598755 305567036 305569458 305570087 305539169 305471802 305391693 305337715 305340672 305404682 305502815 305589352 305621662 305579185
2527 305579185 305470600 305326252 305181103 305058479 304962292 304880791 304798450 304707832 304615879 304540043 304497871
2538 304497871 304495850 304522839 304553394 304558907 304521027 304440861 304338264 304240837 304168873 304123192 304084034 304021835
2550 304021835 303914776 303763008 303591099 303436642 303330727 303281822 303271580 303266010 303234940 303167953 303077602
2561 303077602 302987995 302916927 302862511 302803535 302713127 302576637 302403049 302221355 302065144 301954041 301883049
2572 301883049 301826725 301754723 301649418 301515484 301376553 301261425 301188354 301155777 301143112 301121635 301067181
2583C01067181r6550j30234j42727j30920j01834o9580m8332m7112o4373q8768j03683
2594C00043068r6150o3781j7700K2449L8319K2964j5087n6801q2989q5773p2441o0177
2606B99575901o3763q5010j09806j16673q9855l2463L2635P3089O4640N455p9689j51195
2618B99023266j73416j33286m7703M4842J02787J01738M5757l6907j08433j41448j31073
2629B98546124r4739o0234m9076o4563r1515j07040r5425n8975j7376L738j1864o0138
2641B97838917j18160j55411j52149j09921n1479q526k937l4619q1062j10417r9639
2652B96914597m8981J7738O5060O5536J4973o4621j36299j67027j44710q3752j7795
2663B96414719J7700L357n5199j29642j82572j85432j30673l5934O4239J33686J49956
$$ plain form
2583 301067181 300970631 300840397 300697670 300566750 300464916 300395336 300347004 300299892 300235519 300146751 300043068
2594 300043068 299946918 299883137 299865437 299887886 299926205 299949169 299934082 299877281 299794292 299708519 299636078 299575901
2606 299575901 299512138 299427128 299317322 299200649 299110794 299078331 299110966 299184055 299248695 299254150 299174461 299023266
2618 299023266 298849850 298716564 298668861 298713703 298816490 298918228 298963985 298927078 298818645 298677197 298546124
2629 298546124 298451385 298391151 298342075 298277512 298185997 298078957 297983532 297924557 297907181 297910919 297899055 297838917
2641 297838917 297720757 297565346 297413197 297303276 297251797 297243271 297240334 297205715 297124653 297014236 296914597
2652 296914597 296865616 296883354 296948414 297013950 297028923 296964302 296828003 296660976 296516266 296432514 296414719
2663 296414719 296432419 296435776 296380577 296250935 296068363 295882931 295752258 295716324 295780563 295914249 296064205
2674B96064205J13678M5548k4605p3300r4528r9907j08661j33210j67942j90658j75629
2685B95154991j11198j1997Q3980J32790J07422J3713j10359k13394k55146k26364
2695B94564438j50147o7253j3752l509k5883n7354p7209p9785p3337p0572p6866q5278
2707B93783493q2264n8136j6727K3613L9405J5603m5090j20487j79272j95942j62716
2718B93001480r4471k0771K6970L0441p953o6891j16520j33743j13011o8512k7313
2729B92409706j4820m1733r8095j57909j92280j83716j34201o3476J659M0932M9286
2740B91615353L6277J8750R384J0395J4229J0032p820l5019o0520p2555o7444n1766
2752B91419296l9329m3030o6757j01872j31397j38187j14708o7444j4572K3269L2845
$$ plain form
2674 296064205 296177883 296223431 296198826 296125526 296030998 295931091 295822430 295689220 295521278 295330620 295154991
2685 295154991 295043793 295031796 295115776 295248566 295355988 295369701 295259342 295045948 294790802 294564438
2695 294564438 294414291 294347038 294333286 294329777 294303894 294246540 294169331 294089546 294016209 293945637 293868771 293783493
2707 293783493 293701229 293643093 293626366 293649979 293689384 293704987 293659897 293539410 293360138 293164196 293001480
2718 293001480 292907009 292886238 292913208 292943649 292935696 292868805 292752285 292618542 292505531 292437019 292409706
2729 292409706 292394886 292353153 292255058 292097149 291904869 291721153 291586952 291523476 291525135 291566067 291615353
2740 291615353 291651630 291670380 291679764 291690159 291704388 291714420 291706600 291671581 291611061 291538506 291471062 291419296
2752 291419296 291379967 291336937 291270180 291168308 291036911 290898724 290784016 290716572 290702000 290725269 290758114
2763B90758114J4706j8521m9743o7883p3738p9212r8038j35593j82705k18506k20585
2774B89628296j78700j02539j8901L9501N0163J1520n6438j22414j59931j59168j30806
2785B88800583r7885q3142r6492j31150j68762j91402j91765j78108j69850j86462
2795B87305565k37045l14141l97434m63219m96196m96807m80023m66137m69799m91257
2805B82993507n16262n24158n01022m48723l87268l45364l45497l91121m61903n21965
2815B78550224n38044m95948m10519l18756k61288k61173l10383l73650m07562l84903
2825B74787998l11165k22892j67866j78013k50092l45096m09546m04205l26462k11907
2835B71960754j14593p7171j07060j73798k27050k25544j61114o1951K2908N0392O542
$$ plain form
2763 290758114 290772820 290754299 290704556 290636673 290562935 290483723 290385685 290250092 290067387 289848881 289628296
2774 289628296 289449596 289347057 289328156 289367657 289417820 289429340 289372902 289250488 289090557 288931389 288800583
2785 288800583 288702698 288619556 288523064 288391914 288223152 288031750 287839985 287661877 287492027 287305565
2795 287305565 287068520 286754379 286356945 285893726 285397530 284900723 284420700 283954563 283484764 282993507
2805 282993507 282477245 281953087 281452065 281003342 280616074 280270710 279925213 279534092 279072189 278550224
2815 278550224 278012180 277516232 277105713 276786957 276525669 276264496 275954113 275580463 275172901 274787998
2825 274787998 274476833 274253941 274086075 273908062 273657970 273312874 272903328 272499123 272172661 271960754
2835 271960754 271846161 271768990 271661930 271488132 271261082 271035538 270874424 270812473 270835381 270885773 270892315
2846B70892315q8749j93939k68059k91023k70138k32010k05822k08073k37236k78091
2856B68619175l13797l35922l48072l60985l84655m19197m54102m72336m59537m13513
2866B64657059l46489k82402k46601k54689l04355l75290m36573m59843m30870l55892
2876B61164055k58789j69926j13449r7523j13067j41430j64910j76487j81236j90029
2886B59557209k10514k38495k59342k55566k19135j59016j00383p2880r5425j64509
2896B57781944k53525l24211l44009l02486k15435j17589m5986k2831m7130r7542j44749
2907B55866451j66473j57280j29109j03530r9621j24703j71184k21310k55279k61078
2917B54176884k38667j99756j62068j41601j45493j68991j97544k13127k02504j62849
$$ plain form
2846 270892315 270803566 270609627 270341568 270050545 269780407 269548397 269342575 269134502 268897266 268619175
2856 268619175 268305378 267969456 267621384 267260399 266875744 266456547 266002445 265530109 265070572 264657059
2866 264657059 264310570 264028168 263781567 263526878 263222523 262847233 262410660 261950817 261519947 261164055
2876 261164055 260905266 260735340 260621891 260524368 260411301 260269871 260104961 259928474 259747238 259557209
2886 259557209 259346695 259108200 258848858 258593292 258374157 258215141 258114758 258041878 257946453 257781944
2896 257781944 257528419 257204208 256860199 256557713 256342278 256224689 256178703 256155872 256108742 256011200 255866451
2907 255866451 255699978 255542698 255413589 255310059 255210438 255085735 254914551 254693241 254437962 254176884
2917 254176884 253938217 253738461 253576393 253434792 253289299 253120308 252922764 252709637 252507133 252344284
2927B52344284j04256m4078J125K4986L4123M5242P4596J27964J95694K56768K90565
2938B53247013K88792K60734K27833K10972K17895K38743K53811K46716K16255J77326
2948B55586090J51119J50662J71203J92719J92585J60427J04561M6692P553o199m768
2959B56752644p897k9049o6166j01146j10989q2264j9264N6496J17397J42841J27068
2970B56779671Q1024K6207j3847k0733J4038Q7490J86043K89383L76033M29764M44298
2981B58679371M23069L75862L13301K42882J70383J03360N3710L5897O0024J23405
2991B60581264K08359K87686L36609L45516L23734K93179K75688K79693K95945L05061
3001B63532734K89402K45056J84670J30043J01013J04294J31893J66816J92585K02370
$$ plain form
2927 252344284 252240028 252195950 252197075 252222061 252256184 252301426 252376022 252503986 252699680 252956448 253247013
2938 253247013 253535805 253796539 254024372 254235344 254453239 254691982 254945793 255192509 255408764 255586090
2948 255586090 255737209 255887871 256059074 256251793 256444378 256604805 256709366 256756058 256763611 256757412 256752644
2959 256752644 256744747 256715698 256649532 256548386 256437397 256355133 256335869 256392365 256509762 256652603 256779671
2970 256779671 256860695 256886902 256873055 256852322 256866360 256953850 257139893 257429276 257805309 258235073 258679371
2981 258679371 259102440 259478302 259791603 260034485 260204868 260308228 260361938 260397835 260457859 260581264
2991 260581264 260789623 261077309 261413918 261759434 262083168 262376347 262652035 262931728 263227673 263532734
3001 263532734 263822136 264067192 264251862 264381905 264482918 264587212 264719105 264885921 265078506 265280876
3011B65280876K00577J97964K03762K18219K31877K30045K02217J49365Q6784L7670
3021B67039356K2373M6654R6703J43871J57986J23481M8008l9424j02978j18275q4743
3032B67333012k5826K4109L8281J1882l6716p7248q5296n5218k728M5338O6395N3367
3044B67289352J6423k5387n7430p6809r2373j15433j48067j78509j85013j48010o3763
3055B66214981M9210J55277K16522K10018J38817L0670p4367j42689j61190j41087
3065B66496162j08966r1267r9201j24893j46656j44005j11046o0864j9378j0128l9540
3076B65540218r2048j36719j43986j02310k6436M8523Q3046N2719m0417j67751k87227
3087B64727612l61577l72448l26366k48737j71852j21537j07765j23615j49880j64661
$$ plain form
3011 265280876 265481453 265679417 265883179 266101398 266333275 266563320 266765537 266914902 267001686 267039356
3021 267039356 267061729 267108383 267205086 267348957 267506943 267630424 267678432 267639008 267536030 267417755 267333012
3032 267333012 267307186 267331295 267369576 267381458 267344742 267267494 267182198 267126980 267124252 267169590 267235985 267289352
3044 267289352 267305775 267280388 267222958 267146149 267053776 266938343 266790276 266611767 266426754 266278744 266214981
3055 266214981 266264191 266419468 266635990 266846008 266984825 267015495 266941128 266798439 266637249 266496162
3065 266496162 266387196 266295929 266196728 266071835 265925179 265781174 265670128 265609264 265589886 265579758 265540218
3076 265540218 265448170 265311451 265167465 265065155 265038719 265087242 265170288 265223007 265182590 265014839 264727612
3087 264727612 264366035 263993587 263667221 263418484 263246632 263125095 263017330 262893715 262743835 262579174
3097B62579174j53046j13506n9280j2703M711j8025p4501j43108j95293k08645j77441
3108B61428337j15147m8675o256m826m5109j12609j86654k49462k91748l12271l13492
3119B59742088k98423k68155k25505j77117j34773j11065j13239j37272j68457j87359
3129B57920723j79424j43948r5310n7507n2128q7814j55544k32124k90776l12214k92415
3140B56021519k41700j79824j26953r7180r5940j20353j62621k12211k58198k90527
3150B54236012l02105k90928k60868k21539j84193j58462j48277j50681j58997j65767
3160B52194195j67389j65672j66760j77078j99452k30503k60772k78759k76852k55699
3170B50015259k25945k04391k06013k35786k84596l32050l55778l43132k98462k42157
$$ plain form
3097 262579174 262426128 262312622 262253342 262240639 262245350 262227325 262152824 262009716 261814423 261605778 261428337
3108 261428337 261313190 261264515 261258259 261253433 261208324 261095715 260909061 260659599 260367851 260055580 259742088
3119 259742088 259443665 259175510 258950005 258772888 258638115 258527050 258413811 258276539 258108082 257920723
3129 257920723 257741299 257597351 257502041 257444534 257392406 257304592 257149048 256916924 256626148 256313934 256021519
3140 256021519 255779819 255599995 255473042 255375862 255279922 255159569 254996948 254784737 254526539 254236012
3150 254236012 253933907 253642979 253382111 253160572 252976379 252817917 252669640 252518959 252359962 252194195
3160 252194195 252026806 251861134 251694374 251517296 251317844 251087341 250826569 250547810 250270958 250015259
3170 250015259 249789314 249584923 249378910 249143124 248858528 248526478 248170700 247827568 247529106 247286949
3180B47286949k00729j93348k22168k71511l16410l35827l23162k88353k51618k31266
3190B44652557k35424k58846k88124l09620l16925l12386l04908l03555l12500l29799
3200B41680470l47996l58353l55091l37219l10116k82288k62565k55890k60964k71377
3210B38638611k79427k81238k79808k83375l00045l31955l71513m04816m18434m07906
3220B35280094l79562l46737l20778l03726k87171k60391k19974j76640j52130j67847
3230B32665138k30713l26290m22783m84924m90398m39835l54862k67372k05727j84059
3240B29258175k01149k43149k91901l29856l44944l32222k96212k50320k12822k00462
3250B26555138k19784k63119l10917l41816l43532l20053k87857k65198k59304k61383
$$ plain form
3180 247286949 247086220 246892872 246670704 246399193 246082783 245746956 245423794 245135441 244883823 244652557
3190 244652557 244417133 244158287 243870163 243560543 243243618 242931232 242626324 242322769 242010269 241680470
3200 241680470 241332474 240974121 240619030 240281811 239971695 239689407 239426842 239170952 238909988 238638611
3210 238638611 238359184 238077946 237798138 237514763 237214718 236882763 236511250 236106434 235688000 235280094
3220 235280094 234900532 234553795 234233017 233929291 233642120 233381729 233161755 232985115 232832985 232665138
3230 232665138 232434425 232108135 231685352 231200428 230710030 230270195 229915333 229647961 229442234 229258175
3240 229258175 229057026 228813877 228521976 228192120 227847176 227514954 227218742 226968422 226755600 226555138
3250 226555138 226335354 226072235 225761318 225419502 225075970 224755917 224468060 224202862 223943558 223682175
3260B23682175k52533k16885j55315q8864m9762o5575j42899k62527l87592m79622
3270B21580601n14889m92306m29687l52536k81448k25449j82437j46866j16425r6092
3280B18742466r6684j27277j89114k71587l54004m12807m30508m02775l40461k65675
3290B15851574k03171j70708j73301k02389k41146k72160k84729k78129k59419k39372
3300B13527050k26746k26211k38094k60697k92377l31822l75843m18529m51050m65202
3310B10240479m57974m34322m05865l85017l77636l79544l78589l63217l31173k93560
3320B06433582k70099k77806l19328l79124m31213m52385m36878l99513l66936l61824
3330B02738476l89118m32587m65469m66080m31137l76740l28140l04966l10249l32089
$$ plain form
3260 223682175 223429642 223212757 223057442 222968578 222918816 222853241 222710342 222447815 222060223 221580601
3270 221580601 221065712 220573406 220143719 219791183 219509735 219284286 219101849 218954983 218838558 218742466
3280 218742466 218645782 218518505 218329391 218057804 217703800 217290993 216860485 216457710 216117249 215851574
3290 215851574 215648403 215477695 215304394 215102005 214860859 214588699 214303970 214025841 213766422 213527050
3300 213527050 213300304 213074093 212835999 212575302 212282925 211951103 211575260 211156731 210705681 210240479
3310 210240479 209782505 209348183 208942318 208557301 208179665 207800121 207421532 207058315 206727142 206433582
3320 206433582 206163483 205885677 205566349 205187225 204756012 204303627 203866749 203467236 203100300 202738476
3330 202738476 202349358 201916771 201451302 200985222 200554085 200177345 199849205 199544239 199233990 198901901
3340A98901901l53184l63140l64971l72448l98922m48341n11379n69763o05717o09131
3350A94304905n80254n26943m59289l87440l20950k70099k45171k53258k93541l55072
3360A90612888m19483m67453m86927m76570m44946m04053l63846l29609l03592k88811
3370A86627598k89898l11260l51410m00467m41590m59632m48666m17748l85055l68042
3380A82753830l71418l83434l82099l50380k88678k18620j72615j75533k28920l07141
3390A79874992l70674l87287l50723k85225k31419k22664k64453l30124l75405l64151
3400A76692867k90031j81866q8634n3387q9569j74637k63042l11966l03421k52724
3410A74683590j97334j75743k05861k77900l62034m24271m43020m15592l54023k76565
$$ plain form
3340 198901901 198548717 198185577 197820606 197448158 197049236 196600895 196089516 195519753 194914036 194304905
3350 194304905 193724651 193197708 192738419 192350979 192030029 191759930 191514759 191261501 190967960 190612888
3360 190612888 190193405 189725952 189239025 188762455 188317509 187913456 187549610 187220001 186916409 186627598
3370 186627598 186337700 186026440 185675030 185274563 184832973 184373341 183924675 183506927 183121872 182753830
3380 182753830 182382412 181998978 181616879 181266499 180977821 180759201 180586586 180411053 180182133 179874992
3390 179874992 179504318 179117031 178766308 178481083 178249664 178027000 177762547 177432423 177057018 176692867
3400 176692867 176402836 176220970 176132336 176078949 175989380 175814743 175551701 175239735 174936314 174683590
3410 174683590 174486256 174310513 174104652 173826752 173464718 173040447 172597427 172181835 171827812 171551247
3420A71551247j98593j31455q3065n9986o5422r4185j30138j49136j30367o7959K2507
3431A70463448J08547J55659J43852P7133k0695j19037j96038k45476k73113k85396
3441A69808884k81010k50187j84975r0293J1291Q6937J10226P6904R384n3406p5779
3452A69167976m3888K8134J06811J57929J63555J29108P7210L4332J8253L1700O5060
3463A69936180J03722J34067J47934J42746J20831Q9302N9223M2095M4308O3248Q6212
3474A70969868R6512Q2683M6330K994k6722k8152j908L6698O7138P5779O3324M2363
3486A71426907K8457L0480M7073P1411R8248J28650J67313K15263K64263K98329L02372
3497A73078766K73228K22969J73893J45874J44577J59797J73130J71318J54515J36566
$$ plain form
3420 171551247 171352654 171221199 171138134 171078148 171012726 170918541 170788403 170639267 170508900 170440941 170463448
3431 170463448 170571995 170727654 170871506 170948639 170927944 170808907 170612869 170367393 170094280 169808884
3441 169808884 169527874 169277687 169092712 169002419 169013710 169100647 169210873 169287777 169297161 169243755 169167976
3452 169167976 169124088 169152222 169259033 169416962 169580517 169709625 169786835 169821167 169839420 169871120 169936180
3463 169936180 170039902 170173969 170321903 170464649 170585480 170674782 170734005 170776100 170820408 170883656 170969868
3474 170969868 171066380 171149063 171195393 171198387 171171665 171143513 171141605 171178303 171245441 171321220 171384544 171426907
3486 171426907 171455364 171485844 171532917 171604328 171702576 171831226 171998539 172213802 172478065 172776394 173078766
3497 173078766 173351994 173574963 173748856 173894730 174039307 174199104 174372234 174543552 174698067 174834633
3507A74834633J33953J54934J94244K37294K69565K85683K89764K89612K88029K79598
3517A77257309K54230K05155J36547O3133M349k3747j4247L0632J02729J90430K80171
3528A78486691L56178M03480M14849L96957L71532L65353L93486M45576M85573M69856
3538A82589531L74470K15473M7226o3553p4444R461J38702K50244L05309L09315L03021
3549A84404755L29113M02107N01194N90496O51913P00054P66239Q59833R36260R01966
3559A91043930O64425J99051m07486r72233j290131j229076p95345j33591N37987J021442
3569A88638973J213780J131191Q82091O12298M49504M66042O61545R62505J240387
3578A96258316J349449J184387P35035J12744m79393q27923q07591m43954R6741N88836
$$ plain form
3507 174834633 174968586 175123520 175317764 175555058 175824623 176110306 176400070 176689682 176977711 177257309
3517 177257309 177511539 177716694 177853241 177916374 177920723 177896976 177882729 177913361 178016090 178206520 178486691
3528 178486691 178842869 179246349 179661198 180058155 180429687 180795040 181188526 181634102 182119675 182589531
3538 182589531 182964001 183179474 183226700 183163147 183088703 183098164 183236866 183487110 183792419 184101734 184404755
3549 184404755 184733868 185135975 185637169 186227665 186879578 187579632 188345871 189205704 190141964 191043930
3559 191043930 191708355 191907406 191499920 190527687 189237556 188008480 187213135 187079544 187617531 188638973
3569 188638973 189852753 190983944 191866035 192478333 192927837 193393879 194055424 195017929 196258316
3578 196258316 197607765 198792152 199527187 199639931 199160538 198332615 197525024 197081070 197177811 197766647
3588A97766647Q54798Q40225O18973L33595J14365K6340O8169K06794M13380O70262
3598B01913548R50164J191864J305104J207771Q79383L92399j02406m31537m71859
3607B06834431k03705K75555P81669J105976J092263P06806P7381n26791p84111m64058
3617B08895416M35505J630764K630272K936077K283497P95040j041908k576981l281593
3626B12706089k971821j860084m22116Q37365J592235J781807J566010J203746R35879
3635B15369110R14955J183548J670265K195015K496109K308140J483135J04008j486397
3644B26237888k788715l354664k998848j896458n05256O50024J217079J151104O89068
3653B18401222J94855k4853J61324O96296J400681K059727K488765K566700K255497
$$ plain form
3588 197766647 198621445 199461670 200080643 200414238 200528603 200554943 200623112 200829906 201243286 201913548
3598 201913548 202863712 204055576 205360680 206568451 207447834 207840233 207737827 207306290 206834431
3607 206834431 206630726 206906281 207687950 208793926 209886189 210592995 210670376 210143585 209359474 208895416
3617 208895416 209330921 210961685 213591957 216528034 218811531 219606571 218564663 215987682 212706089
3626 212706089 209734268 207874184 207452068 208289433 209881668 211663475 213229485 214433231 215369110
3635 215369110 216284065 217467613 219137878 221332893 223829002 226137142 227620277 227724285 226237888
3644 226237888 223449173 220094509 217095661 215199203 214693947 215343971 216561050 217712154 218401222
3653 218401222 218596077 218571224 218732548 219428844 220829525 222889252 225378017 227944717 230200214
3662B30200214J612320P85065k7904o54240j026764j213970j370259j626892j987610
3671B24689960k297992k317429j851883q71162M58126J836204K945099L549004L537102
3680B29677029K915935J786137L32279j179504k427674l109836l049450k279492j048603
3689B21616821K68688J315289J874371J911964J537418R23481K45762l33805o64291
3698B28695698o23589j78451N48935J269207J614265J307297L27911j029110k254677
3707B29677486k845897k539311j428795Q4496J480236K340317K494488K036228J228142
3716B32527390L65238l30105p47109q66413p17296l48625J74694P53192J239491J451626
3726B33502083J224727M92173o37379j856060k723293k825966j974926l44010J541119
$$ plain form
3662 230200214 231812534 232597599 232569695 231915455 230888691 229674721 228304462 226677570 224689960
3671 224689960 222391968 220074539 218222656 217351494 217809620 219645824 222590923 226139927 229677029
3680 229677029 232592964 234379101 234711380 233531876 231104202 227994366 224944916 222665424 221616821
3689 221616821 221885509 223200798 225075169 226987133 228524551 229448032 229693794 229359989 228695698
3698 228695698 228072109 227893658 228442593 229711800 231326065 232633362 232961273 231932163 229677486
3707 229677486 226831589 224292278 222863483 222947979 224428215 226768532 229263020 231299248 232527390
3716 232527390 232892628 232562523 231815414 230949001 230231705 229883080 230057774 230810966 232050457 233502083
3726 233502083 234726810 235218983 234581604 232725544 230002251 227176285 225201359 224857349 226398468
3735B26398468K992191L455830K775135J272984m04911j611825k016830j740456j234512
3744B29886074r82628j201057j718560k102203j942825j122837R9659J235065J839867
3753B23990555J757469J182079N21202J51310K16694N79777R33018R89094O32877l5648
3763B30918427p73125j316204j488152j246757o75984N5485P43675J200676J306515
3772B28724556J050796N45426j2875m22973n68810m68407k49061o3934J106k8801m9305
3783B28457718M1580K70081N71670Q40607J003284J057511J050987J017647R27944
3792B35239029O98376K60658l60279j021614j521473j708889j571770j239872q95481
3801B27878685o49891m71611k18029K45857R22776J639289K118588K128467J612721
$$ plain form
3735 226398468 229390659 232846489 235621624 236894608 236489697 234877872 232861042 231120586 229886074
3744 229886074 228903446 227702389 225983829 223881626 221938801 220815964 220915623 222150688 223990555
3753 223990555 225748024 226930103 227451305 227602615 227819309 228399086 229332104 230321198 230954075 230918427
3763 230918427 230145302 228829098 227340946 226094189 225418205 225473690 226217365 227418041 228724556
3772 228724556 229775352 230320778 230307903 229884930 229316120 228847713 228598652 228534718 228535824 228507023 228457718
3783 228457718 228499298 228769379 229341049 230181656 231184940 232242451 233293438 234311085 235239029
3792 235239029 235937405 236198063 235837784 234816170 233294697 231585808 230014038 228774166 227878685
3801 227878685 227228794 226757183 226539154 226785011 227707787 229347076 231465664 233594131 235206852
3810B35206852P24392k57893j072330j587620j821232j865692j786480j567497j140900
3819B24831600m75063L51105J147995J699123J876163J709862J364384J029816P99579
3828B34334564O15425L17231k31057j021003j866188k482624k637177k272034j526890
3837B23230247o42986J87817R26742J671009K519474L407708M034824L955422K813873
3846B42104130O01444k218971m818421o314220o151772m364624j579914J242981L215122
3855B21715755L869095L298683K036381P50618p3623l16525j96590p8526k37179p06634
3865B30061455j283264j660557j608315j094112k89440N28011J109371J334114J227570
3874B28324833R08222N09396J26190j92299m19712n29575n00775l44009j23329N6781
$$ plain form
3810 235206852 235931244 235673351 234601021 233013401 231192169 229326477 227539997 225972500 224831600
3819 224831600 224356537 224707642 225855637 227554760 229430923 231140785 232505169 233534985 234334564
3828 234334564 234949989 235267220 235036163 234015160 232148972 229666348 227029171 224757137 223230247
3837 223230247 222587261 222775078 223701820 225372829 227892303 231300011 235334835 239290257 242104130
3846 242104130 242705574 240486603 235668182 229353962 223202190 218837566 217257652 218500633 221715755
3855 221715755 225584850 228883533 230919914 231670532 231596909 231280384 231083794 231005268 230768089 230061455
3865 230061455 228778191 227117634 225509319 224415207 224125767 224653778 225763149 227097263 228324833
3874 228324833 229233055 229742451 229868641 229676342 229256630 228727055 228226280 227882271 227758942 227815723
3884B27815723J01586j1025k00138l10535j93386K00653P73277J303330J540355J317597
3894B32337437O32572l46127j343403k082042k378578k193451j622754q44135m7188
3903B22112331O24123J095734J354656J420650J316948J060047O69175J86672l09925
3912B29530411p19376r50641r61457p80124m92897k03724J2207J33800J86291K07748
3922B25962238K15683J94512J14040l7994k32144l99303m63028l79505j65615J03454
3932B24912338L26481M19903L54271J64718o7806k54783l38555l13968k23217j27831
3942B24851551p4005p0019q7795q5240l4370O2828J78623K78282L36934L44066K96860
3953B25997715J93748L8548j47629l18737m17766m06552k94952j42727k6131J0662
$$ plain form
3884 227815723 227917309 227906284 227706146 227395611 227202225 227402878 228176155 229479485 231019840 232337437
3894 232337437 232970009 232623882 231280479 229198437 226819859 224626408 223003654 222159519 222112331
3903 222112331 222736454 223832188 225186844 226607494 227924442 228984489 229653664 229840336 229530411
3912 229530411 228811035 227860394 226898937 226118813 225625916 225422192 225434399 225568199 225754490 225962238
3922 225962238 226177921 226372433 226486473 226448479 226216335 225817032 225354004 224974499 224808884 224912338
3932 224912338 225238819 225658722 226012993 226177711 226109905 225855122 225516567 225202599 224979382 224851551
3942 224851551 224777546 224707527 224619732 224534492 224500122 224562950 224741573 225019855 225356789 225700855 225997715
3953 225997715 226191463 226230011 226082382 225763645 225345879 224939327 224644375 224501648 224475517 224486179
3963B24486179j5220m2439j6498O1702J31436J20716R498j42345k33269j99184p0954
3974B24089622L9807K4509j32980l35236m43058l87745k32677j24664j68705l29190
3984B21999683m51297m03691k27470j50719m14314j022739j631566j732730j090336
3993B14874821j55545j16310k417240p919006j6158467k5199165l2272816
4000A30636272
$$ plain form
3963 224486179 224470959 224428520 224412022 224473724 224605160 224725876 224735374 224593029 224359760 224160576 224089622
3974 224089622 224129429 224153938 224020958 223685722 223242664 222854919 222622242 222497578 222328873 221999683
3984 221999683 221548386 221144695 220917225 220766506 220352192 219329453 217697887 215965157 214874821
3993 214874821 214719276 214602966 212185726 204266720 188108253 162909088 130636272
4000 130636272
##END=$$ End of the data block
