##TITLE=$$ Begin of the data block
##JCAMP-DX=5.00 $$ ACD/SpecManager v 10.08
##SPECTROMETER/DATA SYSTEM=Varian
##DATE=15 Jan 2013 16:27:54
##DATA TYPE=INFRARED SPECTRUM
##DATA CLASS=XYDATA
##ORIGIN=
##OWNER=
##NPOINTS=3735
##FIRSTX=399.26403809
##LASTX=4000.35498047
##MAXX=4000.35498047
##MINX=399.26403809
##MAXY=86.76280212
##MINY=50.32189178
##XFACTOR=1.0000000000
##YFACTOR=0.000000100000000
##FIRSTY=77.42366791
##DELTAX=0.96440572
##XUNITS=1/CM
##YUNITS=TRANSMITTANCE
##XYDATA=(X++(Y..Y))
399.3 774236679 774212418 771366119 774710159 765309601 764180450 772666473 776386032 775780792 767252350
407.9 767252350 776321411 781647720 780205460 778360291 770029068 766271667 764003601 764358673 764223404
416.6 764223404 767358704 765574265 757341843 768732834 775959854 777839203 769923325 766865311
424.3 766865311 763570938 768490448 770131683 765689697 770274048 766838074 760643234 760599823 764649277
433 764649277 766634140 766021194 770297775 769479904 765344315 760870590 759287643 760227356 763583145
441.7 763583145 761973495 758427963 766032486 768429260 765886383 760592041 762047348 764040298
449.4 764040298 759722900 760834198 758029861 756271210 757760544 761983719 763853149 761620941
457.1 761620941 770163116 762661743 759043427 760799026 759933701 759263916 757731934 757509842 755033493
465.8 755033493 755908279 756414185 760285187 763134232 759990234 762225037 760397491 759853363 760365448
474.5 760365448 758426590 756779709 756978607 758943634 756457901 756254807 755933990 756014099 758571701
483.2 758571701 757781219 757423248 760517044 762507019 758396072 757582092 760004654 760620499 759631119
491.8 759631119 758279877 758702164 758251038 758860626 757889404 756769791 756302414 757002869 758646011
500.5 758646011 754877090 751893082 751585236 753948059 758057785 758572159 759618683 758157349 757009659
509.2 757009659 757109756 753644714 750851822 750158615 749846878 753362122 757751770 758721161 757675323
517.9 757675323 754537277 752951050 754357910 754382019 752702560 752281723 753685989 754406204 754353867
526.6 754353867 753750992 753676453 751940613 751109543 753532791 752607803 751101837 753465424 756792374
535.2 756792374 755447845 751603546 750273590 749767303 749889297 748823471 750067291 753124847 753822021
543.9 753822021 753735657 752165833 751778183 751363754 750085297 749219818 748548508 748771210 750195847
552.6 750195847 753301392 754484787 754710236 753377151 750107040 749586334 749417114 748067093 747577896
561.3 747577896 748058167 749041977 750492401 750048523 747928391 747914581 749065094 749262695 748706741
570 748706741 749299316 750147400 750272064 749587097 748966904 750274658 750373230 749657822 749010086 749089508
579.6 749089508 749789810 750028839 751535034 751577530 750894928 749254074 746504745 746345673 747433319
588.3 747433319 747864075 748360672 748689575 747310410 748009033 748663940 747235565 748466721 750196381
597 750196381 751075287 750889740 750846481 751358032 751033783 752207642 752690048 752603378 753319931 753782883
606.6 753782883 754465714 754502258 753526840 752781372 753265839 754050903 753628387 751870041 751331940 751799545
616.3 751799545 752296524 754497528 756880188 757306519 755364227 755227890 757245255 757570953 757296753
624.9 757296753 757834015 759199448 760013657 760187683 760096054 759912109 759455795 758558731 758550873 758799973
634.6 758799973 759931259 761067123 761699982 762119293 761021042 760073929 759716797 759952393 761215363
643.3 761215363 762575302 763019333 763699875 763684616 761799393 761051483 760444412 760480270 761697388 762434235
652.9 762434235 763156586 764272842 765619507 765368958 764895401 764747467 764882202 765431595 766178360
661.6 766178360 768350677 769036713 768899689 770596161 772959213 768113556 740313721 750543671
669.3 750543671 762101974 768271027 770538940 770809555 771432419 771723328 771882782 772269211 771848831
678 771848831 770662384 770476074 771054764 773049164 775386124 775772934 775927277 776458817 776879883 775351257
687.6 775351257 773669434 773823700 774760437 776276779 777508163 779320374 780406494 780480118 780259247
696.3 780259247 780017319 780506973 780875168 781919479 782845764 783933792 784996414 784753647 783791122
705 783791122 783246384 783850555 784122620 784654388 785465393 786994400 788130798 787482147 787250748 787393799
714.6 787393799 786965103 784915085 784053040 784038696 783703384 784797287 786206970 788066025 787537842
723.3 787537842 786949310 787306824 785472641 784255524 784317627 785801697 786581268 786083679 785855865
732 785855865 786226883 785721054 783690262 783850479 783978882 782644272 781447983 781682129 782875519
740.7 782875519 783201523 783567123 781752548 779143066 777894669 777024460 776051712 775697632 776835098
749.3 776835098 776856461 775248489 772881927 771678391 771195679 770323868 769655151 768800583 769981537
758 769981537 770639038 769410095 768402863 767490921 767048950 766383972 766204605 766431122 766964798 767186584
767.7 767186584 766518097 766156540 765755920 765972443 766530914 765962753 764626846 764169159 764185638 764598618
777.3 764598618 764848633 764084930 764637146 765093384 765018921 764160919 762498322 762526093 762573318 762396927
787 762396927 761260986 759521179 758908768 758419952 758149796 757574768 757083740 757056732 756599121 756022644
796.6 756022644 756360855 757002335 756728592 756347122 756059418 755410080 755053482 756253586 757838745
805.3 757838745 758440018 758675766 759219971 760484238 761322556 761691666 762475281 764120102 765619125
814 765619125 766313019 766974258 767056961 767434464 768909607 771079865 772171326 772477646 773469162 774089737
823.6 774089737 774578705 775385742 776936340 777735214 778134689 778981628 779936142 781627960 782542191
832.3 782542191 783130722 782387619 781917572 782503281 782318573 782584534 782638092 783960037 784609604 784391327
841.9 784391327 784361877 783591843 784107056 783957901 783574219 783518829 784027481 784524231 784146881 784936752
851.6 784936752 785139008 784367523 783301544 782830429 782284546 781305161 780870056 780930176 781992874 782200699
861.2 782200699 781947937 781404724 781016617 780713882 780347366 781397476 782215729 783415222 783731766
869.9 783731766 783355255 783386459 783308945 782909393 781129303 781521072 782822647 783277817 783529434 783622284
879.5 783622284 784237595 783701630 782780914 781774521 781819839 782436905 783456497 785099335 785649796
888.2 785649796 786894302 788034058 788582077 788628311 788716660 788474350 787569885 787734909 788137589 789446106
897.9 789446106 789656372 789601517 790740433 790762405 790064240 788963547 788469925 787958755 788697128 789823761
907.5 789823761 789298935 788943939 788802567 788525848 787513885 787325287 787602158 787566910 787309341 786891098
917.2 786891098 787289200 786999283 787060699 787188797 786510849 785171280 784474182 784720459 783996582 784330215
926.8 784330215 784610214 783706055 781600571 780178375 780441971 779281921 778436584 777997131 777378464
935.5 777378464 776397324 775645294 775105972 773629074 772630997 770881119 769955063 769376373 768586349
944.2 768586349 768659744 767676620 767342148 767012329 765606995 763925018 763171997 762607651 761222992
952.8 761222992 761364899 761583710 760843124 760185089 760033875 759347458 757727203 756110306 754568863
961.5 754568863 754027863 753345108 752493134 751642838 751488953 751973114 750758743 749844360 749613190 749790878
971.2 749790878 749940796 749921036 751137390 751507797 751049576 750524673 750127182 749949722 749598389 749931870
980.8 749931870 750317535 750458984 750818787 750791855 750745239 751412506 751176910 750001526 749085236 749190216
990.5 749190216 750411987 750751419 750703201 750451279 749855728 749466400 748624496 747525711 746464844
999.1 746464844 745903473 745569077 745210648 744070053 742984619 742262726 740401535 738478775 736557617
1007.8 736557617 734544373 732181625 730108566 727987671 724924316 722120743 718863449 715987244
1015.5 715987244 713072586 709493561 706463394 703840408 701766129 699869766 698571320 697985458
1023.2 697985458 697755737 697430801 696496658 696753159 698301468 700002365 701833801 703941574 705770493
1031.9 705770493 706463547 706881104 707539673 708442535 709014282 710182037 712076187 712829666 713241730
1040.6 713241730 714023209 714837036 715069656 714697723 714183731 713995667 714072876 714051285 714740295 716086121
1050.2 716086121 716326981 715212860 715040436 715195541 714660873 713441315 712790909 714984131 716597290
1058.9 716597290 715768280 713868713 712966003 713341522 712711411 712412567 711937637 710845795 710789337
1067.6 710789337 711539383 711276932 710112152 709956589 709930191 709482574 708582230 708316269 708301697 708004227
1077.2 708004227 707719650 706276169 706497803 707614594 707239456 706866226 706564560 705950699 705854492
1085.9 705854492 706487885 705588226 704831009 705618210 705894852 704959564 703988266 704513016 704684067 704246063
1095.6 704246063 702879868 701086807 700492401 699940186 699842911 699419250 698358612 697518616 696945190
1104.2 696945190 696609802 695791245 694674683 693936386 693961792 693646469 692606583 691399307 691054535
1112.9 691054535 691239014 690325394 689595108 688860779 688040695 686905899 684967728 684507828 684874268
1121.6 684874268 684737778 684309769 683887100 683071823 681312714 679583740 677743149 676315460 676281738
1130.3 676281738 676447067 675883179 675481262 675134201 673794403 673153000 672702103 671070023 669973450
1139 669973450 669050140 668086624 667548599 666529312 665405197 664569778 663947067 663395233 661955185
1147.6 661955185 660040665 659029312 658021622 656782913 655941925 654599762 653633347 653252106 652021790
1156.3 652021790 650088348 648536758 647964172 647515335 646434479 645066147 643862610 642866898 642466278
1165 642466278 641966324 641273041 641155930 640682449 640060501 639491425 639546661 639758720 639344215 638982697
1174.6 638982697 638352356 638223915 637912750 637144165 636332283 635638580 635743027 635564575 634960365 633478928
1184.3 633478928 632404442 632255707 631648865 630766792 629380569 628826637 628571281 627812767 626674271
1193 626674271 625388832 624943504 624441223 623605080 622222366 621368942 620946388 620307808 619849091 618935471
1202.6 618935471 618291473 617467499 616998749 616608849 615753288 615572853 615713387 616303864 616540146 616276550
1212.3 616276550 616024323 616034813 616266632 616349945 616546021 617051697 617839775 618385582 619019661 619236069
1221.9 619236069 619474220 619960937 619997673 620263329 620649719 621393814 621828232 622123604 622725182 623317642
1231.5 623317642 623810310 623709030 623620262 623715248 624447289 624998894 625435524 626202278 626506577 626913872
1241.2 626913872 626665955 626406288 626408577 626634789 627442780 628233032 628799057 628415642 628488884 628714409
1250.8 628714409 628449326 628097076 627642593 628037453 628329315 628355713 628328018 628460732 628414650 628061218
1260.5 628061218 628028069 627779922 627627602 627102051 626881866 626705093 625951729 625439034 625146637 625306015
1270.1 625306015 624514465 623321609 622311440 621460533 621136589 620583305 620136871 619340439 618733978
1278.8 618733978 617987366 617269478 616635246 615308838 614395676 613526077 613013115 612396965 612076874
1287.5 612076874 611368637 610057793 609910774 609330254 608757782 607910614 607422714 607387733 607113419 607203522
1297.1 607203522 606500015 606183548 605750618 605859795 606029663 605533562 605693932 605907707 606681786 606730690
1306.8 606730690 607314568 608075981 608353615 609430580 610196228 611265259 612325592 613538933 614460945
1315.4 614460945 615858040 617205276 617934761 619543991 620826149 622568970 623952103 625426254
1323.2 625426254 627016449 628339577 630080910 631226578 632822189 634252625 635625343 636623192
1330.9 636623192 637571220 639097366 639958344 641295090 642281723 642957840 643594055 643213882 642548752
1339.6 642548752 643152466 645283737 646576843 646748886 646348419 646167145 645865936 645175323 644631653
1348.2 644631653 643642654 643013916 642318115 641056061 639856224 638666039 637314110 635777969 635095711
1356.9 635095711 634433441 634083252 633985519 633443108 633120346 631847153 631456795 632783318 633834572
1365.6 633834572 634155731 634313965 634620094 635395584 636415596 636541138 636939926 636697083 635498161
1374.3 635498161 635402031 636350136 637346230 637336884 637667084 637852325 638009300 638174057 637979279 637912025
1383.9 637912025 637786865 638438263 638463478 638282700 639555855 640755310 641079178 640698547 640746918 640668259
1393.6 640668259 639604836 637848053 638705521 640002823 640196991 640265274 641479187 643501282 644029541
1402.2 644029541 644774017 645806198 645855408 647857971 649997940 651382065 652310410 653659058 654466705
1410.9 654466705 655526123 656832047 657378693 658138046 658807907 659327621 659263763 659256363 657349930 659563293
1420.6 659563293 662267380 662645569 662443008 661863785 663268967 664272690 664405670 665063477 664487610
1429.2 664487610 663974533 664666748 665788422 665691147 665670929 666859512 667173157 665081177 665931244
1437.9 665931244 668638458 669309311 669680710 670313339 670478745 671205444 671021957 671675491 671969757
1446.6 671969757 671132736 670395584 671824493 673278580 672819672 673441162 674286194 675579224 676126099
1455.3 676126099 674883881 671235352 669436798 674535217 677362289 679992294 681016388 682361603
1463 682361603 684816818 684408569 687328644 690494766 693867111 696678314 699021072 701498795 701543198
1471.7 701543198 701443100 703600082 708372726 711957932 711616211 712473450 714395065 714925461 714707260
1480.3 714707260 714212341 714577484 715376816 715854492 716090469 716263962 715040512 713529205 713582916
1489 713582916 710238190 708495636 710758133 712286987 712338562 711570129 709904633 704239655 705061035
1497.7 705061035 704042130 701089935 701913986 700589066 698501740 697632141 698071136 696844940 682319031
1506.4 682319031 673948746 677933350 682404861 684396057 686036911 685912933 686060410 688204041 688562241
1515.1 688562241 689025574 688218689 689233932 694797897 698086624 697510834 696412506 699921265 706166153
1523.7 706166153 709418945 710006180 712222748 714043350 715574875 718053207 720088043 719886856 720100479
1532.4 720100479 719428329 715504150 717921600 719394836 720172043 720342255 711570969 704517136 707865829
1541.1 707865829 708850250 706673965 708675156 708054962 705613022 707484512 706956100 705863876 701560822
1549.8 701560822 698195038 699176788 698486176 696914978 688903427 687618484 688897858 688025284 677853699
1558.5 677853699 662005081 667086182 670825500 673904343 673196182 670947418 666585464 664270859
1566.2 664270859 663835144 661953735 659864120 651054687 653138809 654150772 652171326 650567780
1573.9 650567780 648762817 646863708 636366081 638336296 638723450 637524147 636165009 633304138
1581.6 633304138 631608315 628657303 627090645 624582367 622330627 619881744 617021866 615485611
1589.3 615485611 612387314 611046944 607640800 605193558 602698021 599445343 597734947 594671631
1597 594671631 593316650 590576744 588850632 585774956 582755661 580488739 577185822 576481018 573964462
1605.7 573964462 572506905 569552765 568247681 567024002 564346581 564150543 562263870 562139664 560366974
1614.4 560366974 560503540 559533653 553435135 556729202 557233772 558255844 557526703 558267479 556844864
1623.1 556844864 554167023 556767998 558050270 560093536 558712082 560003128 561652756 562641602
1630.8 562641602 563797760 564413033 566409569 566782570 563552017 563370705 567113228 569158325 571168404
1639.5 571168404 573272400 573705521 575326538 575737915 577535973 578115044 575405197 574819794 574274368
1648.1 574274368 577542953 578436012 579519157 580019379 572731285 563886452 569861603 574674797 575505333
1656.8 575505333 575363083 574487000 574228973 573643417 572923508 571171570 568496284 570082474 569848213
1665.5 569848213 569177322 568353844 566964798 563151207 561028137 562881927 561762505 562830391 563774834
1674.2 563774834 561407280 558705559 559492416 560821762 560013390 559393425 557756538 559186554 560982628
1682.9 560982628 557178459 548624916 548453217 552051430 551114731 548961563 547055969 543590698 541838608
1691.5 541838608 539288979 537203560 534529724 531785622 520576172 519925499 521810112 520741844
1699.3 520741844 520255966 507791138 511772270 512376404 511883163 511157303 509709320 511269836 511563301
1707.9 511563301 514819870 515425339 517476540 520144997 522373466 526481400 527444077 534605484 538560104
1716.6 538560104 543647995 548023758 556144409 564887543 571126366 578891258 584568558 592698250
1724.3 592698250 599682922 606464653 613907356 619953346 626471443 631193542 639042320 644507065
1732 644507065 648911133 650465927 655064468 664426041 669621277 674824753 678709641 681716766 684698410
1740.7 684698410 690076065 694058075 694958344 698909454 702133179 705511703 707477417 709694901
1748.4 709694901 713164368 716870804 719568176 721373062 727147980 730866623 734321899 737004395
1756.2 737004395 738067474 742535172 745796051 749362030 752236862 753633041 756614380 760919189
1763.9 760919189 764755936 767444992 770849457 773021164 774271393 777638702 781272125 781688232
1771.6 781688232 780557785 784982300 790268707 793959579 795346680 798996201 801843109 804069290
1779.3 804069290 805641861 806240463 809706573 812255325 814534531 815438919 817383118 820743484 822457809
1788 822457809 824179687 825444946 826007080 825906982 825850067 828933182 832547379 834126358 834666977
1796.7 834666977 837179871 839004822 839410553 839605560 841268311 842067032 843932114 846875916 847960129
1805.3 847960129 849383469 850064240 850387344 851764069 852362366 851549911 852313538 854696884 855965729
1814 855965729 857337646 858142548 858616180 858862228 859219437 860251083 860140305 860783310 861202087 862410889
1823.7 862410889 863303833 860870209 861928787 863588486 864312973 862549133 859591675 862310333 864563217
1832.3 864563217 865345001 865969238 866420898 866394958 865479431 864998245 866258926 866807175 866612015 866259995
1842 866259995 867015457 867203903 862373123 864433517 866990891 866601334 866372986 866788406 867200012
1850.7 867200012 866996155 867271805 867250671 867254944 867505569 867456055 867627487 867181854 867284622 867260056
1860.3 867260056 867219696 867453842 867552872 867628021 867378082 867057877 865724030 865421219 864145126 862830429
1869.9 862830429 864806366 866364746 867100983 867236099 867404709 867207336 866954422 866909409 866831055 867065277
1879.6 867065277 866945496 867049103 866748276 866556168 865997009 865575027 866218033 866267471 866661453 865465698
1889.2 865465698 863895264 865316544 866277466 866109619 865841980 865114288 864275742 865137863 865720596
1897.9 865720596 865918808 865942230 865610275 865930939 865713577 865675278 865144958 864538040 864717941 864427338
1907.6 864427338 864425888 864492950 863989487 863992157 864679718 864294662 863912277 863714523 864034119 864917603
1917.2 864917603 862605820 862389145 863693619 863880692 863832855 861918030 861586914 862784805 863415909
1925.9 863415909 863491974 863554535 863659744 863561325 863371429 863023300 862991638 862311859 862170944 862425842
1935.5 862425842 862652740 863147659 862661819 862375946 862305222 862908630 861609344 858995514 860399323
1944.2 860399323 861404724 861413193 861369629 861458588 861667709 861311111 860929489 860467529 860408783 860614777
1953.8 860614777 860797729 860681534 860807190 861207733 861136246 861101074 860629349 859941483 859564896 859556046
1963.5 859556046 859648285 859755096 859679489 859040833 859203720 859614258 859566879 859278946 859073639 858920059
1973.1 858920059 858677597 858890228 859261475 859494247 859205627 858870316 858772659 858508759 858129578 857899475
1982.8 857899475 858163300 858245544 858254700 858187103 858015289 857507553 857099304 857784500 857623520 856620712
1992.4 856620712 856722717 857219391 857350693 857344055 857452850 857269745 857084961 856647110 856456223 856557922
2002.1 856557922 856687393 857015076 856841431 856688843 856586075 856272278 855821838 855711288 855878372 855801926
2011.7 855801926 855973434 856109467 856319885 856247635 855592194 855021439 854835892 854745789 854870377 855340042
2021.3 855340042 855080795 854831238 854959869 855192795 855327988 854973679 855238037 855124130 854574356 854543381
2031 854543381 854804764 855044861 854865189 854801178 854728241 854527512 853987427 853582306 853805313 854015121
2040.6 854015121 853923569 853908920 854367676 854438477 854215775 853762589 853607101 853824539 853574448 853528748
2050.3 853528748 853347168 853755035 854001465 853424454 853450546 853315125 852806625 852476425 852882996 853081741
2059.9 853081741 853047485 853337936 853194656 853207016 852944565 852578354 852548218 852540588 852443771 852511444 852868805
2070.5 852868805 852674484 852527466 852401810 852395554 852612610 852417297 852179565 852264175 852796860 852964935
2080.2 852964935 852939377 852887650 852818146 852826004 852483215 852221451 851994629 852136536 852234192 852163620 852462234
2090.8 852462234 852649002 852542953 852374649 852647705 852600555 852513504 852674332 852434311 852255478 852101517
2100.4 852101517 852079086 852122192 852208786 852233810 851965179 851545944 851666718 852195053 852099228 852099228 851997681
2111 851997681 851792908 851940002 852028198 851912308 851587448 851596451 851480331 851515427 851631012 851734619 851984634
2121.6 851984634 851763992 851845856 851859970 851976852 852140656 851891708 851744843 851577988 851662369 851370621
2131.3 851370621 851090317 851136780 851290970 851664658 851519470 851280518 851323624 851411743 851222534 851150284
2140.9 851150284 851322174 851581497 851720963 851146011 850759583 850885315 851298447 851402740 851121445 850783615
2150.6 850783615 850237122 850276413 850512085 850575333 850452042 850405045 850743332 850856857 850658035 850327454
2160.2 850327454 850103912 849990616 850295792 850401077 850471039 850892639 850774994 850591507 850136719 849726410
2169.9 849726410 849804306 850318375 850643845 850365753 850582504 850424347 849970322 849532394 849284134 849741364
2179.5 849741364 849803314 849627075 849554977 849519196 849419861 849567642 849506073 849162903 849198380 848945312 849167404
2190.1 849167404 849472504 849312439 849355469 849373627 849371490 849414215 849409637 849025650 848767624 848603821 848682404
2200.7 848682404 848777313 848502274 848800354 848937149 848677139 848184357 847833633 848023834 848250351 848365021
2210.4 848365021 848286057 848308792 848059006 848065491 848008804 847481918 847252197 847004700 847342606 847879105
2220 847879105 848063660 847817764 847565842 847737808 847533951 847316742 847293777 847311935 847073517 847092438
2229.7 847092438 847322388 847449265 847696915 847326202 847200089 847076035 846658478 846386261 846191483 846370087
2239.3 846370087 846438522 846634979 846753006 846572342 845883026 845397034 845560455 845311584 845110779 845103073
2248.9 845103073 845452194 845542755 845191269 844905472 844675064 844731598 844433441 844347992 844477844 844666977
2258.6 844666977 844600601 844172592 844135742 843867416 843498840 843221130 843253479 842941742 842796021 843228149
2268.2 843228149 843131943 843022690 842522583 842414017 842596970 842493134 842417755 842476349 842792282 842447815
2277.9 842447815 842415009 842288818 842336426 842563324 842314224 842673340 842541885 841772003 840631027 840684128
2287.5 840684128 841076279 840690994 840585709 839645538 839062271 838312149 838132248 838288574 837586060 837040405
2297.2 837040405 836191711 836331177 835744095 835433350 835392532 834275055 833819122 832611389 831813965
2305.8 831813965 830639877 829566193 828634186 827432785 827107697 825793228 825329285 824259872 824160461
2314.5 824160461 824639282 823001785 821889267 820168686 818883896 816952972 814948349 813575211
2322.2 813575211 812456894 812367325 811508255 811012344 809032593 808371964 807707520 806018448 805237198
2330.9 805237198 803827057 804772110 804148788 803681412 802533035 800352020 801151733 801068497 800217819
2339.6 800217819 798679657 798756790 798519058 798810730 799187393 799476242 803817062 807679901 813102188
2348.3 813102188 815820084 812323227 807846680 803548660 799073944 795242767 792131119 789580078
2356 789580078 786876984 785816574 784644394 783315659 783038712 783472595 783941727 785737534 787683487
2364.7 787683487 788942642 789816971 791119766 794015808 797200623 801248398 804173050 806145172
2372.4 806145172 808508301 810984879 813311462 814669952 816139679 817932053 820225372 822687149
2380.1 822687149 824821243 826574783 827920456 829241028 830071335 830632782 830981293 831095734 831026382
2388.8 831026382 830962677 831348877 831745300 831797485 831225739 830993195 831133728 830816727 830476685 830471497
2398.4 830471497 830910645 831023254 830938797 831018524 830731354 829927216 829461670 829478607 828915329 828660278
2408.1 828660278 829013290 829351807 829460297 829158325 828864441 828684921 828564529 828117905 827771606 827715683
2417.7 827715683 827745132 827803345 827813187 828076859 827808990 827353363 827097244 826791763 826675797 826626587
2427.3 826626587 826814804 826757812 826400146 826189041 826152039 825989990 825965881 825904770 825044708 824621353
2437 824621353 824947128 825212097 824916077 824643173 824917221 824756470 824652939 824552765 824223251 824030991
2446.6 824030991 823778076 823581009 823485413 823856888 823908920 823177567 822669678 822871323 823233643 822900848
2456.3 822900848 822444458 822411194 822512894 822441330 821878815 821282120 821217422 821487503 821697769 821380157
2465.9 821380157 821012268 820988312 820633392 820396652 820363998 820267868 820186996 819992065 819686584 819368668
2475.6 819368668 819614563 819517136 819217682 819299011 818929138 818635025 818378220 818211670 818390808 818644943
2485.2 818644943 818310471 817654266 817710876 817709579 817733612 817708130 817280197 816772079 816574631 816848373
2494.8 816848373 816866684 816815414 816649933 816534271 816066895 815577240 815901642 815820847 815665741 815525970
2504.5 815525970 815326614 815006180 814313278 814051056 814176712 814369202 814294662 814392014 814131012 813705902
2514.1 813705902 813827896 813683395 813491516 812992630 812631989 812474823 812467957 812563095 811958694 811783676
2523.8 811783676 811996689 812005081 811770172 811537628 811181335 810771408 811058350 810964737 810731049 810594635
2533.4 810594635 810220642 810197906 810480347 810623016 810085297 809547958 809347305 809195099 808818893 808678284
2543.1 808678284 808889847 808522644 808164139 808019028 807935944 807883224 807914200 807899704 807733459 807837830
2552.7 807837830 807599030 807187195 806773758 806576691 806768417 806843567 806787872 806568985 806497269 806036224
2562.4 806036224 805506134 805269241 804916000 804938583 805189896 805317917 805027161 804734039 804427338 804220810
2572 804220810 804369125 804289932 804150162 803758163 803604279 803823395 804009018 804035339 803676147 803423996
2581.6 803423996 803147659 802756424 802366791 802288284 802150803 801891327 801858215 801720276 802122269 802304382
2591.3 802304382 801761551 801072845 800846329 801320267 801393051 801060562 800696716 800683212 800518188 800224915
2600.9 800224915 800453033 800577393 800358429 799586868 799188690 799274063 799456482 799547119 799357376 799815674
2610.6 799815674 799782028 799231949 798983536 798526611 797940063 797650681 798029785 798256378 798252106 798289948
2620.2 798289948 798483429 798712082 798434143 797954102 797315979 797263260 797692490 797772675 797806931 797494583
2629.9 797494583 796829147 796412811 796291962 796377945 796582642 796574936 796264420 796011200 796284332 796283112
2639.5 796283112 795818863 795730896 795555801 795521011 795312119 794926529 795131989 795490189 795834274 795584335
2649.1 795584335 795309296 795402527 794990692 794294052 793876343 793849487 793901291 794166718 794377899 794396591
2658.8 794396591 794318848 794043884 793731766 793456802 793342972 793253860 793698654 793819351 793382416 793574600
2668.4 793574600 793437576 792735748 792357788 792846146 792881012 792100296 792230911 792669907 792624130 792419052
2678.1 792419052 792440338 792196045 791486435 790960083 790912323 791322327 791368637 791185760 791070099 791050797
2687.7 791050797 791006775 790713501 790399551 789951248 789946823 790199966 790244980 790138397 790087280 790016556 789496460
2698.3 789496460 789214478 788932114 788732605 788913879 789014969 789068146 788899460 788651962 788232422 787959061
2708 787959061 787936554 787851868 787663956 787382812 787435455 787583389 787713318 787652664 787368317 787043381 786712418
2718.6 786712418 786478500 786446991 786893387 786905975 786691284 786624374 786289444 786377029 786399231 785835953
2728.2 785835953 785240936 784988327 784867554 784803162 784691238 784619675 784881744 784831772 784693222 784478989
2737.9 784478989 784245224 784581833 784731598 784254608 783968887 784230347 784120407 783972626 784055939 783961258
2747.5 783961258 783807297 783547592 783528671 783320770 783179550 782971954 782508850 782549057 782446213 782659378
2757.2 782659378 782841949 782405396 782260971 782095718 781976013 782040253 782075119 781892929 781266937 781062317
2766.8 781062317 781210937 780934677 781103287 781398849 781270294 781326981 780881577 780425034 780463867 780180740
2776.4 780180740 779666595 779408875 779305649 779178238 779418640 779224625 778859558 778951721 778656921 778459930
2786.1 778459930 778558273 778713837 778408279 777617416 777227249 777228622 777259979 776967621 776820755 776822205 776622849
2796.7 776622849 776415939 775900345 775088882 774678650 774656372 774199142 773973541 774162750 774152756 774183502
2806.3 774183502 773779984 773237152 773261032 773263321 772624435 771912613 771760788 771694565 771174622 770617065
2816 770617065 770314560 769990082 770065231 769873505 769133835 768864441 768715057 768252335 767617874 767205200
2825.6 767205200 766718597 766456223 766498184 765917206 765534058 765114975 764647217 764873123 764756470 764236526
2835.3 764236526 763627319 762996979 762765045 762260284 761137314 760572281 760522995 760121384 759691315 759403610
2844.9 759403610 758920212 758444595 758202820 757499695 756368790 755651321 755563431 755200653 754364090 754021530
2854.6 754021530 753557434 753042297 752776413 752365341 751800766 751201859 751036224 750845032 751106949 750965729
2864.2 750965729 750077286 750121841 749781570 748977585 748238525 747537079 747467651 747501602 747571411 747181091
2873.8 747181091 746243973 745396881 744534912 743641815 743353958 743447342 743161316 742769928 742533417 742603226
2883.5 742603226 742246094 741846695 741891403 740969925 740012283 739925995 739581299 738756943 738202896 737891617
2893.1 737891617 737422104 736876984 736083755 734927979 733749390 733195114 732784653 732343063 731686401
2901.8 731686401 730558548 730261765 729945374 729247360 728908081 728092880 727115173 726560898 726282959
2910.5 726282959 725951462 725159836 723982773 723375549 722959824 722182922 721770782 721191330 720566635
2919.2 720566635 720037384 719412003 719110489 718851929 718246307 717796936 718142166 718147125 718079605 718381882
2928.8 718381882 718265305 718138657 718096466 718308716 718300705 718217926 718807373 719664764 720061035 719642715
2938.5 719642715 719464417 720102615 721483688 722430115 722480011 722576752 722020645 721624069 722025070 722205429
2948.1 722205429 722233276 722090988 722217178 722756042 722953186 723019180 722965317 722655792 722699585 722777252
2957.7 722777252 722808304 723042221 722859039 722228851 722022400 722462692 722507019 722362900 722693939 722795563
2967.4 722795563 722200546 721906586 722592926 722883911 722598038 722362518 722347946 722312622 722078400 722908249
2977 722908249 724238739 724658737 724087830 723968964 724979401 725542374 725844650 725965118 726004028 726476135
2986.7 726476135 726746368 727070389 727280350 727571030 728311310 728485565 727996750 727669907 727914429 728457260
2996.3 728457260 728530350 728345795 728367386 728030777 727476349 727667923 728571930 728528824 727894211 728141174
3006 728141174 728283615 728030701 727692184 727739182 728076248 728010254 727673492 727328415 727511444 727191696
3015.6 727191696 726752930 726829681 726547089 726675034 726477814 725837326 725783310 725641098 725105057 724646759
3025.2 724646759 724119568 723512878 723637466 723729401 723224258 722552185 721897354 721662369 721584396 721273499
3034.9 721273499 720680008 720306702 720223846 720107956 719675446 719039459 718487549 717994003 717897415 717676315
3044.5 717676315 717359009 717008820 716628723 716252136 715226669 714672394 714398117 714069443 714342422
3053.2 714342422 714368668 713629227 712741318 712221527 711677017 711350708 710751877 710033951 709812927 709483948
3062.9 709483948 709492111 709592819 709586029 708841171 707686234 707301636 706924057 706784286 706514664 705977936
3072.5 705977936 705532608 705233002 705173874 704764633 704349670 704047012 703883133 703698502 703550110 703367233
3082.1 703367233 702683105 702185211 701974335 701721954 700999908 700276718 699981079 699607391 698915100 698283386
3091.8 698283386 698146896 697482681 696806488 696207504 695447464 695643768 695554047 694772110 694174194 694007950
3101.4 694007950 693694916 693084869 692384567 691171188 690278931 689931641 689739380 689421844 688816223
3110.1 688816223 688143158 687551346 687078552 686559830 686202927 685308075 684306946 683841553 683547897
3118.8 683547897 683621902 683614655 683500519 682521362 681266708 680931931 680869522 680852432 680427170 680150833
3128.4 680150833 679938660 679361877 679006271 678748932 678383713 677661667 677210388 677368164 677593155 677631149
3138.1 677631149 677547150 677363281 676852036 676076279 675099716 674267502 674055862 674580765 674683533 673937912
3147.7 673937912 673586807 673451309 673296356 673081665 672349396 671339035 670770264 670691452 670308914 669826508
3157.4 669826508 669858856 670214233 669953995 669357224 669242935 668723755 667557602 666511307 666168976
3166 666168976 666425323 666387024 665882492 665471039 664925308 664320908 663907242 663259583 662736206 662157516
3175.7 662157516 661960678 662225037 661814499 661315002 660616302 659724655 659213638 659050446 658793106 658014221
3185.3 658014221 657375412 656515274 655607452 655310211 655330887 655392303 654746933 653414536 652505875 652240677
3195 652240677 651850357 651568222 650863571 649776535 649589157 649666977 649638290 649217682 648524857 647679596
3204.6 647679596 646842651 646530762 645811234 644928665 644190598 644029465 644219666 643531876 642848740 642153091
3214.3 642153091 641428375 641106186 640591583 640328445 640010376 638879738 638193359 637835159 637200432
3222.9 637200432 637122307 636405449 635444679 635185738 634520912 634052238 633678207 633140450 632781181 632847786
3232.6 632847786 633159447 632797775 632100258 630841789 629524498 628982697 628803749 628900871 628360214
3241.3 628360214 627655716 627787666 627588234 626650658 625629692 625237999 625287437 624413872 623503876 623239670
3250.9 623239670 623133812 623457184 622735214 621782417 621751823 621138916 620363998 619774170 619719887 619923134
3260.5 619923134 619624939 619313354 618588257 617858696 617337112 616687088 616709595 616835289 616715279 616834373
3270.2 616834373 616207428 615341339 614996071 614232826 613475037 612624626 612007828 612350235 612306442 612111702
3279.8 612111702 612184906 611786346 611136818 610445328 609887962 609455986 609252357 609754982 609803047 608660355
3289.5 608660355 607593575 607132988 606901398 606242867 605416794 604691811 604022903 603746529 603259430
3298.2 603259430 602716942 602392044 602042542 601619911 601090088 600642014 599883270 599206467 598792610 597928619
3307.8 597928619 596514587 595789299 595746574 594888496 594168472 593568115 592463875 591604881 591258202
3316.5 591258202 590976715 589912338 588999863 588294411 587694397 587235565 586422043 585942955 585327187
3325.2 585327187 584285431 582775383 581792946 581527290 580882111 580147896 579049072 578262215 577180367
3333.8 577180367 575831757 575263443 574394913 573499184 572533951 571404839 570222626 569445267 568782349
3342.5 568782349 567564011 566969566 566312065 565371819 564359627 563184967 562147217 560947609 560086174
3351.2 560086174 559179649 558198204 556985664 555132217 553277206 552106361 551603813 550788765 550032959
3359.9 550032959 549214706 547801743 546128883 544809799 544196014 543472023 542721367 541733894 540133820
3368.6 540133820 538323517 537191925 536708832 535814629 535052643 534213982 533429680 532733231 531062813
3377.2 531062813 529178047 528249817 527905998 526962318 526020126 525197411 524214783 523508110 522820969
3385.9 522820969 522420883 521949196 521351318 520368080 519204330 518934937 518746300 517671280 516448784
3394.6 516448784 516157875 515693321 514499435 513959122 514067574 513654060 512469254 512065468 511900978
3403.3 511900978 511027145 510281487 509757080 509305992 508750610 508240776 508004608 508011780 507795143 507420425
3412.9 507420425 507156296 506476517 505717697 505255775 505030632 504981918 504964027 504623108 504430885 505021019
3422.6 505021019 505184898 504605713 504052773 503775711 503725662 503900833 504389420 504718018 504418297 503950233
3432.2 503950233 503775368 503693085 503720551 503527145 503227692 503218918 503542557 504116516 504734116 505211258
3441.8 505211258 504951515 505403900 506218796 506288490 506454964 505991249 506393814 507393227 507912216 508569832
3451.5 508569832 509240837 509687538 509614944 510143700 510606995 511262817 512534142 512847252 513030968 513236351
3461.1 513236351 513871269 514634399 515117226 515791779 516837502 517898102 517908363 518761101 519687958
3469.8 519687958 519867439 520527573 521369972 522370567 522789993 523308144 524029694 525091743 526252022
3478.5 526252022 526835937 527642860 528181419 528620529 528916397 530080490 531538429 532395592 533628349
3487.2 533628349 533840332 534192581 535503960 536553001 537238960 538038712 539041710 539878616 541100082
3495.8 541100082 541957321 542961311 543998108 544451294 545537453 546866989 547513962 547271843 547776146
3504.5 547776146 549019775 549805527 550909920 552807922 553788948 554269218 556041718 557081833 558042526
3513.2 558042526 559450722 560667953 561930504 562791061 563854942 564505653 565424995 567247505 569552994
3521.9 569552994 570825615 570279655 571488075 573365364 574875259 576205025 576978951 578137894 580100479
3530.6 580100479 581524849 582019806 583463249 584958076 586697273 587706299 588311996 590605202 591932564
3539.2 591932564 592948875 594343491 596483231 598534584 599875374 601349678 602064590 603505592
3547 603505592 603622818 605257454 608278656 610566368 612311134 611500664 613050003 614872704 616644859
3555.6 616644859 618683205 619505234 622590179 624511299 624786987 625662727 628196487 629625397 630000000
3564.3 630000000 634505959 635150566 634425087 634951782 635294724 640227737 642858887 644306030 646058350
3573 646058350 647220612 648327026 650025177 652408752 653161392 655390549 657335434 658302231 660142899
3581.7 660142899 661810455 663112030 663730927 667450638 668899155 666485901 667899628 668012238 671438828
3590.4 671438828 675507202 678887787 679784241 679157410 681177750 680410385 682777100 685958710 686734924
3599 686734924 689405441 689819946 690449371 693233337 695095139 696527176 699776764 702316208 700444794
3607.7 700444794 703012009 702746735 702813644 709570923 709866104 708095551 711642075 710453949 713527298
3616.4 713527298 716875458 715695953 716456070 715724564 717065048 720288010 722803497 725208969 727578888
3625.1 727578888 728656540 729978867 735386505 733160629 724110794 728789291 733740997 739251785
3632.8 739251785 740367355 739430923 742042465 744560699 746779404 747039795 747900696 749886780 751585236
3641.5 751585236 752330856 753432159 756099167 758464584 761664886 758193130 754663086 759740753
3649.2 759740753 758569336 755833817 757630157 764189301 769143906 773111572 776065292 768142929
3656.9 768142929 771300735 776534119 777088623 778113937 778824387 780403137 781446762 782719193 783862305
3665.6 783862305 784627533 787954865 788956909 787768402 787119598 781326370 784195480 791822205 798848114
3674.3 798848114 795896072 780763702 784161072 791113968 794775696 792624283 793403702 796145477
3682 796145477 797359543 798065796 797737656 797566528 800670700 805344009 795257339 790398941 797023315
3690.6 797023315 792660980 793768082 799002304 799699249 800935593 800570755 799792557 800530624 800446472
3699.3 800446472 802734756 804580460 798256454 796026459 799846649 800881653 801308670 801829681 803269272
3708 803269272 805013123 798507538 801707077 802459946 791749496 797523804 801484375 802393570 803031540
3716.7 803031540 804108582 803761978 798838577 799794312 804641876 799892426 795784454 799986496 800543213
3725.4 800543213 799906387 797910080 798733978 801494904 801469193 805626602 802384567 795481567 802521057
3734 802521057 802142715 792384949 792996902 795900040 796504593 799629517 802058411 797962189 801302109
3742.7 801302109 811758270 801912689 785870209 794814758 800837173 805744781 799726486 789905243
3750.4 789905243 800241165 796442795 790990448 795963440 800367432 803649902 798875122 801016617
3758.2 801016617 805610886 797929077 797099380 800685272 801748581 802507935 805312271 803111877 799207382
3766.8 799207382 801809845 804809189 802540512 795371246 797966537 800932770 801372528 801717911 800858231
3775.5 800858231 801658707 802458038 804498749 803279800 796423798 798767166 800233612 800919037 802089081
3784.2 802089081 798554230 798609924 800411301 800974350 801228790 800872879 800697403 800818176 802080231
3792.9 802080231 800897980 800457687 802568359 798446503 795586624 797517929 800270615 804032822
3800.6 804032822 798375168 789629440 792212982 796051712 801457291 806261673 795641174 791813965
3808.3 791813965 796677856 798232803 798752441 798981552 799150314 800902786 805031433 801029205 787579269
3817 787579269 793177109 799141846 802345810 800397415 785583191 788938446 793448181 795551758
3824.7 795551758 798382950 798578873 794657440 795111771 797164536 799559631 799457932 791036453 794597855
3833.4 794597855 801231995 794946365 794177246 800064087 790671616 787909622 795400314 791551590
3841.1 791551590 792878723 798940430 795562668 792034378 794600906 796034470 796112900 797247391 795266418
3849.8 795266418 796418381 801987152 796083221 793972092 778609314 782833939 792942200 791998596
3857.5 791998596 791552582 793893356 795319901 796527863 791346283 791698532 797187958 790668182 786557541
3866.2 786557541 791852570 796646194 800588074 791042862 782095261 787406311 795270615 798475342
3873.9 798475342 786965256 788635406 793488770 793803024 796254578 799385834 792428513 785523376
3881.6 785523376 791444016 792999878 793770981 797594147 785834656 787301559 792012405 793311234
3889.3 793311234 796504059 793905792 786331406 788406601 791380615 790183563 791644211 793364410
3897 793364410 795710526 795645142 785468597 790860443 793215179 788340149 791994858 788086166 787243881
3905.7 787243881 789036636 790391922 792350159 792139893 792172546 791846695 791838684 790942841 790036621 792265320
3915.3 792265320 794766312 790408707 786466599 790890121 791016312 787684784 789878769 790850906 790893478
3924 790893478 789353561 787650452 788956528 790272522 790866318 789201584 789474335 791296158 787877426
3932.7 787877426 786699524 788916473 789548950 790300980 790606155 789592209 789336166 789666748 791284866
3941.4 791284866 791738129 787311859 787040939 789225845 790313263 791181030 789015427 788711472 788623199
3950.1 788623199 786931839 788257523 788710327 789078827 789942474 789997864 789660645 788516846 788710403
3958.7 788710403 789129257 789618301 789405670 788130188 788444214 788343201 788088455 788520126 788617249 788566208
3968.4 788566208 788260956 788333588 788669128 788454056 788363876 788763962 788885345 788247681 787559052 787980804
3978 787980804 788036270 787474136 788225861 789377213 789233780 787970581 787452393 787770996 787740250 786903839
3987.7 786903839 786421356 787285690 787271423 786910858 787142181 787238083 787180023 786670074 786561127 786319122
3997.3 786319122 786164856 786888809 787754517
4000.2 787754517
##END=$$ End of the data block
