##TITLE=$$ Begin of the data block
##JCAMP-DX=5.00 $$ ACD/SpecManager v 10.08
##SPECTROMETER/DATA SYSTEM=16PC
##DATE=Mon Sep 02 15:11:20 2013
##DATA TYPE=INFRARED SPECTRUM
##DATA CLASS=XYDATA
##ORIGIN=
##OWNER=
##NPOINTS=3601
##FIRSTX=400.00000000
##LASTX=4000.00000000
##MAXX=4000.00000000
##MINX=400.00000000
##MAXY=40.65529633
##MINY=12.61901951
##XFACTOR=1.0000000000
##YFACTOR=0.000000100000000
##FIRSTY=20.91539383
##DELTAX=1.00000000
##XUNITS=1/CM
##YUNITS=TRANSMITTANCE
##XYDATA=(X++(Y..Y))
400B09153938N5205269M3602257K7864990J3041306K949333j239052r45740J102677
408C50734978K522354K342186J045265j96495m63600L84903J798553L020325L566017
417C64754486L412170K868920K312050J976089J896057J958924J982002J773186J183700
426C84117584J72882j136970k463341l460312l871727l653869k987252k166023j440887
435C63110085r15947n56946k81334n2185R4719R7351o6948l53661o80732r80759j227913
446C58185730j420555j545372j567154j458740j247101j023026q89358q76923q91456
455C47266045p46575k75574N46380J553001K457123K996940L071747K778244K327385
464C61974716J905060J567345J245460Q46481L74756k2926j25236K16751R55658J834602
$$ plain form
400 209153938 264359207 307961464 335826454 348867760 351817093 350578041 349632301 350734978
408 350734978 353257332 355599518 356644783 356448288 355984688 356369591 358168144 361188469 364754486
417 364754486 368166656 371035576 373347626 375323715 377219772 379178696 381160698 382933884 384117584
426 384117584 384290466 383153496 380690155 377229843 373358116 369704247 366716995 364550972 363110085
435 363110085 362194138 361637192 361355858 361303673 361398392 361495743 361428795 361075134 360394402 359413643 358185730
446 358185730 356765175 355219803 353652649 352193909 350946808 349923782 349034424 348157501 347266045
455 347266045 346519470 346243896 346790276 348343277 350800400 353797340 356869087 359647331 361974716
464 361974716 363879776 365447121 366692581 367539062 367913818 367890892 367765656 367982407 368938065 370772667
474C70772667K504501K706871K411499J823769J259155R64470R94225J212082J401481
483C86050720J402474J184883Q19664L87726r5024o77491j401520k222061k984085
492C82465286l484955l576965l239937k576256j737213q41674N5007R26934J720123
501C69710350K327385K622948K528228K052765J269837K47421j002846k501411m200821
510C73053856n877991p116089p422638o448440m190788j061326K233963M952012O579055
519C54701614O982117O386604N216866L897324K713241J777153J083412N93567K90642
528C83642540J81999K61879M71726O92176P80144O30303K32582l14408q39615j176223
538C84563103j236420j046448p23419m07104j91117q8997n5694l9330k6741m6653j34163
$$ plain form
474 370772667 373277168 375984039 378395538 380219307 381478462 382442932 383437157 384649239 386050720
483 386050720 387453194 388638077 389457741 389845467 389750443 389072952 387671432 385449371 382465286
492 382465286 378980331 375403366 372163429 369587173 367849960 367008286 367063293 367990227 369710350
501 369710350 372037735 374660683 377188911 379241676 380511513 380758934 379756088 377254677 373053856
510 373053856 367175865 360059776 352637138 346188698 341997910 340936584 343170547 348122559 354701614
519 354701614 361683731 368070335 373287201 377184525 379897766 381674919 382758331 383351898 383642540
528 383642540 383824539 384086418 384558144 385250320 386030464 386660767 386893349 386578941 385739326 384563103
538 384563103 383326683 382280235 381556816 381149712 380958595 380869598 380813904 380774574 380747833 380701180 380567017
549C80567017k87781m54598n61676n70182n12581m80919n71480q23593j195030j587868
559C73521309j904259k090607k138519k050895j807747j366311p01942J38855J018715
568C62618599J744270K143975K142715J791458J235161O44836J49270j95008l96728
577C71878548m95835n30853n20592m62341l40996j45149J15738L96805O20842P03354
587C71219521N92613L04985p3013m24843o66352p90672q62427r59434j102791j226196
597C66011391j214905r92317n94254j72844Q1978N9319j94436m90837o03370l96881
607C61492844R5443O96144J185532J418953J386795J192970R74999Q26149P63130P51114
617C70784073P52449P60612P95517Q69561R54666R79194Q58918N47371P4729m44335
$$ plain form
549 380567017 380279236 379824638 379262962 378692780 378180199 377699280 377127800 376304207 375109177 373521309
559 373521309 371617050 369526443 367387924 365337029 363529282 362162971 361461029 361599884 362618599
568 362618599 364362869 366506844 368649559 370441017 371676178 372321014 372470284 372275276 371878548
577 371878548 371382713 370851860 370331268 369868927 369527931 369382782 369498520 369895325 370516167 371219521
587 371219521 371812134 372117119 372044106 371619263 370952911 370162239 369299812 368340378 367237587 366011391
597 366011391 364796486 363804169 363209915 363037071 363119049 363178368 362983932 362493095 361889725 361492844
607 361492844 361588287 362284431 363469963 364888916 366275711 367468681 368443680 369269829 370032959 370784073
617 370784073 371536522 372297134 373092651 373962212 374916878 375896072 376754990 377302361 377377090 376932755
627C76932755q43697r64279p20406j45302O02913J287575J679573J653366J248512
636C80731010O57425J36414j20659q0528J18942K58370J72348j48468n58053q57276
646C80309525r32580q34999p45277q49495j212196j741371k267342k675781k986985
655C66063499l310165l701973m037514m015388l326492j894608k0485J694412K633019
664C50084305K500915J506653K65503n31959m88053L09677J376114K128601K205811
673C59357567J626396P17545j04447n52444n66368k70615J36566M76761O25725N09567
683C61956253J07765n27153j262054j928635k422142k794227l254853m051742n276795
692C40546417o724815p915878q298569p532978n688458l228149p84264J154328K458477
$$ plain form
627 376932755 376089058 375124779 374404373 374259071 374861984 376149559 377829132 379482498 380731010
636 380731010 381388435 381524849 381404190 381323662 381442604 381700974 381873322 381724854 381166801 380309525
646 380309525 379376945 378541946 377796669 376947174 375734978 373993607 371726265 369050484 366063499
655 366063499 362753334 359051361 355013847 350998459 347671967 345777359 345756874 347451286 350084305
664 350084305 352585220 354091873 354357376 353825417 353337364 353647041 355023155 357151756 359357567
673 359357567 360983963 361701508 361597061 361044617 360478249 360207634 360344200 360820961 361446686 361956253
683 361956253 362064018 361536865 360274811 358346176 355924034 353129807 349874954 345823212 340546417
692 340546417 333821602 325905724 317607155 310074177 304385719 301157570 300373306 301527634 303986111
701C03986111L362102M260216N432548O854554Q202285R032212R022331Q137779O635475
710C64925613M926339L382110K196350J360512P44553K18506k62604o51283q65326
719C75974770q63533o87523m46015k58293j96304k60658m00162n54123o88362q01697
729C70818100r09996j022186j134110j236801j331635j432838j555786j700440j851196
738C58643112j993904k140160k330055k604866k959289l310967l521805l470649l144112
747C33167305k682724k343407k381477k908897l809853m762688n367660n316010m519272
756B99075317l134327j484355P9574J301575K077122K430686K446766K204781J752491
765C06749630J123276L72925l96424j049633j462593j574116j414814j097221p68833
$$ plain form
701 303986111 307348213 311608429 317040977 323895531 332097816 341130028 350152359 358290138 364925613
710 364925613 369851952 373234062 375430412 376790924 377535477 377753983 377491379 376840096 375974770
719 375974770 375111237 374423714 373977699 373719406 373523102 373262444 372862282 372308159 371619797 370818100
729 370818100 369908104 368885918 367751808 366515007 365183372 363750534 362194748 360494308 358643112
738 358643112 356649208 354509048 352178993 349574127 346614838 343303871 339782066 336311417 333167305
747 333167305 330484581 328141174 325759697 322850800 319040947 314278259 308910599 303594589 299075317
756 299075317 295940990 294456635 294536209 295837784 297914906 300345592 302792358 304997139 306749630
765 306749630 307872906 308245831 307849407 306799774 305337181 303763065 302348251 301251030 300482197
774C00482197n52578n01805n87768p21207p95955p30191m94518j14918L43533Q04996
784B97131786J211567J544152J825256K104015K423687K787342L137970L369427L369579
793C18904781L080578K543411J901780J352768J064338J100426J392784J778908K085876
802C35205650K215920K184944K093887K054444K112503K222404K283058K214852K019806
811C54607468J785049J621857J578140J584206J475486J083603L47596o23284j576347
820C61883774k220841k353630j939926j108017p2479R62295J866875K589150L113937
829C62721138L420715L470955L236008K737999K071266J382408Q17642M64402L20625
838C80643158L05824L06206K29988M8866j94435m06532m86794l70521n8365L81165
$$ plain form
774 300482197 299929619 299427814 298840046 298118839 297322884 296592693 296098175 295983257 296326790 297131786
784 297131786 298343353 299887505 301712761 303816776 306240463 309027805 312165775 315535202 318904781
793 318904781 321985359 324528770 326430550 327783318 328847656 329948082 331340866 333119774 335205650
802 335205650 337421570 339606514 341700401 343754845 345867348 348089752 350372810 352587662 354607468
811 354607468 356392517 358014374 359592514 361176720 362652206 363735809 364083405 363460121 361883774
820 361883774 359662933 357309303 355369377 354261360 354188881 355151176 357018051 359607201 362721138
829 362721138 366141853 369612808 372848816 375586815 377658081 379040489 379858131 380322533 380643158
838 380643158 380948982 381255188 381485176 381534042 381339607 380933075 380446281 380075760 380017395 380398560
848C80398560Q36067J191787J372452J363793J209716R85642P66373O02340N13268
857C89239998M95300N30243N89295O32057O10351M82521K36054r5101m34188o89507
867C91597023p97844p57561o33354n25093n18379o38771q37059j010514j048202q77838
877C83952408m93279M8867O55212J229477J697617K016906K170754K160415J999741
886C95438118J718445J365967J008987P15904N34134M70810M90074N31731N40619M93812
896D03308601M05350L12157K46506K17094K06909J88561J43699P2022j3314r7770j73760
907D04816055k38380k86522l07770k94380k50855k00500j72157j80016k06718k09275
917D02469482j46179r002J66168L17688L99360M10462L96919M12407M74434N42221
$$ plain form
848 380398560 381234627 382426414 383798866 385162659 386372375 387358017 388124390 388726730 389239998
857 389239998 389735298 390265541 390854836 391486893 392097244 392579765 392815819 392720718 392286530 391597023
867 391597023 390799179 390041618 389408264 388883171 388364792 387726021 386888962 385878448 384830246 383952408
877 383952408 383459129 383507996 384163208 385392685 387090302 389107208 391277962 393438377 395438118
886 395438118 397156563 398522530 399531517 400247421 400781555 401252365 401742439 402274170 402814789 403308601
896 403308601 403713951 404026108 404272614 404489708 404696617 404885178 405028877 405100899 405087585 404989815 404816055
907 404816055 404577675 404291153 403983383 403689003 403438148 403237648 403065491 402885475 402678757 402469482
917 402469482 402323303 402314301 402480469 402798157 403197517 403607979 404004898 404417305 404891739 405433960
927D05433960N39970M11492J67541j08604l05901l53584k67258j40953q8501j74179
937D05113983l74832n98030p43713p64885o92368o07872n87273o53495p65877q52585
947C98473053q58803p81479o67228n78881n51986n68314n63393m62112k22511J35421
957C93353767N30892Q55293J018562R87320P99103N42297L16582J90163J75819K36206
967C99006004L10402L47786L29209K67219J90010J21613P2212L9329J7624L701p401
978D00697708k9449q7357k07252l96653o29081q44689r72252r63592q19550n93071
988C95154762l64761k05498j44958j67885k33917l10250l93600n08919o83594r18693
998C91222687j173134j375694j457863j387139j185455r16634o56814m62494l53355
$$ plain form
927 405433960 405973930 406385422 406552963 406444359 406138458 405784874 405517616 405376663 405288162 405113983
937 405113983 404739151 404141121 403397408 402632523 401940155 401332283 400745010 400091515 399325638 398473053
947 398473053 397614250 396832771 396165543 395586662 395034676 394466362 393902969 393440857 393218346 393353767
957 393353767 393884659 394739952 395758514 396745834 397544937 398087234 398403816 398593979 398769798 399006004
967 399006004 399316406 399664192 399993401 400260620 400450630 400572243 400644455 400683784 400701408 400705109 400697708
978 400697708 400668259 400580902 400373650 399976997 399347916 398503227 397530975 396567383 395747833 395154762
988 395154762 394790001 394584503 394439545 394271660 394037743 393727493 393333893 392824974 392141380 391222687
998 391222687 390049553 388673859 387215996 385828857 384643402 383726768 383069954 382607460 382254105
1007C82254105l18756l37792l98521n03998o62804q73527j115342j352958j551361
1016C75139046j694374j792527j879768j995354k164306k377053k579536k675438k547569
1025C55433121k092247j265335j17798J195488K447204L404389L905945L915939L527985
1034C70354691K916488K261620J683540J219521Q46481N29556K61307O8207j6442R499
1044C80134468R7923J64605J30310l6850l03193n85861p95402q77457q35380p22199
1054C76370964o13480n74035o38085q03642j042442j313210j576233j801643j976128
1063C66032066k105636k214203k337418k513618k772217l127022l574447m099656m684867
1072C38602982n318642o000214o736450p531357q372955r220562j0003777j0632343
$$ plain form
1007 382254105 381935349 381597557 381199036 380695038 380032234 379158707 378043365 376690407 375139046
1016 375139046 373444672 371652145 369772377 367777023 365612717 363235664 360656128 357980690 355433121
1025 355433121 353340874 352075539 351957741 353153229 355600433 359004822 362910767 366826706 370354691
1034 370354691 373271179 375532799 377216339 378435860 379282341 379811897 380073204 380141411 380124969 380134468
1044 380134468 380232391 380396996 380527306 380490456 380187263 379601402 378806000 377928543 377093163 376370964
1054 376370964 375757484 375183449 374545364 373741722 372699280 371386070 369809837 368008194 366032066
1063 366032066 363926430 361712227 359374809 356861191 354088974 350961952 347387505 343287849 338602982
1072 338602982 333284340 327284126 320547676 313016319 304643364 295422802 285419025 274786682
1080B74786682j1018906j1102008j0859623j0305634r472065q389988p083969n586262
1088B00968227l963146k331123q44078L52802J186600J703815K073250K532959L301468
1097B04980774M489441O050396P789631R424324J0668545J1313056J1275101J0612259
1105B76603527R501839Q195553O957035N995922N411606N166816N105057N010834M693985
1114C32642174M066276L178177K198525J348495Q17757O99386R66607J496658K122497
1123C49536552K689095L091354L286515L283081L119507K841835K489852K089730J657982
1132C74085503J207122P53441L19748o6871l85819o30646q11386r45434j040459j082535
1142C71402664j036529q65975n59540j51023K83546O52695Q86993R65729R19189Q05092
$$ plain form
1080 274786682 263767776 252665768 241806145 231500511 222028446 213638458 206554489 200968227
1088 200968227 197005081 194673958 193829880 194182682 195369282 197073097 199146347 201679306 204980774
1097 204980774 209470215 215520611 223310242 232734566 243403111 254716167 265991268 276603527
1105 276603527 286105366 294300919 301257954 307253876 312665482 317832298 322937355 327948189 332642174
1114 332642174 336708450 339886627 342085152 343433647 344251404 344950790 345917397 347414055 349536552
1123 349536552 352225647 355317001 358603516 361886597 365006104 367847939 370337791 372427521 374085503
1132 374085503 375292625 376046066 376365814 376298943 375913124 375282478 374471092 373525658 372485199 371402664
1142 371402664 370366135 369500160 368940620 368789597 369073143 369725838 370612831 371578560 372497749 373302841
1152C73302841O76270N57670M45328L22189J77994J8349j40801k84919m10462n22957
1162C74141502o30836p36237q32977r07402r41315r15146q17642o61850n03464m42466
1172C66752167n93224j024208j691742k411957k902832k894668k262154j106033K65846
1181C52131195J459961K163811K270965J903076J322518P89184M43917K73361J63231
1190C62921219q087k94953o68907j058121j405220j702194j986160k304497k681885
1199C50811195l108253l555641m004708m464187m968415n561218o274624p118168q082218
1208C03673763r146957j0288925j1478005j2662544j3751526j4605007j5044117j4884396
1216B01812286j3989601j2326145r997024p234679m348469j641349O71835K511615
$$ plain form
1152 373302841 373979111 374536781 374982109 375304298 375482292 375500641 375359840 375074921 374664459 374141502
1162 374141502 373510666 372774429 371941452 371034050 370092735 369177589 368359947 367698097 367194633 366752167
1172 366752167 366158943 365134735 363442993 361031036 358128204 355233536 352971382 351865349 352131195
1181 352131195 353591156 355754967 358025932 359929008 361251526 362040710 362484627 362757988 362921219
1190 362921219 362913132 362618179 361949272 360891151 359485931 357783737 355797577 353493080 350811195
1199 350811195 347702942 344147301 340142593 335678406 330709991 325148773 318874149 311755981 303673763
1208 303673763 294526806 284237881 272759876 260097332 246345806 231740799 216696682 201812286
1216 201812286 187822685 175496540 165499516 158264837 153916368 152275019 152946854 155458469
1224A55458469L930083N060587O049099O998462P945538Q871097R726830J0458946
1232B14499111J1019802J1368084J1469650J1304131J0877724J0231724R440975Q597889
1240B98809090P790813P083244O503849O047745N685921N379219N091133M795303M477196
1249C51663513M128723L740769L300018K793655K220498J599044R61724L32908k95753
1258C70445099r74426j770707k719726l773880m788437n561066n911407n756493n140075
1267C34048882m198304l085212j909829p24449M31977J474342K244530K549438K243958
1276C33075333J309471j23825j826821l561172n157318o531716p647686q450260q828907
1285B92257099q634643p744599o136169l929806j378555J188354L443604N131950O116219
$$ plain form
1224 155458469 159388552 164449139 170498238 177496700 185442238 194313335 204040165 214499111
1232 214499111 225518913 236886997 248356647 259660778 270538502 280770226 290211201 298809090
1240 298809090 306599903 313683147 320186996 326234741 331920662 337299881 342391014 347186317 351663513
1249 351663513 355792236 359533005 362833023 365626678 367847176 369446220 370407944 370740852 370445099
1258 370445099 369470673 367699966 364980240 361206360 356417923 350856857 344945450 339188957 334048882
1267 334048882 329850578 326765366 324855537 324131088 324563065 326037407 328281937 330831375 333075333
1276 333075333 334384804 334260979 332434158 328872986 323715668 317183952 309536266 301086006 292257099
1285 292257099 283622456 275877857 269741688 265811882 264433327 265621681 269065285 274197235 280313454
1294B80313454O391182O068935N340099M421502L500061K690982K018052J422271P91130
1303C12957668R92j038399k339820l804589n207500o220246o483268n716915l838673
1312B78309250j035404K252464N440521P969284R464836R829369R229374Q000488O518707
1321C35978889N092431L908462L031578K437782K054024J791725J569825J325531J014785
1330C58205032O02608N0163o81915j603775k645302l614502m208717m102326l088417
1339C38912849j209411J202202L612480N476837O441421O455155N742607M662361L537941
1348C74834442K551956J743279J078300N28260R8114k04659m20608o60439j074142
1357C78474503j781350k805481m043312n282135o251602o690216o414261n376625l704223
$$ plain form
1294 280313454 286704636 292773571 298113670 302535172 306035233 308726215 310744267 312166538 312957668
1303 312957668 312958660 311920261 309580441 305775852 300568352 294348106 287864838 282147923 278309250
1312 278309250 277273846 279526310 284966831 292936115 302400951 312230320 321459694 329460182 335978889
1321 335978889 341071320 344979782 348011360 350449142 352503166 354294891 355864716 357190247 358205032
1330 358205032 358807640 358857803 358175888 356572113 353926811 350312309 346103592 342001266 338912849
1339 338912849 337703438 338905640 342518120 347994957 354436378 360891533 366634140 371296501 374834442
1348 374834442 377386398 379129677 380207977 380736237 380834351 380629692 380209084 379548645 378474503
1357 378474503 376693153 373887672 369844360 364562225 358310623 351620407 345206146 339829521 336125298
1366C36125298j691514K66495J786843K619285K717858K227668J398354M71687l92990
1375C45528984j127434j712761k131576k355042k367439k198067j923523j630478j361236
1384C28721428j084404p16286j85432N01327J234169J835022K136574K062836J668510
1393C36173744J117707O10694K93808J97029K28158K28652O3248l05672p99980j276474
1403C36530914j614036j782379j849862j920356k052422k213821k312050k278595k145004
1412C18362389k049923k158451k542782l099728l564796l624554l069134j905327l70006
1421B95977688J159267K317124K896061K924060K638894K367248K358055K647648L029041
1430C18315086L156090K739754J731415L85551q49495j556091j560974j010170k68097
$$ plain form
1366 336125298 334433784 334700279 336487122 339106407 341824265 344051933 345450287 345921974 345528984
1375 345528984 344401550 342688789 340557213 338202171 335834732 333636665 331713142 330082664 328721428
1384 328721428 327637024 326920738 326735306 327236633 328470802 330305824 332442398 334505234 336173744
1393 336173744 337291451 337902145 338195953 338392982 338621140 338849792 338913040 338607368 337807388 336530914
1403 336530914 334916878 333134499 331284637 329364281 327311859 325098038 322785988 320507393 318362389
1412 318362389 316312466 314154015 311611233 308511505 304946709 301322155 298253021 296347694 295977688
1421 295977688 297136955 299454079 302350140 305274200 307913094 310280342 312638397 315286045 318315086
1430 318315086 321471176 324210930 325942345 326327896 325478401 323922310 322361336 321351166 321083069
1439C21083069K84538M25606J39770m55856j218529k028865k759362l234119l263016
1448C08973236k771435j933460j176338r93061j639500k914944m198112m762192m196682
1457B84387512k671280q58822M50440Q08067L55301k94952m60377J82877J411991K612018
1467B85922775L161488K802086J771316O41918j5602O4373P41806J601258K211532
1476B98902950K352181K089805J687470J422882J429386J639786J847896J839295J518249
1485C14729900R69200M29554J84746M31595J166096K154064L018684L423195L273964
1494C29780998K826119K597770L095551M472542O323280P775879P893562O194382K996635
1503C73956718o40373l387985m288902l212776q69675J609459L264847L724556L236465
$$ plain form
1439 321083069 321367607 321793213 321932983 321477127 320258598 318229733 315470371 312236252 308973236
1448 308973236 306201801 304268341 303092003 302098942 300459442 297544498 293346386 288584194 284387512
1457 284387512 281716232 280857410 281307850 282115917 282471218 282176266 281715889 281898766 283310757 285922775
1467 285922775 289084263 291886349 293657665 294299583 294283981 294348354 295090160 296691418 298902950
1476 298902950 301255131 303344936 305032406 306455288 307884674 309524460 311372356 313211651 314729900
1485 314729900 315699100 316128654 316313400 316744995 317911091 320065155 323083839 326507034 329780998
1494 329780998 332607117 335204887 338300438 342772980 349096260 356872139 364765701 370960083 373956718
1503 373956718 373316345 369928360 365639458 362426682 361557007 363166466 366431313 370155869 373392334
1512C73392334K360191J567002J004295N40047j5183p01523j365852j774063j769600
1521C73237648j349373o35452K02675R95025J573944J781846J537475R35288K85453
1530C78564529J984L61328J267166K207146K480812J597824l88260k830085m772606
1539C78489838n419693m518395k454681l3570J912079K869797K802277K080002J265411
1548C76993065Q57239J080551J783752K474747K513008J411018q65478l757286o251793
1557C76238823p291184o278572l424720K72560L440475M945755M408455K349167j00975
1566C74559784j773682k026825j011009M75731J453018J287308M005j764221l150062
1575C68054047l523903k805939j457024j77917M89578M24538q3351n74112p18994m88243
$$ plain form
1512 373392334 375752525 377319527 378323822 378863869 378848686 378147163 376781311 375007248 373237648
1521 373237648 371888275 371252823 371455498 372450523 374024467 375806313 377343788 378279076 378564529
1530 378564529 378566513 378927841 380195007 382402153 384882965 386480789 386092529 383262444 378489838
1539 378489838 373070145 368551750 366097069 366063499 367975578 370845375 373647652 375727654 376993065
1548 376993065 377850304 378930855 380714607 383189354 385702362 387113380 386247902 382490616 376238823
1557 376238823 368947639 362669067 359244347 359516907 362957382 367903137 372311592 374660759 374559784
1566 374559784 372786102 370759277 369748268 370223999 371677017 372964325 372968330 371204109 368054047
1575 368054047 364530144 361724205 360267181 360089264 360578842 361003380 360920029 360345917 359626923 359138680
1585C59138680j10589J15853J4305m00658r84344j584091k114067k549706k866173
1594C48659210k999153k861023k398949j645164p20978J97029R21440J289101J194038
1603C41635551O35796k34108j114082j650963j618652j082840m24042j63689o64444
1612C35318527j885605l361435m441299m658546l996735k892513j973591j706467k168331
1621C08234005l061943l929157m404621m360638l898678l250122k681274k449589k779217
1630B77418766l804913n477733p491913r324589j0415954j0422688r405556p830543
1638B13244877o364575n564746n619450o272278o956978p068596o234970m468097k129994
1647A62565193K59342K282734L824749N104809O514320Q333340J0484142J2481118
$$ plain form
1585 359138680 359028091 359143944 359158249 358757591 357773247 356189156 354075089 351525383 348659210
1594 348659210 345660057 342799034 340400085 338754921 338033943 338230972 339152412 340441513 341635551
1603 341635551 342271347 342037239 340923157 339272194 337653542 336570702 336146660 335982971 335318527
1612 335318527 333432922 330071487 325630188 320971642 316974907 314082394 312108803 310402336 308234005
1621 308234005 305172062 301242905 296838284 292477646 288578968 285328846 282647572 280197983 277418766
1630 277418766 273613853 268136120 260644207 251319618 240903664 230480976 221075420 213244877
1638 213244877 206880302 201315556 195696106 189423828 182466850 175398254 169163284 164695187 162565193
1647 162565193 162824535 165107269 168932018 174036827 180551147 188884487 199368629 211849747
1655B11849747J3636093J3428974J1828365R359799O856556N027542M101238L768082
1663B79856396L448639K708816J541901L35216m39586n84030l15457r5310k69909p91092
1673B85395584j233616j108951k64511R19189J688919J351509k91595k787094n250664
1682B78418770o831780p144508o424694n352669m680538m888706o041794p864647r932423
1691B19257011j1838359j3263913j3973064j3799076j2675114j0690460q115282n344095
1699A29557648k762375o05078J119356K594633M074841N741310P602510R473000J1020622
1708A67816467J1856289J1633797J0146999P407532L684063n23701m589062p921314
1716A99511070j0131950j1127815j1087399j0323429r103832p525730n514307k947064
$$ plain form
1655 211849747 225485840 238914814 250743179 260102978 266959534 271987076 276088314 279856396
1663 279856396 283305035 286013851 287555752 287890968 287451382 286867352 286551895 286456585 286186676 285395584
1673 285395584 284161968 283053017 282788506 283707695 285396614 286748123 286456528 283669434 278418770
1682 278418770 271586990 264442482 258017788 252665119 247984581 243095875 237054081 229189434 219257011
1691 219257011 207418652 194154739 180181675 166382599 153707485 143017025 134901743 129557648
1699 129557648 126795273 126190195 127309551 129904184 133979025 139720335 147322845 156795845 167816467
1708 167816467 179672756 191306553 201453552 208861084 212545147 212021446 207432384 199511070
1716 199511070 189379120 178251305 167163906 156840477 147736645 140210915 134696608 131749544
1724A31749544J69649L584223O827040R382505J0919752J1450539J1317062J1006718
1732A96407032J0894451J1058941J1278591J1204777J0606480R532032Q292846P280979
1740B76556129O736012O605568O584186O299534N535527M358387L081493K098484J684456
1749C19539776J873760K466888L144990L620605L743095L522988L079605K562561K093391
1758C45647659J750183J584626J637916J925507K394371K886810L155975K955819K173347
1767C66112213R31282m14123j403160j678925j158638p5607J135292K042656K397079
1776C67888069K197304J626930R33075L26309n1460j16844J56898P04270J331444J737747
1786C76733742J635284R18427k21405j335678j922913j695595p53593M50439J342697
$$ plain form
1724 131749544 131919193 135503416 142330456 151712961 162632713 174083252 185400314 196407032
1732 196407032 207301483 218360424 229639015 240843792 251450272 260982304 269275150 276556129
1740 276556129 283292141 289897709 296481895 302781429 308316956 312675343 315756836 317855320 319539776
1749 319539776 321413536 323880424 327025414 330646019 334389114 337912102 340991707 343554268 345647659
1758 345647659 347397842 348982468 350620384 352545891 354940262 357827072 360983047 363938866 366112213
1767 366112213 367043495 366629372 365226212 363547287 362388649 362313042 363448334 365490990 367888069
1776 367888069 370085373 371712303 372645378 372971687 372920227 372803383 372960281 373664551 374995995 376733742
1786 376733742 378369026 379287453 379066048 377730370 375807457 374111862 373358269 373808708 375151405
1795C75151405J529885R94110Q1749p01638r63287o09245J39618Q93173J302757J222916
1805C79041443P52487J53427k95677m33121k70118M7111L37830M88701N00602M59633
1815C80782318M58794N29098O24848O67953O13060M77524L13797J53847k4491k69355
1825C84327393n85175q84285j012726q50067m09012J43357N80406P64503P42378P05109
1835C83521881Q30040J118164J352577J228104N73921m84581j546287k139931j989288
1844C82464600j172715p6103Q23937J209373J057930O00052J48201q3199o6452P6142
1854C84981766J85928J79215Q9340L1853J17530L69835O88935Q85238P70607K66457
1864C88566704n26276j342583j860046j851959j306572m42734L95775R06601R66530
$$ plain form
1795 375151405 376681290 377675400 377757149 377055511 376092224 375482979 375622597 376515770 377818527 379041443
1805 379041443 379793930 379947357 379651680 379218559 378948441 378995552 379333382 379822083 380322685 380782318
1815 380782318 381241112 381770210 382395058 383063011 383676071 384153595 384467392 384621239 384596748 384327393
1825 384327393 383742218 382857933 381845207 380995140 380586128 380729485 381309891 382074394 382816772 383521881
1835 383521881 384351921 385470085 386822662 388050766 388624687 388140106 386593819 384453888 382464600
1844 382464600 381291885 381215782 382039719 383249092 384307022 384907074 385055275 384972076 384905624 384981766
1854 384981766 385167694 385346909 385436249 385468102 385585632 385955467 386644402 387529640 388300247 388566704
1864 388566704 388040428 386697845 384837799 382985840 381679268 381236534 381632309 382538910 383505440
1873C83505440O63070K13051j67846l65067l80783k83203j40572M730J21995J68380
1883C83339195R6627j03837l71017n79262o07910m23088j12076J61324K58178J53122
1893C81811256n5122k13242k18658p9880J03760K21825K29301J63345R4758O1950M2191
1904C82161484j6556j33667k58369k94724j73988Q0490L47862M74510L69606O3782
1914C82620430l04108n67817o24733m84467k46429l3150P9346Q9416M9973K2506L7804
1925C80638771Q5411J28403J31645Q2016n379r3498j39885j14784j8158J11580K06642
1936C81012764J96609M5205k20986n14183p19757p51228n95246l20167m1580J36413
1946C78227844J70861R4146j5411q2359p5455j7929L6468M2305p820p9689j19247q6022
$$ plain form
1873 383505440 384168510 384381561 384213715 383848648 383467865 383184662 383044090 383048820 383170815 383339195
1883 383339195 383435822 383331985 382960968 382381706 381773796 381350708 381238632 381399956 381658134 381811256
1893 381811256 381756134 381542892 381324234 381244354 381348114 381569939 381799240 381962585 382057343 382119293 382161484
1904 382161484 382144928 382011261 381752892 381458168 381284180 381364670 381712532 382187042 382556648 382620430
1914 382620430 382316322 381748505 381123772 380639305 380392876 380359726 380439072 380528488 380578461 380600967 380638771
1925 380638771 380724182 380852585 380984230 381066246 381060867 380967369 380827484 380712700 380694542 380806122 381012764
1936 381012764 381209373 381254578 381033592 380519409 379799652 379048424 378453178 378133011 378091431 378227844
1946 378227844 378398705 378492851 378477440 378395081 378319626 378301697 378338165 378380470 378372650 378292961 378173714 378087692
1958C78087692K2660J67961K87704L25546K58522J07499p1717k14004k73590k43721
1968C78454552j56708o4850j2588j5450n6305j00441j19438j07460q0032n8289n0125
1979C77632866m2152r957O1150J57814K39677K56615J78261J3427j87645l54690m27284
1990C77518082l79372k29378l0136J53389K66876K84272K11792Q2244n7640j65290
2000C77654839k13585k00005j43051p2098j3656J8386K6055K0180J0070l662l0327
2011C77053146q0795j57394k47689l25470l62091l39431k58904j42746k5597N8785
2021C75171814Q9455O4354k099q6250j63803k17781k39830k29645j91688j33324o3400
2032C73997803P324O7062J04637J13259R3307N2986N608l5362o0845o8969o3973n3406
$$ plain form
1958 378087692 378110352 378278313 378566017 378891563 379150085 379257584 379185867 378971863 378698273 378454552
1968 378454552 378297844 378232994 378220406 378204956 378148651 378048210 377928772 377821312 377741280 377682991 377632866
1979 377632866 377590714 377580757 377641907 377799721 378039398 378296013 378474274 378487701 378300056 377945366 377518082
1990 377518082 377138710 376909332 376879196 377032585 377299461 377583733 377795525 377877769 377820129 377654839
2000 377654839 377441254 377241249 377098198 377026100 377012444 377030830 377056885 377077065 377087135 377083473 377053146
2011 377053146 376972351 376814957 376567268 376241798 375879707 375540276 375281372 375138626 375113029 375171814
2021 375171814 375261269 375325623 375323524 375237274 375073471 374855690 374615860 374386215 374194527 374061203 373997803
2032 373997803 374005127 374072189 374176826 374290085 374383392 374436378 374441986 374406624 374345779 374276810 374212837 374159431
2044C74159431m4364m1390m5395n4169o2561o3743n2414k8038J907K1858J4229l1013
2056C73774338j08147j94893k60200k79541k47765j82075j12763o6681n2871o0425
2066C72208977o7406n6534k5863J0757L4218L2539P553k7160n6343p1717p5645p6409
2078C71836967q2092r4681j09787j18980j14937r3155n5160p401L7728O5689O4277
2089C71328468L0976k3690p7858j08032j00937o0997q430L1051L9711J6518k4719o4812
2101C70977249q9989r7885r5443r2507r3460r6435r4605q1825n6381k3079P972K3728
2113C70187340J2550l1090j00364j75515k28195k33421j83220r4070j145N8327O6261
2124C69277458L4065m806j4877J6098O8206J00899P8812j602j05210j76429j71891
$$ plain form
2044 374159431 374115067 374073677 374028282 373974113 373911552 373847809 373795395 373767357 373769264 373791122 373805351 373774338
2056 373774338 373666191 373471298 373211098 372931557 372683792 372501717 372388954 372322273 372269402 372208977
2066 372208977 372141571 372085037 372059174 372069931 372104149 372136688 372144241 372117081 372060738 371989021 371913376 371836967
2078 371836967 371754875 371660194 371550407 371431427 371316490 371223335 371168175 371160774 371198502 371264191 371328468
2089 371328468 371359444 371335754 371257896 371149864 371048927 370987930 370979500 371010551 371050262 371066780 371042061 370977249
2101 370977249 370887260 370789375 370693932 370601425 370507965 370411530 370316925 370235100 370178719 370155640 370163612 370187340
2113 370187340 370199890 370168800 370068436 369892921 369664726 369431305 369248085 369154015 369152870 369211197 369277458
2124 369277458 369311523 369306717 369291840 369307938 369376144 369477043 369555855 369554253 369449043 369272614 369100723
2135C69100723q8005L3531J28289J44844P4272m4594j48621j85890j43776n4474K6970
2146C68843269N4016J4840o3210j31836j49269j03493j6822O7291J07116Q4839J2360
2157C68719101p5607j40152j55602j20964n6305Q049M6883N0201K4834j2589m6844
2168C68241005p1030q8691j07155j29853j51367j60827j48850j16539p7171m9973m9820
2179C67089729p6332j13449j38054j33247r8915n1689j5412o180k2544m6273n4588
2190C66333046l4447Q469N2032P0267M8409q469p7477j29661j43852j16654o1188n34
2202C65939941M2916N5237L4294j2665p2060j28174j67160j79481j63574j26725q3961
2213C65138588n2109m2038n3558p3242q2817o8169l0251J3504L6545J7815m3640j25847
$$ plain form
2135 369100723 369012718 369046249 369174538 369319382 369393654 369349060 369200439 369014549 368870773 368816299 368843269
2146 368843269 368897285 368912125 368848915 368717079 368567810 368464317 368447495 368514786 368621902 368706741 368719101
2157 368719101 368643494 368503342 368347740 368226776 368170471 368178520 368225403 368275604 368300438 368287849 368241005
2168 368241005 368169975 368081284 367974129 367844276 367692909 367532082 367383232 367266693 367189522 367139549 367089729
2179 367089729 367013397 366899948 366761894 366628647 366529732 366478043 366462631 366456451 366433907 366387634 366333046
2190 366333046 366298599 366307068 366359100 366429367 366477776 366469307 366391830 366262169 366118317 366001663 365940475 365939941
2202 365939941 365982857 366038094 366072388 366059723 365987663 365859489 365692329 365512848 365349274 365222549 365138588
2213 365138588 365086479 365044441 364990883 364917641 364834824 364766655 364736404 364749908 364786453 364804268 364760628 364634781
2225C64634781j92375k11106j72882r7770k5750M921k0523q3885j43471j58081j09939
2236C63423920j7281P5493J22185R9258J9989p3929j35765j37901q7318j8197K8496
2247C63298950L0022o027m7074n7068j9493N0507J13945J30310Q1749j5488j19591
2258C63440742j86653j95694j57890j09940q9378j13716j69334k21177k32849j87530
2268C61776581r7656J220O7787P4044J8882p1525j54228j87950j50414m8676Q4420
2279C61312485K04887K77710K92091K61651K12707J65443J22033P0991K289p6485j36985
2290C62708817j43776p7782M7989J90773L00331L45802L33443L00941K95220L43933
2300C64645691M40521N45883O07605N84107M62150K65007M5243j28899j92261j02844
$$ plain form
2225 364634781 364442406 364231300 364058418 363960648 363934898 363939819 363919296 363835411 363691940 363533859 363423920
2236 363423920 363406639 363482132 363604317 363703575 363723564 363649635 363513870 363375969 363288651 363270454 363298950
2247 363298950 363328972 363322945 363275871 363218803 363199310 363249817 363363762 363494072 363575821 363560333 363440742
2258 363440742 363254089 363058395 362900505 362790565 362701187 362587471 362418137 362196960 361964111 361776581
2268 361776581 361678925 361680145 361747932 361821976 361840858 361769333 361615105 361427155 361276741 361228065 361312485
2279 361312485 361517372 361795082 362087173 362348824 362561531 362726974 362849007 362919998 362922287 362845802 362708817
2290 362708817 362565041 362487259 362535248 362726021 363026352 363372154 363705597 364006538 364301758 364645691
2300 364645691 365086212 365632095 366239700 366823807 367285957 367550964 367596207 367467308 367275047 367172203
2310C67172203J42593M99802Q78067J157303J217728R82284M55856k54020r56230j438713
2320C69856873j557656j314888q73794m92554l97224o57731j142692j585312j732483
2329C60102539j484604r47189l56903N7487J85814M2114l25164r28193j839408l065758
2339C51440735m380112n257377n020752l174782K46620M535675Q496857J0908622J1037751
2348C68833237Q939590N396538J539154j637764l620529m444351m507409m282875m095954
2357C62119637m052392m100608m140969m101104l952332l689117l309174k817764k239876
2366C29716301j625176j033363n13038q5755K49405N05295O98547Q52089J000404J183930
2376C30948639J429634J730080K035713K273636K381057K333909K154769J892624J596947
$$ plain form
2310 367172203 367314796 367814598 368692665 369849968 371067696 372049980 372505836 372251816 371295586 369856873
2320 369856873 368299217 366984329 366110535 365617981 365220757 364563026 363420334 361835022 360102539
2329 360102539 358617935 357670746 357313843 357371330 357557144 357599258 357274094 356345901 354506493 351440735
2339 351440735 347060623 341803246 336782494 333607712 333854332 338390007 346886864 357795486 368833237
2348 368833237 377772827 383169365 384708519 383070755 379450226 375005875 370498466 366215591 362119637
2357 362119637 358067245 353966637 349825668 345724564 341772232 338083115 334773941 331956177 329716301
2366 329716301 328091125 327057762 326544724 326458969 326708374 327213669 327912216 328764305 329764709 330948639
2376 330948639 332378273 334108353 336144066 338417702 340798759 343132668 345287437 347180061 348777008
2385C48777008J298294J010094P41997N10978L37944K34719J91116J77460J59912J20010
2395C53559532O2714R613j9722k1515j0834r270k9449o5689r7466j01966o8856n493
2407C53201599O4469J13639J23825R2659L3951l0098q0719j11313j28860j47705j77689
2418C52953758k16827k49062k53601k17857j46790o3553K099K7999J0376l4599q0604
2429C51731339j04790r6894o2789j8731J6899K9641J3542l0403r3575j61934k17323
2440C51004982k41737k24381j67198q7242j0376L9024N1041L4065R842l81J1367L4485
2452C50453491M7608L2615j2054p0610j19286j41411j37634j23100j15967j24054j39618
2463C49549980j46141j30577r4109n1155k1629k0256m9133j00060j59454k13738k50549
$$ plain form
2385 348777008 350075302 351085396 351827393 352338371 352676315 352911034 353102150 353279610 353439522 353559532
2395 353559532 353622246 353631859 353612137 353590622 353579788 353570518 353541069 353475380 353377914 353275948 353207092 353201599
2407 353201599 353266068 353379707 353503532 353596191 353630142 353600044 353519325 353408012 353279152 353131447 352953758
2418 352953758 352736931 352487869 352234268 352016411 351869621 351806068 351808167 351836166 351846542 351811943 351731339
2429 351731339 351626549 351529655 351466866 351448135 351465034 351494675 351508217 351477814 351384239 351222305 351004982
2440 351004982 350763245 350538864 350371666 350284424 350274048 350313072 350364113 350398178 350408020 350407639 350419006 350453491
2452 350453491 350501099 350533714 350521660 350451050 350331764 350190353 350052719 349929619 349813652 349689598 349549980
2463 349549980 349403839 349273262 349179153 349127998 349106369 349086113 349036980 348936920 348777466 348563728 348313179
2474C48313179k60391k37961j86043j19743o2218l5362m7798q8463j32485j55372j47705
2485C46839638j19629r2774q4495r6970j16348j24779j13716r0370p2861p7095j06849
2496C45743752j51406j92642k16179k17285k01187j75781j46866j15471q1063m6310
2506C44199562j9684j2398l4179q6060j56936k25220k64664k55775j94969r9030J53
2517C42850800O6986Q0108M1504k3765q0300j00403p7858k9525J6250L5820K3156q584
2529C42794189l6239m0665j7128K2392N7030O8245M8714N646m3145p9117r0522p7553
2541C42611847n1117k4796p515J412R842K5139M5395N7678M4060o524q7699j75286
2553C42442436k37655k52800k19498j58081r7847n8403m0856k9525o714L1204O9389
$$ plain form
2474 348313179 348052788 347814827 347628784 347509041 347446823 347411461 347363663 347275200 347142715 346987343 346839638
2485 346839638 346720009 346627235 346542740 346445770 346329422 346204643 346090927 346000557 345927696 345850601 345743752
2496 345743752 345592346 345399704 345183525 344966240 344765053 344589272 344442406 344326935 344245872 344199562
2506 344199562 344179878 344167480 344133301 344047241 343890305 343665085 343400421 343144646 342949677 342850647 342850800
2517 342850800 342917786 342997894 343039398 343015633 342935333 342834930 342757072 342727547 342743797 342779617 342802773 342794189
2529 342794189 342757950 342717285 342700157 342722549 342779579 342847824 342896538 342902184 342859039 342779922 342689400 342611847
2541 342611847 342560730 342535934 342528419 342529831 342539673 342564812 342610207 342667885 342711945 342705421 342617722 342442436
2553 342442436 342204781 341951981 341732483 341574402 341476555 341418152 341377296 341347771 341341057 341372261 341441650
2564C41441650Q0796M5471l4599j32981k11105k37923k06985j39809p4119m4861o6796
2575C40418739j28975k00080k44866k39258j80435q6861R804P7935R7541O7711M463
2586C39595718o6757j22719j51672j55563j44196j27830j09826q7394n7221k2735L242
2597C38553047N226k4948p9307j35270j65557j54419j06430m4976%Q965j8196o4202
2609C37773933j05590j26839j26801j16729j11122j17798j34201j49918j52435j34468
2619C36498032r6321m6158K365L4904M0970J7891k5825p2861j03722j05476p8812l7842
2631C36027145k822J0032k022k8419n2185o0730n2796l6850k5596k6932m1046o2065
2643C35645714q3695j03035j19323j31073j33210j18331q3199l3951J3199L8757K9984
$$ plain form
2564 341441650 341522446 341567917 341533318 341400337 341189232 340951309 340744324 340604515 340530396 340485535 340418739
2575 340418739 340289764 340089684 339844818 339605560 339425125 339338264 339348068 339426003 339523544 339591255 339595718
2586 339595718 339528961 339406242 339254570 339099007 338954811 338826981 338717155 338629761 338572540 338549805 338553047
2597 338553047 338558273 338533325 338454018 338318748 338153191 337998772 337892342 337847366 337847366 337856331 337838135 337773933
2609 337773933 337668343 337541504 337414703 337297974 337186852 337069054 336934853 336784935 336632500 336498032
2619 336498032 336401711 336355553 336357918 336392822 336433792 336451683 336425858 336352997 336249275 336143799 336064987 336027145
2631 336027145 336024323 336034355 336032333 336003914 335951729 335890999 335838203 335801353 335775757 335748825 335707779 335645714
2643 335645714 335562019 335458984 335339661 335208588 335075378 334957047 334873848 334839897 334853096 334891853 334921837
2654C34921837r689o2027j01929j11427q7777m5128m348J7585J6251j602k4834m5852
2666C34461060o3134p8430r0446r2583p6561m0436N226M0207M4365J1635m4518r5367
2678C33981018j12343q4762k7237K7046M3716P248o9580j53312k05918k06375j59759
2689C33039742r3384m0856k4185m3640q0376j08833j11885q9531n6458l2730l1089
2700C32326775n1384q1864j09024j25770j34583j42898j55106j65863j62697j33781
2710C31063805p9155j4153L5668M7187J2627n5847j31874j88217k08168j91956j53351
2721C30136566j10550p9460o8588p9689j09139j49269j89590k19155k30445k24076
2731C28676605k09121j98861k02560k18811k35291k35901k09999j60751j02005n1422
$$ plain form
2654 334921837 334912148 334850121 334748192 334636765 334548988 334503860 334499512 334517097 334533348 334531746 334506912 334461060
2666 334461060 334397926 334319496 334229050 334136467 334059906 334019470 334024696 334064903 334109268 334120903 334076385 333981018
2678 333981018 333868675 333783913 333756676 333783722 333827438 333834686 333765106 333611794 333405876 333199501 333039742
2689 333039742 332946358 332905502 332881317 332837677 332757301 332648468 332536583 332447052 332390594 332357864 332326775
2700 332326775 332275391 332193527 332084503 331958733 331824150 331681252 331526146 331360283 331197586 331063805
2710 331063805 330984650 330970497 331006165 331053352 331065979 331010132 330878258 330690041 330481873 330289917 330136566
2721 330136566 330026016 329946556 329877968 329798279 329689140 329539871 329350281 329131126 328900681 328676605
2731 328676605 328467484 328268623 328066063 327847252 327611961 327376060 327166061 327005310 326903305 326851883
2741C26851883j9035l968L167J0337J7739J5831p363n7182j26534j96609k45323k57416
2753C25985527k31552j80664j28098r7084j02997j45111k07557k62680k84195k58408
2763C24087181j93520j17645o7253o8970j25465k12288k90413l25279l04565k43798
2773C22137985j75285j30119j21384j39542j61209j65443j46942j18180r9983j07231
2783C20772667j38435j75248j93252j74484j19057m4346K2087N6667M9439P591m9362
2794C20014267j00307j31588j41716j40133j39332j48297j67141j87854j98918j91860
2804C18467121j64547j22433p4443k9736N760K9621M1294M0188K6131p82l7689p8793
2816C18101692j17092j47381j68476j82876j94855k06146k13147k08549j85089j41773
$$ plain form
2741 326851883 326832848 326828880 326832047 326842384 326860123 326875954 326868591 326811409 326684875 326488266 326242943 325985527
2753 325985527 325753975 325573311 325445213 325348129 325245132 325100021 324892464 324629784 324345589 324087181
2763 324087181 323893661 323776016 323708763 323639793 323514328 323302040 323011627 322686348 322381783 322137985
2773 322137985 321962700 321832581 321711197 321571655 321410446 321245003 321098061 320979881 320879898 320772667
2783 320772667 320634232 320458984 320265732 320091248 319972191 319927845 319949932 320006599 320056038 320063629 320014267
2794 320014267 319913960 319782372 319640656 319500523 319361191 319212894 319045753 318857899 318658981 318467121
2804 318467121 318302574 318180141 318105698 318075962 318081722 318111343 318152637 318192825 318218956 318218174 318180485 318101692
2816 318101692 317984600 317837219 317668743 317485867 317291012 317084866 316871719 316663170 316478081 316336308
2826C16336308q8044m2476k6074n2299j18676k04944k79961l14426k95963k34871j60942
2837C14517632j09654j04237j45320k10953k69051k96459k90470k69756k61956k85186
2847C12274590l37143l95260m30889m26369l86334l35693l05195l14827l64036m33674
2857C08545170m96998n33619n37281n15003m81014m50058m33255m37030m62437n04379
2867C03694096n48916n76744n68982n17196m31118l36762k67830k49900k90547l76549
2877B99529552m81777n79910o53572o97193p14188p11651o98356o85139o85539p11708
2887B92910519p68128q45985r23081r73949r83028r56097r18579r02710r28917r91955
2897B83718090j061897j099415j076489r91783q70132p48139o53839n93376n51166
$$ plain form
2826 316336308 316248264 316205788 316179714 316127415 316008739 315803795 315523834 315209408 314913445 314678574 314517632
2837 314517632 314407978 314303741 314158421 313947468 313678417 313381958 313091488 312821732 312559776 312274590
2847 312274590 311937447 311542187 311111298 310684929 310298595 309962902 309657707 309342880 308978844 308545170
2857 308545170 308048172 307514553 306977272 306462269 305981255 305531197 305097942 304660912 304198475 303694096
2867 303694096 303145180 302568436 301999454 301482258 301051140 300714378 300446548 300196648 299906101 299529552
2877 299529552 299047775 298467865 297814293 297117100 296402912 295691261 294992905 294307766 293622227 292910519
2887 292910519 292142391 291296406 290373325 289399376 288416348 287460251 286541672 285638962 284710045 283718090
2897 283718090 282656193 281556778 280480289 279488506 278618374 277870235 277216396 276623020 276071854
2906B76071854n04055m38462l60088k91767k58885k74887l33957m15287m94538n56106
2916B72143822n97287o23989o43100o57788o66809o69327o67457o65150o62079o50711
2926B65640125o17962n53512m59042l51028k54135j87798j54858j39579j16844o7273
2936B62738094J2188J07746J97964K65160L03192L14312L04069K75250K28500J66893
2946B64913368R9430L9215m901l4466o2542j05801j72233k53411l26309l65448l57227
2957B63369675l08667k45266j98097j91078k30770l06187l95260m74662n28336n51472
2967B59939880n51204n42622n41534n57461n85995o09760o02093n37681m03252k02084
2977B54806194M6997L16258N77431Q06465R85298J102047J152038J139565J079693
$$ plain form
2906 276071854 275567799 275129337 274769249 274477482 274218597 273943710 273609753 273194466 272699928 272143822
2916 272143822 271546535 270922546 270279446 269621658 268954849 268285522 267618065 266952915 266290836 265640125
2926 265640125 265022163 264468651 264009609 263658581 263404446 263216648 263061790 262922211 262805367 262738094
2936 262738094 262750282 262858028 263055992 263321152 263624344 263938656 264242725 264517975 264746475 264913368
2946 264913368 265012798 265052013 265047112 265012646 264950104 264844303 264672070 264418659 264092350 263726902 263369675
2957 263369675 263061008 262815742 262617645 262426567 262195797 261889610 261494350 261019688 260491352 259939880
2967 259939880 259388676 258846054 258304520 257747059 257161064 256551304 255949211 255411530 255008278 254806194
2977 254806194 254853191 255169449 255746880 256553345 257538643 258640690 259792728 260932293 262011986
2986B62011986R96456R16386Q61301Q42419Q59069R01509R55162J004562J035157J036758
2996B71420765J005287R45931Q71334P96089P28969O68221O04134N27706M41723L61824
3006B78371983L10955L03325L33443L76396L98998L78762L13530K21233J26858M7436
3016B81182919j4515o6967j18161j68438k11029k38742k51923k60067k75517l06091
3026B79271469l49884l97835m39548m69055m85192m89120m80919m59271m24366l80516
3036B74895763l35426k96879k68154k48337k35481k30465k39429k70119l26634m05902
3046B72038937m97780n90363o73675p41043p89166q14819q17147p99942p73372p51152
3056B64790478p44000p53326p71256p86399p94278q01525q22849q68568r34086r97658
$$ plain form
2986 262011986 263008442 263924828 264786129 265628548 266487617 267389126 268344288 269348850 270384007 271420765
2996 271420765 272426052 273371983 274243317 275039406 275768375 276436596 277040730 277568436 278010159 278371983
3006 278371983 278682938 278986263 279319706 279696102 280095100 280473862 280787392 281008625 281135483 281182919
3016 281182919 281168404 281101437 280983276 280814838 280603809 280365067 280113144 279853077 279577560 279271469
3026 279271469 278921585 278523750 278084202 277615147 277129955 276640835 276159916 275700645 275276279 274895763
3036 274895763 274560337 274263458 273995304 273746967 273511486 273281021 273041592 272771473 272444839 272038937
3046 272038937 271541157 270950794 270277119 269536076 268746910 267932091 267114944 266315002 265541630 264790478
3056 264790478 264046478 263293152 262521896 261735497 260941219 260139694 259316845 258448277 257514191 256516533
3066B56516533j030121j011677r44538q54301p77493p44572p66124q30536r12628r85718
3076B47658825j032677j049175j040974j018505r92260r69372r52682r40189r26476
3085B38736515r04598q68340q14991p46040o67305n88436n21717m81282m80480n26771
3095B32136555o17638p37514q60081r56955j006546j002312r52530q75091p88994p06577
3105B23632317o32325n63469m95300m23336l44829k59362j68724p8449K804O4811R9926
3116B20834064J06678R2526P1888O1626P5684J20277J92643K82650L76720M62608N32685
3127B23210049N84984O21891O47640O65169O75849O80027O79856O79550O84242O96831
3137B29826088P15733P34825P47146P47471P34787P11079O78539O38237N91507N41306
$$ plain form
3066 256516533 255486412 254474735 253530197 252675896 251898403 251153831 250387707 249557171 248644543 247658825
3076 247658825 246626148 245576973 244535999 243517494 242525234 241555862 240603180 239662991 238736515
3085 238736515 237831917 236963577 236148586 235402546 234735241 234146805 233625088 233143806 232663326 232136555
3095 232136555 231518917 230781403 229921322 228964367 227957821 226955509 226002979 225127888 224338894 223632317
3105 223632317 222999992 222436523 221941223 221517887 221173058 220913696 220744972 220666523 220669327 220734138 220834064
3116 220834064 220940742 221033268 221105156 221166782 221242466 221362743 221555386 221838036 222214756 222677364 223210049
3127 223210049 223795033 224416924 225064564 225729733 226405582 227085609 227765465 228445015 229129257 229826088
3137 229826088 230541821 231276646 232023792 232771263 233506050 234217129 234895668 235533905 236125412 236666718
3147B36666718M93431M52365M16623L77369L21464K42443J47820O0787R689J2512O4126
3158B39265347J36585J92280K03037J63135Q8902O180o5995j24645j79996k46201l29017
3169B39109612m22421n11131n77927o09608n99765n49984m69647l76816k94876k47249
3179B34450188k47441k93007l65657m40007m95948n27096n40028n45730n50023n49125
3189B29896126n35984n08957m79069m66118m87289n44148o18038o77395o94675o61087
3199B24223366n94216n29365n02949n35297o21510p35435q42514r15528r44442r37195
3209B17064915r12705q89606q79212q81958q92238r03302r11273r17378r24358r34506
3219B08018379r46998r58310r63707r58538r40094r08660q67939q26436p95211p84645
$$ plain form
3147 236666718 237160149 237612514 238029137 238406506 238727970 238970413 239118233 239179020 239188709 239201221 239265347
3158 239265347 239401932 239594212 239797249 239960384 240049286 240055466 239989471 239864826 239684830 239438629 239109612
3169 239109612 238687191 238176060 237598133 236988525 236388760 235838776 235369129 234992313 234697437 234450188
3179 234450188 234202747 233909740 233544083 233104076 232608128 232081032 231541004 230995274 230445251 229896126
3189 229896126 229360142 228851185 228372116 227905998 227418709 226874561 226256523 225579128 224884453 224223366
3199 224223366 223629150 223099785 222596836 222061539 221440029 220704594 219862080 218946552 218002110 217064915
3209 217064915 216152210 215262604 214383392 213501434 212609196 211705894 210794621 209877243 208952885 208018379
3219 208018379 207071381 206113071 205149364 204190826 203250732 202342072 201474133 200647697 199852486 199067841
3229A99067841p98951q31318q64715q77743q53500p88384o92920n86415m86736m01592
3239A91885567l27530k54421j74790q8825l491P3891J42346K09560K88029L86905N06173
3250A92643414O36444P64904Q82435R87854J086368J182900J277046J362686J432648
3259B02256699J486148J532135J585732J658993J750889J844024J910782J926174J881676
3268B17833252J790695J683693J594753J545811J538143J553726J565476J550789J501693
3277B32158031J426545J345043J278171J239720J231518J244373J262894J272277J262341
3286B43720913J230087J177712J110038J032029R47494Q60996P78485P07664O55880
3295B52221298O25439O11191O00776N78957N33810M62856L73306K79465J95579J31207
$$ plain form
3229 199067841 198268890 197437572 196572857 195695114 194841614 194053230 193360310 192773895 192287159 191885567
3239 191885567 191558037 191303616 191128826 191040001 191036510 191110401 191252747 191462307 191750336 192137241 192643414
3250 192643414 193279858 194044762 194927197 195915051 197001419 198184319 199461365 200824051 202256699
3259 202256699 203742847 205274982 206860714 208519707 210270596 212114620 214025402 215951576 217833252
3268 217833252 219623947 221307640 222902393 224448204 225986347 227540073 229105549 230656338 232158031
3277 232158031 233584576 234929619 236207790 237447510 238679028 239923401 241186295 242458572 243720913
3286 243720913 244951000 246128712 247238750 248270779 249218273 250079269 250857754 251565418 252221298
3295 252221298 252846737 253457928 254058704 254637661 255171471 255634327 256007633 256287098 256482677 256613884
3305B56613884Q9359O7272O0540O5670P9822J00346J22375J39027J42879J28422R4204
3316B57703800M4651j1444o1912r5673j05705r1858o1493k7466l281Q59j8273n7068
3328B57215137j07460j58805k01302k24991k22568j91288j36223p2003j9683J487j7414
3339B55864887o8607j31588j82552k06643k04525j89628j78127j79959j94359k16407
3349B54112492k43435k79770l31688l98045m62913n00717m89197m26102l35312k56691
3359B50388622k24819k48947l06149l54347l55644k97260j95923q6346j259M3888N2586
3370B48414402L7937J1273k3671o7157j16444j62907j96151k11869k16236k21996k37446
3381B47009735k57873k66037k42634j82095r9773k6913N856j3371p0762j34087j71623
$$ plain form
3305 256613884 256703243 256770515 256831055 256896725 256976547 257076893 257199268 257338295 257481174 257609596 257703800
3316 257703800 257748451 257737007 257675095 257579422 257473717 257381859 257320366 257292900 257289619 257290478 257272205 257215137
3328 257215137 257107677 256948872 256747570 256522579 256300011 256108723 255972500 255900497 255880814 255882301 255864887
3339 255864887 255796280 255664692 255482140 255275497 255070972 254881344 254703217 254523258 254328899 254112492
3349 254112492 253869057 253589287 253257599 252859554 252396641 251895924 251406727 250980625 250645313 250388622
3359 250388622 250163803 249914856 249608707 249254360 248898716 248601456 248405533 248319187 248317928 248361816 248414402
3370 248414402 248452339 248463612 248439941 248372784 248256340 248093433 247897282 247685413 247469177 247247181 247009735
3381 247009735 246751862 246485825 246243191 246061096 245961323 245934410 245940266 245926895 245856133 245722046 245550423
3392B45550423j70098j40285j09463j03569j31988j82534k28557k43836k15702j49174
3402B43875217o4296J4839O8569Q7452P3090L5190j2836n7450q8977j04180j06792
3413B43719826j05667j11142j29642j60523j95140k20585k24476k00195j49460q2112
3423B42140884j3179M1790P0667O9084M1008j869m3984p0324p0972m3316P649P0610
3435B42198048J29680J67485J68495J25408M4556n1728j29490j55258j11484o676J25027
3446B42504063K37827K94323K82516K19632J41468Q3446O4221P9650J10836J36223
3456B44154205J44425J37405J26553J24397J37806J65901K01264K33516K52991K54288
3466B45932751K38552K15206J99947K07482K44236L01418L55968L80421L57170K89860
$$ plain form
3392 245550423 245380325 245240040 245130577 245027008 244895020 244712486 244483929 244240093 244024391 243875217
3402 243875217 243810921 243825760 243894329 243981781 244054871 244090061 244077225 244019775 243930798 243826618 243719826
3413 243719826 243614159 243503017 243373375 243212852 243017712 242797127 242572651 242372456 242222996 242140884
3423 242140884 242127705 242169495 242240162 242309246 242350254 242348385 242304401 242234077 242163105 242119789 242127438 242198048
3435 242198048 242327728 242495213 242663708 242789116 242833672 242781944 242652454 242497196 242385712 242379036 242504063
3446 242504063 242741890 243036213 243318729 243538361 243679829 243763275 243827496 243907146 244017982 244154205
3456 244154205 244298630 244436035 244562588 244686985 244824791 244990692 245191956 245425472 245678463 245932751
3466 245932751 246171303 246386509 246586456 246793938 247038174 247339592 247695560 248075981 248433151 248723011
3476B48723011K04716J39179J23520J65424K46163L30925L86810L98960L73726L31039
3486B51423473K90413K60754K41070K28367K24781K37083K67048L02429L16982K84748
3496B54077148K00882R3003J3008P877Q9207K18086L22724L38706K48967R9220k3766
3507B55685062l8948Q4591L10288N53989P26643P75356P01714N49888L78170K30885
3517B59957638J24836N4264L910l6602o6300p4234m4384L5172J65672L30963M97284
3528B60948219O20709O64139O15825N03311L86734L34130L85055N21927O69842P28855
3538B66378746O27518L68499L8167k32888l36075k44808k7790J93463L18756L26213
3548B67409801K77825K67601L52478N15003O84586Q00457Q62026R22813J026154J131973
$$ plain form
3476 248723011 248927727 249066906 249190426 249355850 249602013 249932938 250319748 250718708 251092434 251423473
3486 251423473 251713886 251974640 252215710 252444077 252668858 252905941 253172989 253475418 253792400 254077148
3496 254077148 254278030 254371033 254384041 254391918 254481125 254699211 255021935 255360641 255609608 255708828 255685062
3507 255685062 255646114 255730705 256040993 256594982 257321625 258096981 258798695 259348583 259726753 259957638
3517 259957638 260082474 260136738 260140648 260104046 260037746 259963512 259919128 259954300 260119972 260450935 260948219
3528 260948219 261568928 262233067 262848892 263352203 263738937 264073067 264458122 264980049 265649891 266378746
3538 266378746 267006264 267374763 267412930 267180042 266843967 266599159 266571369 266764832 267083588 267409801
3548 267409801 267687626 267955227 268307705 268822708 269507294 270307751 271169777 272092590 273118744 274250717
3558B74250717J100884P67822O7177q70781j735630k169304j951237j123924J8978
3567B68354702J074963J721305J844426J548500J063194O23875L90434M27494P18250
3576B77767143J171799J623764J852531J651249R38454j49956j265907j982079j997242
3585B79609756j301021j94187Q57715J455498J450596R82208L61653j10474k78015
3594B82833729j51463J65272N67665R90009J381760J661205J709652J424256Q01048
3603B91383133j9722p84607j227913j187363o75144J25141R24454J421414J399917
3612B91359310Q08945j82839j194229j732197j389293p5302J839523L590031M313526
3621B97337475L468227J155491j851749m426461n602436n017719l046493n62535J515522
$$ plain form
3558 274250717 275351601 276119423 276186600 275315819 273580189 271410885 269459648 268335724 268354702
3567 268354702 269429665 271150970 272995396 274543896 275607090 276230965 276621399 277048893 277767143
3576 277767143 278938942 280562706 282415237 284066486 285004940 284854984 283589077 281606998 279609756
3585 279609756 278308735 278114548 278972263 280427761 281878357 282860565 283222218 283111744 282833729
3594 282833729 282682266 282847538 283415203 284405212 285786972 287448177 289157829 290582085 291383133
3603 291383133 291363411 290578804 289350891 288163528 287488384 287613525 288537979 289959393 291359310
3612 291359310 292168255 291985416 290791187 289058990 287669697 287594395 289433918 293023949 297337475
3621 297337475 300805702 301961193 300109444 295682983 290080547 285062828 282016335 281453800 282969322
3630B82969322K635498K767372K277279J648732J246719J230507J592140K215939K885932
3639C01469440L271027K974358J708336m75769l064538n206527o080895n322780l248673
3648B86023979p22809J274872K128449J839065R25980P4119k33059J12820R11694J851730
3658B94186840K669296L190689L294659K893601J987781P39803n26867j461925j887417
3667C05086460j920376j905288k176514k802506l494377l752613l164329j658497M40788
3676B84652748K578106M222927N054264M985810M081707K472591L58524j930618l912811
3685C02563248n058689n001297l734322j659908N65185K303181L177814L157349K467308
3694B98779869J427403L29418n87769j112041j064301l85132P50656J898766K476463
$$ plain form
3630 282969322 285604820 288372192 290649471 292298203 293544922 294775429 296367569 298583508 301469440
3639 301469440 304740467 307714825 309423161 308947392 305882854 300676327 294595432 289272652 286023979
3648 286023979 285301170 286576042 288704491 290543556 291469536 291543655 291310596 291423416 292335110 294186840
3658 294186840 296856136 300046825 303341484 306235085 308222866 308962669 308435802 306973877 305086460
3667 305086460 303166084 301260796 299084282 296281776 292787399 289034786 285870457 284211960 284652748
3676 284652748 287230854 291453781 296508045 301493855 305575562 308048153 308406677 306476059 302563248
3685 302563248 297504559 292503262 288768940 287109032 287674217 289977398 293155212 296312561 298779869
3694 298779869 300207272 300536690 299948921 298836880 297772579 297387447 298138103 300036869 302513332
3703C02513332K031021N12295j626510l584271m565716m150161k480412j75285J969433
3712B90443726L325862L649216L083706K003670Q10222k07080q97656j205139j114426
3721B99892101o39515J46618J073933J871223K214756J829262O12755j257114l291836
3730C02452183m787045n056591l743820j071281K130508M696922N627041M573403K045040
3739C06866360q23460k846603l395996k689743j590500j033402j436863k463722l270607
3748B87315464l077030j681042M03080K256832L106098K751313J628627M96445k5577
3757B93174210K23102R31320J566964J700840J208210K69260p74021j585827j939316
3766B94774742j745300j047726j9722J050148J817036J999512J514263N45406n15690
$$ plain form
3703 302513332 304544353 305056648 303430138 299845867 295280151 291129990 288649578 288474293 290443726
3712 290443726 293769588 297418804 300502510 302506180 303316402 303109322 302211666 301006527 299892101
3721 299892101 299252586 299399204 300473137 302344360 304559116 306388378 307001133 305744019 302452183
3730 302452183 297665138 292608547 288864727 287793446 289923954 294620876 300247917 304821320 306866360
3739 306866360 306042900 303196297 299800301 297110558 295520058 294486656 293049793 290586071 287315464
3748 287315464 284238434 282557392 282960472 285217304 288323402 291074715 292703342 293199787 293174210
3757 293174210 293397312 294328632 295895596 297596436 298804646 299073906 298299885 296714058 294774742
3766 294774742 293029442 291981716 291961994 293012142 294829178 296828690 298342953 298888359 298372669
3775B98372669j248302j407891j038951m27838P7114K67468J75571K0600M1198L32699
3785B95164337P92961J205483J394729J337777J154327R87663Q68912O76212K27738
3794C03810139n52864j525078k369633k767181k599488k027187j377945r14516o47641
3803B89028606l36074L14083J385154K612114L485394L541717K649594J102619n46608
3812C03236599j795692k440892k608127k570057k498055k332630j862049r35249L55529
3821B86549377J664563K571010K821446K475776J851998J315841J047631R43393P04613
3830C01945648N9033j032658k312202l341122l729763l339577k338180j077481J29528
3839B84963226J185837K220535L410988M724503N763111N851593M376526J211147l027687
$$ plain form
3775 298372669 297124367 295716476 294677525 294249687 294326801 294594269 294769840 294790440 294831638 295164337
3785 295164337 295957298 297162781 298557510 299895287 301049614 302037277 302906189 303582401 303810139
3794 303810139 303257275 301732197 299362564 296595383 293995895 291968708 290590763 289676247 289028606
3803 289028606 288692532 289006615 290391769 293003883 296489277 300030994 302680588 303783207 303236599
3812 303236599 301440907 299000015 296391888 293821831 291323776 288991146 287129097 286193848 286549377
3821 286549377 288213940 290784950 293606396 296082172 297934170 299250011 300297642 301241035 301945648
3830 301945648 302004681 300972023 298659821 295318699 291588936 288249359 285911179 284833698 284963226
3839 284963226 286149063 288369598 291780586 296505089 302268200 308119793 312496319 313707466 310679779
3848C10679779p082367r526729r398709o670093k301445K164707N270691O238804N212326
3857B94586964L059120Q75587n30662r34506o57749k79350k76871p85332j570816k198543
3867B91287842k280979j677876n55382P07856J703701K169628K072067J570492R01031
3876B95898380K57130k67124o55861r10607j011943r34239o97975m00066j80016j30310
3886B90967369k10361k40364M19O18858J494503K290173K596817K137489R18751p54413
3896B99819241k402821l565388l963375l566875k559071j236782R6302J205959J960297
3905B85787487K327557K348346K097493J649303J062946L94116k79503q46043j182060
3914B93359642j209431r49917n34496j46713P4692J08852N3463M2420J39617K83108
$$ plain form
3848 310679779 303597412 294070683 284671974 278001881 275700436 277865143 283135834 289374638 294586964
3857 294586964 297646084 298521671 297991009 297056503 296398754 296119404 295842533 295057201 293486385 291287842
3867 291287842 289006863 287328987 286773605 287481461 289185162 291354790 293426857 294997349 295898380
3876 295898380 296155510 295888386 295232525 294321918 293309975 292375736 291677761 291277695 291097679 290967369
3886 290967369 290757008 290516644 290517063 291135921 292630424 294920597 297517414 299654903 300573654 299819241
3896 299819241 297416420 293851032 289887657 286320782 283761711 282524929 282621231 283827190 285787487
3905 285787487 288115044 290463390 292560883 294210186 295273132 295667248 295387745 294541702 293359642
3914 293359642 292150211 291200294 290665798 290519085 290593777 290702629 290756092 290798512 290938129 291221237
3924B91221237L25623J46885k40116o67229q97026p62272k72675L80974R25636J143094
3934B91304131R70516N09357m1275m83284o96125o66027m68159k23808m6616J297o7024
3945B90092983j73530k20337j48812K3232K10094L13874K86369J56460J735j08909
3955B90433159j57776j70975j75075j60923r1973M7875K12841L07083K49290M2992
3965B90536518k13699l90435m18663l35063k39792k03839k07443j68457l6430J35193
3975B88457890K15358J08986j40533l61729l89404k15721j6613j0662k57187n76763
3985B86813622o96164n16739k69107l65887j016426j912956k333203j723842m22383
3994B77556915N8632k414493r353199k0399247l2925109m2904854
$$ plain form
3924 291221237 291546860 291693745 291453629 290786400 289889374 289127102 288854427 289235401 290161037 291304131
3934 291304131 292274647 292784004 292742729 292259445 291563320 290897293 290429134 290205326 290158710 290160007 290092983
3945 290092983 289919453 289699116 289550304 289573536 289783630 290097504 290383873 290540333 290542068 290433159
3955 290433159 290275383 290104408 289929333 289768410 289676437 289724312 289937153 290244236 290493526 290536518
3965 290536518 290322819 289932384 289513721 289178658 288938866 288735027 288527584 288359127 288322697 288457890
3975 288457890 288673248 288782234 288641701 288279972 287890568 287674847 287658234 287647572 287390385 286813622
3985 286813622 286117458 285600719 285331612 284965725 283949299 282036343 279703140 277979298 277556915
3994 277556915 277615547 275201054 265847855 245448608 212523499 169618645
4000A69618645
$$ plain form
4000 169618645
##END=$$ End of the data block
