##TITLE=$$ Begin of the data block
##JCAMP-DX=5.00 $$ ACD/SpecManager v 10.08
##SPECTROMETER/DATA SYSTEM=16PC
##DATE=Mon Sep 02 15:29:02 2013
##DATA TYPE=INFRARED SPECTRUM
##DATA CLASS=XYDATA
##ORIGIN=
##OWNER=
##NPOINTS=3601
##FIRSTX=400.00000000
##LASTX=4000.00000000
##MAXX=4000.00000000
##MINX=400.00000000
##MAXY=36.41798019
##MINY=1.12619483
##XFACTOR=1.0000000000
##YFACTOR=0.000000100000000
##FIRSTY=17.35047722
##DELTAX=1.00000000
##XUNITS=1/CM
##YUNITS=TRANSMITTANCE
##XYDATA=(X++(Y..Y))
400A73504772M1983185L1611824J9416866R567814M502087M057350O028385P676697
408B98348980P242985M638805J098347j794796l017330k462769p11803J456184L427792
417C08226395M838123N478573N235481M153671K533913R01985k14042n76401l81661
426C30196037j27372k72713r29794j808281k446595k555427k216320j795998j652126
435C16391411j863327k188721k286568k021503j625423j581898k304650l829860n730896
444B92958565p320576q014374p636051o487312n156822m189911l810597l838711l824482
453B42679729l312644k086010k70482J737862L473740M619198N129127N211010N182858
462B62364388N296783N624809O062508O429405O593018O535377O330052O060886N753097
$$ plain form
400 173504772 215487957 247099781 266516647 276084461 280586548 284643898 290672283 298348980
408 298348980 305591965 310230770 311329117 309534321 306516991 304054222 303342419 304798603 308226395
417 308226395 313064518 318543091 323778572 327932243 330466156 331368141 331154099 330577698 330196037
426 330196037 330068665 329795952 328866158 327057877 324611282 322055855 319839535 318043537 316391411
435 316391411 314528084 312339363 310052795 308031292 306405869 304823971 302519321 298689461 292958565
444 292958565 285637989 277623615 269987564 263500252 258343430 254153519 250342922 246504211 242679729
453 242679729 239367085 237281075 237010593 238748455 242222195 246841393 251970520 257181530 262364388
462 262364388 267661171 273285980 279348488 285777893 292370911 298906288 305236340 311297226 317050323
471C17050323N369492M868736M272576L678856L202133K881088K625504K254715J612701
480C47816124O87103l51524j228104j721153j805496j688462j709785k157707l104363
489C34736633m355430n542488o304932o455536o037998n250549m291916l234387k007370
498B91256027n05123J257229L047314M455452N057945M604511L111191Q03070k045937
507C11041679n247459q695946j2213802j5357227j7352066j7273560j4431934q781109
515B11688576j115551P086868J4133873J8695354K0221329J9028206J6051884J2418670
523C18209209R047375O436348M669876L570099K881012K393951J991082J625557J283188
532C52107697R53216O17905K60391j21994n03006q24471j013336j012497q18901n00488
$$ plain form
471 317050323 322419815 327288551 331561127 335239983 338442116 341323204 343948708 346203423 347816124
480 347816124 348503227 348151703 346923599 345202446 343396950 341708488 339998703 337840996 334736633
489 334736633 330381203 324838715 318533783 312078247 306040249 300789700 296497784 293263397 291256027
498 291256027 290750904 292008133 295055447 299510899 304568844 309173355 312284546 313087616 311041679
507 311041679 305794220 297098274 284884472 269527245 252175179 234901619 220469685 211688576
515 211688576 210573025 217659893 231793766 250489120 270710449 289738655 305790539 318209209
523 318209209 327256584 333692932 338362808 341932907 344813919 347207870 349198952 350824509 352107697
532 352107697 353060913 353678818 353939209 353817215 353314209 352489738 351476402 350463905 349645004 349144516
542C49144516j80473J2703K594j99547n04189p92923r80377j056518j088791j186104
552C43170891j449700j932945k628326l481255m415626n355721o229648o952706p402992
561C03321972p410603o782512n372086l171749l87230K558136N117588O790810P303791
570C01968117O713695N382633L826275K508335J676331J311798J204796J100235Q33588
579C26525803L93829j02654m95414o66848n93490l46413n4321J46294J54266p2594
589C24888458n17578j127128j842347k625255l457833m311523n104618n683994n863133
598B94355049n513992m666577l546142k500687j832123j616134j623383j411018n60303
607B71084690J061726L166370N130081O273327O191406M958916L095760J317349K02846
$$ plain form
542 349144516 348964043 348976746 348979340 348779793 348275604 347482681 346502304 345445786 344356995 343170891
552 343170891 341721191 339788246 337159920 333678665 329263039 323907318 317677670 310724964 303321972
561 303321972 295911369 289128857 283756771 280585022 280197792 282755928 287873516 294664326 301968117
570 301968117 308681812 314064445 317890720 320399055 322075386 323387184 324591980 325692215 326525803
579 326525803 326919632 326816978 326321564 325654716 325061226 324714813 324660492 324806786 324961052 324888458
589 324888458 324370880 323243752 321401405 318776150 315318317 311006794 305902176 300218182 294355049
598 294355049 288841057 284174480 280628338 278127651 276295528 274679394 273056011 271644993 271084690
607 271084690 272146416 275312786 280442867 286716194 292907600 297866516 300962276 302279625 302482471
616C02482471m0092L93429J066227J539440J553841J072311K02370r11980k144318
625C05213699l357448m340515m794255m412326l037034q02536J831818M203377N682049
634B96186829N913124M950180L213043J296539k76565j241436j639729j726436j802292
643C04873257k064190k542000l137550l720017m212856m626560n030690n501995o088867
652B67948532o806888p649193q575363r469262j0094547j0102806r136581p004052
660A99109840l842220j58653L303871N840397P063389P037983O199646N100402M132481
669B33787136L383522K693024J848945P86915l39489j249771j712532j683865j321392
678B36192493q78925n69115m83570o09550r04541j359787k005196k871990l961296
$$ plain form
616 302482471 302442379 302835808 303902035 305441475 306995316 308067627 308269997 307358017 305213699
625 305213699 301856251 297515736 292721481 288309155 285272121 284469585 286301403 290504780 296186829
634 296186829 302099953 307050133 310263176 311559715 311283150 310041714 308401985 306675549 304873257
643 304873257 302809067 300267067 297129517 293409500 289196644 284570084 279539394 274037399 267948532
652 267948532 261141644 253492451 244917088 235447826 225353279 215250473 206113892 199109840
660 199109840 195267620 195108967 198412838 204253235 211316624 218354607 224554253 229654655 233787136
669 233787136 237170658 239863682 241712627 242499542 242160053 240910282 239197750 237513885 236192493
678 236192493 235313568 234744453 234260883 233651333 232746792 231387005 229381809 226509819 222548523
687B22548523n254917o750813q468647j0386162j2330989j3916340j4609499j3944454
695A36886702j1781702q451148m660825j182671J524372L535347N382481P708387J0839205
704A39800148J4522638J7981444K0255718K0643959J9012928J5826626J1911163Q100281
712B68054905M947700K625828J009503j44062j033345j741142k255039k533989k569676
721B66360683k411766k159519j934299j845722j960755k277984k720891l159561l463134
730B44427052l563862l498516l397141l417148l655797m093246m606152n046653n340100
739B07808437n534553n762005o131592o621132p049217p160492o785812n981503n050850
748A51731281m416198m400444n038043o026744o855479p041340o347808m871130k959700
$$ plain form
687 222548523 217293606 210542793 202074146 191687984 179356995 165440655 150831156 136886702
695 136886702 125105000 116653852 111993027 110810356 112334728 115870075 121252556 128960943 139800148
704 139800148 154322786 172304230 192559948 213203907 232216835 248043461 259954624 268054905
712 268054905 273002605 275628433 276637936 276493874 275460529 273719387 271464348 268930359 266360683
721 266360683 263948917 261789398 259855099 258009377 256048622 253770638 251049747 247890186 244427052
730 244427052 240863190 237364674 233967533 230550385 226894588 222801342 218195190 213148537 207808437
739 207808437 202273884 196511879 190380287 183759155 176709938 169549446 162763634 156782131 151731281
748 151731281 147315083 142914639 137876596 131849852 124994373 117953033 111605225 106734095 103774395
757A03774395j030712O06241J824684K639342L101787L220091K954922K284584J279335
766A20654669J25208r27792j660471j968489j888618j561775j160355q23726o24104
775A10164547n68180o16226p03698p58771p17936n39999k15702K33841P69129J348285
785A08395290J936980K507019L031015L480768L834629M088135M254027M348259M369688
794A40245810M292755M085416L747092L339624K984762K818613K925988L293686L813362
803A71547108M334755M735355M964104N038051M998951M869442M640446M292717L829269
812B13250198L284436K696895K064953J325932L86638p99408k152710l438606m318237
821B12300091m462719l680229j994172L58639L003254N533562P606010Q993779R597549
$$ plain form
757 103774395 102743683 103349924 105174608 107813950 110915737 114135828 117090750 119375334 120654669
766 120654669 120779877 119852085 118191614 116223125 114334507 112772732 111612377 110788651 110164547
775 110164547 109596367 108980141 108276443 107517672 106799736 106259737 106044035 106277876 107047005 108395290
785 108395290 110332270 112839289 115870304 119351072 123185701 127273836 131527863 135876122 140245810
794 140245810 144538565 148623981 152371073 155710697 158695459 161514072 164440060 167733746 171547108
803 171547108 175881863 180617218 185581322 190619373 195618324 200487766 205128212 209420929 213250198
812 213250198 216534634 219231529 221296482 222622414 223009052 222209644 220056934 216618328 212300091
821 212300091 207837372 204157143 202162971 202521610 205524864 211058426 218664436 227658215 237255764
830B37255764R432831Q608780P307892N760841M210777K868157J867485J240043R19075
839B79471645P75166O70566N14985K98843R3594J9302J88866O55212J379089K232113
849B86299381L035698L617039L863602L752689L347683K767277K140464J567574J100349
858C11491756P41005M60568K19822j2760k53926n08499p78599j070900j398277j773910
868C07116280k202492k673931l162060l626766m015770m259453m265308l920289l112239
877B75877972j775532N5218K209549M390373O239490P443219P834835P450904O510830
886C16236858N330220M203262L309135K678070K223969J821785J383171Q98933M32740
895C38518143P8277r4909p8698O8093K43416L41339K89764P1793k74735o76384j050377
$$ plain form
830 237255764 246688595 255297375 262605267 268366108 272576885 275445042 277312527 278552570 279471645
839 279471645 280246811 280917377 281432362 281731205 281824799 281844101 282032967 282688179 284067268 286299381
849 286299381 289335079 292952118 296815720 300568409 303916092 306683369 308823833 310391407 311491756
858 311491756 312232761 312693329 312913151 312900391 312646465 312137966 311359367 310288467 308890190 307116280
868 307116280 304913788 302239857 299077797 295451031 291435261 287175808 282910500 278990211 275877972
877 275877972 274102440 274157658 276367207 280757580 286997070 294440289 302275124 309726028 316236858
886 316236858 321567078 325770340 329079475 331757545 333981514 335803299 337186470 338085403 338518143
895 338518143 338596420 338501511 338422813 338490906 338734322 339075661 339365425 339437218 339162483 338486099 337435722
906C37435722j330299j479912j495476j399955j233216j044006q81538p84302p67136
915C27019882q08410q48580q04901o03409k15950L16544Q87718J358719J609077J582032
925C29492722J303901Q69293M01116L128k73438m37698n40466o43769p88955r81446
935C28404388j193275j382942j519623j601601j659164j738339j878032k087326k340813
944C13003273k589951k788353k913799k975158k999535l006725k984295k878151k604637
953B87262669k081433j266098j87359J042462K242374L205853L760185L825455L447704
962C01251812K788734K070809J495571J172123J087799J135120J176510J115322R31149
971C14224949O68812L93638J45588p8335l08475n70774q65326j170654j465607j746121
$$ plain form
906 337435722 336105423 334625511 333130035 331730080 330496864 329452858 328571320 327787018 327019882
915 327019882 326211472 325362892 324557991 323954582 323738632 324055176 324942894 326301613 327910690 329492722
925 329492722 330796623 331665916 332067032 332070160 331796722 331359024 330818558 330174789 329385834 328404388
935 328404388 327211113 325828171 324308548 322706947 321047783 319309444 317431412 315344086 313003273
944 313003273 310413322 307624969 304711170 301736012 298736477 295729752 292745457 289867306 287262669
953 287262669 285181236 283915138 283727779 284770241 287012615 290218468 293978653 297804108 301251812
962 301251812 304040546 306111355 307606926 308779049 309866848 311001968 312178478 313293800 314224949
971 314224949 314893761 315287399 315432987 315354652 315046177 314475403 313610077 312439423 310973816 309227695
981C09227695k020149k280693k480640k535382k361660j932487j315174o62422j56517
990B93482571O3438m7893m39797j006775j641674k267628k834320l292980l578243
999B78436699l619156l376942k883129k249565j636429j191902r95903j037826j237393
1008B60208454j494312j738453j954365k173233k443504k798062l235969l723755m211521
1017B36435280m654808n030213n336628n580787n747719n770607n517063m809456l484669
1026A90503330j478252J103172L959808O650887Q713474R803219R801655Q844185P257385
1035B45158863N438480L728142K328854J291580N60627M1237l44906o39439q56494
1044B56706944j006718j114083j215343j347809j532726j768894k037621k314815k583580
$$ plain form
981 309227695 307207546 304926853 302446213 299910831 297549171 295616684 294301510 293639088 293482571
990 293482571 293546009 293498116 293058319 292051544 290409870 288142242 285307922 282014942 278436699
999 278436699 274817543 271440601 268557472 266307907 264671478 263479576 262483673 261445847 260208454
1008 260208454 258714142 256975689 255021324 252848091 250404587 247606525 244370556 240646801 236435280
1017 236435280 231780472 226750259 221413631 215832844 210085125 204314518 198797455 193987999 190503330
1026 190503330 189025078 190128250 194088058 200738945 209452419 219255638 229057293 237901478 245158863
1035 245158863 250597343 254325485 256654339 257945919 258506546 258547783 258202877 257563438 256706944
1044 256706944 255700226 254586143 253370800 252022991 250490265 248721371 246683750 244368935 241785355
1053B41785355k838936l085613l330670l578873l831291m088688m354248m634227m934884
1062B07107925n258388n602017n960140o328678o708336p102546p512188p930823q342953
1071A46361856q728704r068127r344177r537506r620914r556551r304944q842482q179655
1080F4178796p366829o481538n601730m777770m020014l308156k615134j932662j279657
1089B6795306o92537k02567J85694N02217Q05219J167073J660018K345676L266258
1098C5832357M430347N795908P257104Q647351R771080J0457864J0624905J0319814
1106A03136730R721327R087801Q666496Q593989Q831072R161577R267549Q855057P784100
1115A83105698O147651M261608K567387J484394J272869J957894L339519N072060O773262
$$ plain form
1053 241785355 238946419 235860806 232530136 228951263 225119972 221031284 216677036 212042809 207107925
1062 207107925 201849537 196247520 190287380 183958702 177250366 170147820 162635632 154704809 146361856
1071 146361856 137633152 128565025 119220848 109683342 100062428 90505877 81200933 72358451 64178796
1080 64178796 56811967 50330429 44728699 39950929 35930915 32622759 30007625 28074963 26795306
1089 26795306 26102769 25900202 26085896 26588113 27393332 28560405 30220423 32566099 35832357
1098 35832357 40262704 46058612 53315716 61963067 71734147 82192011 92816916 103136730
1106 103136730 112858057 121945858 130612354 139206343 148037415 157198992 166466541 175321598 183105698
1115 183105698 189253349 193514957 196082344 197566738 198839607 200797501 204137020 209209080 215982342
1124B15982342Q121185Q913002R080982Q676014P830029O709270N463791M188004K908077
1133B77872696J601448K46201j130887k433052l517570m252014m569721m490376m094505
1142B55232220l472691k686291j767826p55520K65980J159706J775608K016812J889477
1151B53657475J502838J016845N66521K09217p9441l65467p01809j094761j507492
1160B53203926j891956k222615k510547k788143l076477l356018l560410l603725l434773
1169B26759262l093815k740059k618370k958908l842277n094738o284256o851445o339187
1178A86936207m621163k008571Q34217L142700M356194M325828L328877J893386N36919
1187A98724594m40998j021862j381645j733647k202262k788182l418197m023705m587250
$$ plain form
1124 215982342 224103527 233016529 242097511 250773525 258603554 265312824 270776615 274964619 277872696
1133 277872696 279474144 279720345 278589458 276156406 272638836 268386822 263817101 259326725 255232220
1142 255232220 251759529 249073238 247305412 246549892 246815872 247975578 249751186 251767998 253657475
1151 253657475 255160313 256177158 256743679 256952896 256873455 256507988 255806179 254711418 253203926
1160 253203926 251311970 249089355 246578808 243790665 240714188 237358170 233797760 230194035 226759262
1169 226759262 223665447 220925388 218307018 215348110 211505833 206411095 200126839 193275394 186936207
1178 186936207 182315044 180306473 181140690 184283390 188639584 192965412 196294289 198187675 198724594
1187 198724594 198283596 197261734 195880089 194146442 191944180 189155998 185737801 181714096 177126846
1196A77126846n135097n695973o265678o805849p271557p644405p943011q208122q473215
1205A13683939q744040q995552r183158r256554r168925q882189q373976p647705o741068
1214C6690772n721913m671922l661947k734821j903252j162417n05933O6564N55609
1223A6950740R74347J355446J748131K201955K751625L407688M158535M979737N842962
1232D4371166O719556P578955Q384404R091244R651022J0021534J0182438J0148172
1240A16148491R973678R742976R542303R427891R401855R413357R383335R241085Q949032
1249B01224003Q504047P915306P182370O290054N226250M004039K662392J235485k89574
1258B43954372j988906l959389o225472q647785j0898266j2541027j3192310j2680493
$$ plain form
1196 177126846 171991749 166295776 160030098 153224249 145952692 138308287 130365276 122157154 113683939
1205 113683939 104939899 95944347 86761189 77504635 68335710 59453521 51079545 43431840 36690772
1214 36690772 30968859 26296937 22634990 19900169 17996917 16834500 16328567 16395131 16950740
1223 16950740 17925087 19280533 21028664 23230619 25982244 29389932 33548467 38528204 44371166
1232 44371166 51090722 58669677 67054081 76145325 85796347 95817881 106000319 116148491
1240 116148491 126122169 135865145 145407448 154835339 164237194 173650551 183033886 192274971 201224003
1249 201224003 209728050 217643356 224825726 231115780 236342030 240346069 243008461 244243946 243954372
1258 243954372 241965466 238006077 231780605 223132820 212234554 199693527 186501217 173820724
1266A73820724j1115970q831978o231346l633843j210537R65472K805834M123716M651937
1275A55344009M160424K599830J77250k689390n514517p902489r637470j0669937j1033878
1284A14833832j0763521r864903q349533o290851l854079j275892J190748L331175
1292G8956976M994936O094904O601477O547536O041003N259714M407825L640557K992706
1301A25537634K357178J534633L38125j298418l260269n265579o939564p911033p894745
1310I7197962o743126m468784j250182K578621O562052J0189753J2990961J4636211
1318A31693468J5011749J4240351J2639980J0632172Q631382O945305N716762M917736
1326B10428905M393406L933926L344345K486210J283207k92206k220898m404544o610909
$$ plain form
1266 173820724 162704754 153872776 147641430 144007587 142797050 143762522 146568356 150692072 155344009
1275 155344009 159504433 162104263 162281513 159592123 154077606 146175117 136537647 125867710 114833832
1284 114833832 104070311 94205408 85855875 79565024 75710945 74435053 75625801 78956976
1292 78956976 83951912 90046816 96648293 103195829 109236832 114496546 118904371 122544928 125537634
1301 125537634 127894812 129429445 129767570 128469152 125208883 119943304 113003740 105092707 97197962
1310 97197962 90454836 85986052 84735870 87314491 93876543 104066296 117057257 131693468
1318 131693468 146705217 160945568 173585548 184217720 192849102 199794407 205511169 210428905
1326 210428905 214822311 218756237 222100582 224586792 225869999 225577793 223356895 218952351 212341442
1335B12341442q437557r351483q828868o563301k652112K340184P498989J1829014
1343A98176308J4567184J5405502J4531594J2484283R908333P328701N034065L091069
1351B80527039J441097j087j299096k510566l724804n076466o703262q660221j0834332
1360B43158302j2910423j4420605j4872169j3911991j1469307p820072l544541O11992
1368A64821186L932667N910644O362019N437374L537273J173287j174145l151836m568539
1377A82279930n374451n614795n386200m807682m006291l105039k204504j363468n88332
1386A49829168J54305R03644J666003K391386K984495L343658L408985L189068K753296
1395A70624008K192688J575833R27047K36111n07107j282749k034187k692204l209858
$$ plain form
1335 212341442 203903885 194552402 185723534 179160233 176508121 178848305 186347294 198176308
1343 198176308 212743492 228148994 242680588 255164871 265073204 272401905 277435970 280527039
1351 280527039 281968136 281967049 280667953 278157387 274432583 269356117 262652855 253992634 243158302
1360 243158302 230247879 215827274 200955105 187043114 175573807 167753735 164209194 164821186
1368 164821186 168753853 174664497 181026516 186463890 190001163 191174450 190000305 186848469 182279930
1377 182279930 176905479 171290684 165904484 161096802 157090511 153985472 151780968 150417500 149829168
1386 149829168 149983473 150887117 152553120 154944506 157929001 161272659 164681644 167870712 170624008
1395 170624008 172816696 174392529 175319576 175555687 175048580 173765831 171731644 169039440 165829582
1404A65829582l586464l862190m088392m293175m465303m565716m557572m434871m229536
1413A27746363l992501l759737l521881l218746k760706k073440j142016l4675J109819
1422A08352480K129974K903891L397350L669281L829336L967810M096708M138728L973379
1431A40458937L515644K779989J889954J025438L37791j15366l81708n71327p91693
1440A48147659j104517j523571k041635k651663l339949m054260m681368n066814n080881
1449A18603001m696999m028625l292103k705107k380781k277737k243109k117157j835908
1458I3025475j462679j130371r33381q45356p20386l81527K58455J125241K006073
1467I0941544K659502K941951K876778K625055K383700K276096K301140K362623K349253
$$ plain form
1404 165829582 162243118 158380928 154292536 149999361 145534058 140968342 136410770 131975899 127746363
1413 127746363 123753862 119994125 116472244 113253498 110492792 108419352 107277336 107242661 108352480
1422 108352480 110482454 113386345 116783695 120452976 124282312 128250122 132346830 136485558 140458937
1431 140458937 143974581 146754570 148644524 149669962 150007753 149892387 149510679 148939352 148147659
1440 148147659 147043142 145519571 143477936 140826273 137486324 133432064 128750696 123683882 118603001
1449 118603001 113906002 109877377 106585274 103880167 101499386 99221649 96978540 94861383 93025475
1458 93025475 91562796 90432425 89499044 88653688 87933302 87551775 87810230 88935471 90941544
1467 90941544 93601046 96542997 99419775 102044830 104428530 106704626 109005766 111368389 113717642
1476A13717642K208071J969165J717062J539784J490536J581058J791182K080021K386970
1485A30481491K637577K768631K769547K714710K753582L050232L704958M707908N959063
1494A61547699P337894Q763562J0187206J1514854J2523079J2860852J2181015J0353317
1502B47269478P629013M632091K142430P66506O72913J540660K746239L679428M006291
1511B75085049L747787L163662K541275K031517J613102J176701O43234L7651n18837
1520B89521141q71391r02424n78728L1986P67785J406078J732120J634007J184177
1529B93924751O44856L60908N69916J229763J980133K290630J738816K68421j725960
1538C01282234l551025m533043m333515l097801j363984K07138J135025J308232R80854
$$ plain form
1476 113717642 115925713 117894878 119611940 121151724 122642260 124223318 126014500 128094521 130481491
1485 130481491 133119068 135887699 138657246 141371956 144125538 147175770 150880728 155588636 161547699
1494 161547699 168885593 177649155 187836361 199351215 211874294 224735146 236916161 247269478
1502 247269478 254898491 259530582 261673012 262439518 263112431 264653091 267399330 271078758 275085049
1511 275085049 278832836 281996498 284537773 286569290 288182392 289359093 290002327 290039978 289521141
1520 289521141 288649750 287747326 287168598 287200584 287968369 289374447 291106567 292740574 293924751
1529 293924751 294569607 294930515 295500431 296730194 298710327 301000957 302739773 303008194 301282234
1538 301282234 297731209 293198166 288864651 285766850 284402866 284610004 285745029 287053261 288034115
1547B88034115O02741N74818J044960J826229K466869K446823J427212n49202k999763
1556B94874802n139237o180477n682449l781243j175747J152707K367878K151203Q25462
1565B79412899q33492k003765k225418j599274o77185j22280l36781j265983k474461
1574B67874260l428841l804626l636398l233262k935543k880191k924710k772770k205543
1583B40052376j262913k53067M09718M30297k24285j343746k625065l839340m899025
1592B26444950n795250o469650o734867o320782n031891k917843l43494K097492L793259
1601A98721924M344292L707427K193661L33958j323586k402114k805615k719307k503395
1610A97547245k525120k991504l858090m857063n635224n936260n729294n217247m720497
$$ plain form
1547 288034115 288636856 289211674 290256634 292082863 294549732 296996555 298423767 297874565 294874802
1556 294874802 289735565 283555088 277872639 274091396 272915649 274068356 276436234 278587437 279412899
1565 279412899 278579407 276575642 274350224 272750950 272073765 271951485 271614704 270348721 267874260
1574 267874260 264445419 260640793 257004395 253771133 250835590 247955399 245030689 242257919 240052376
1583 240052376 238789463 238536396 238946114 239376411 239152126 237808380 235183315 231343975 226444950
1592 226444950 220649700 214180050 207445183 201124401 196092510 193174667 192831173 194928665 198721924
1601 198721924 203066216 206773643 208967304 209301262 207977676 205575562 202769947 200050640 197547245
1610 197547245 195022125 192030621 188172531 183315468 177680244 171743984 166014690 160797443 156076946
1619A56076946m508276m671621n107107n603276n968055o116877o083517n968380n874767
1628A06175070n872822n996933o252813o611452o993194p266831p285614o953249o282006
1637D6660156n400376m498310l737934l181875k779972k414723j972713j395986o92248
1646B0586019R3934R19311J770177K667244L653295M766345O005845P301831Q504538
1655E6268539R413686R848824R731774R132891Q243561P277879O361628N478659M515571
1664A26273012L378143K096272Q40006j72653q13933j132021j316690j565418j944294
1673A25642424k345639k580404k540655k318449k187548k451601l252058m464397n747624
1682I7754049o720991p156868p076306o702151o312085o088543o048779o078067o022923
$$ plain form
1619 156076946 151568670 146897049 141789942 136186666 130218611 124101734 118018217 112049837 106175070
1628 106175070 100302248 94305315 88052502 81441050 74447856 67181025 59895411 52942162 46660156
1637 46660156 41259780 36761470 33023536 29841661 27061689 24646966 22674253 21278267 20586019
1646 20586019 20679953 21599264 23369441 26036685 29689980 34456325 40462170 47764001 56268539
1655 56268539 65682225 75531049 85262823 94395714 102639275 109917154 116278782 121757441 126273012
1664 126273012 129651155 131747427 132587433 132414780 131600847 130468826 129152136 127586718 125642424
1673 125642424 123296785 120716381 118175726 115857277 113669729 111218128 107966070 103501673 97754049
1682 97754049 91033058 83876190 76799884 70097733 63785648 57697105 51648326 45570259 39547336
1691C9547336n778043n320130m687879l941757l138157k328842j571194r28779m50109
1700A1402446j40498N2268K25451M80837Q81535J423945K036193K600162K983836L071640
1710B5017815K789831K124662J135278m7042j237436k238261k890814l120045k951849
1719A8582139k492579j880853j232632o06672k283O14142J275032J989151K741451
1728A8986896L508297M271966N022065N742445O397574O931381P287126P437696P408247
1737G2993693P276063P140036P076960P103033P164116P160062O994448O625824O097651
1746A35631886N528860N068359M833260M858350N083695N385113N632705N744457N708561
1755A83475246N566750N374851N173264M984207M831390M756661M805584M983902N214309
$$ plain form
1691 39547336 33769293 28449163 23761284 19819527 16681370 14352528 12781334 11852555 11402446
1700 11402446 11261948 11314216 11539667 12020504 12902039 14325984 16362177 18962339 21946175 25017815
1710 25017815 27807646 29932308 31067586 31020544 29783108 27544847 24654033 21533988 18582139
1719 18582139 16089560 14208707 12976075 12369403 12367120 12981262 14256294 16245445 18986896
1728 18986896 22495193 26767159 31789224 37531669 43929243 50860624 58147750 65585446 72993693
1737 72993693 80269756 87409792 94486752 101589785 108753901 115913963 122908411 129534235 135631886
1746 135631886 141160746 146229105 151062365 155920715 161004410 166389523 172022228 177766685 183475246
1755 183475246 189041996 194416847 199590111 204574318 209405708 214162369 218967953 223951855 229166164
1764B29166164N336533N170193M617309L742619K776012K021771J716671J917972K482052
1773B58947296L141956L634987L805962L638554L219699K679348K148037J744423J569767
1782B84530029J680870K043896K504520K818299K754440K226010J368694N05714j201
1791C00431271O0310O33259J410846J991807K084751J652736R19457K42977o9676R2736
1801C09450474O13594J230335J678810J816750J668968J382351J126633J002998J009159
1810C20980072J070328J108894J102104J091309J140327J277161J462975J612205J649208
1819C32494583J559181J393128J225319J092605R69086P95670N46112K73933R7923
1828C40447540J28060L83377P66182J118812J326714J393318J425018J531334J712990
$$ plain form
1764 229166164 234502697 239672890 244290199 248032818 250808830 252830601 254547272 256465244 258947296
1773 258947296 262089252 265724239 269530201 273168755 276388454 279067802 281215839 282960262 284530029
1782 284530029 286210899 288254795 290759315 293577614 296332054 298558064 299926758 300432472 300431271
1791 300431271 300491581 301124840 302535686 304527493 306612244 308264980 309184437 309427414 309357738 309450474
1801 309450474 310064068 311294403 312973213 314789963 316458931 317841282 318967915 319970913 320980072
1810 320980072 322050400 323159294 324261398 325352707 326493034 327770195 329233170 330845375 332494583
1819 332494583 334053764 335446892 336672211 337764816 338733902 339529572 340075684 340349617 340447540
1828 340447540 340575600 340958977 341725159 342843971 344170685 345564003 346989021 348520355 350233345
1837C50233345J824455J653405J072807J64718p78083j386528j411400q61817k28Q00628
1847C51311302J251679J276283J009598O83212M79202M42543M95262N24445M77676
1856C57951202M00887M00543N58014Q55484J160812J282578J069450N00832k83470
1865C63896332j030045j482010j494980j104469n06744L6773L21579K84653J0452l35998
1875C58595543o03256p17812o90613n75714m23507k61765j10741o447R54j21803l49465
1886C54735374n90095p20635o56394m04397o4888K21825L51677L05481J43623l9329
1896C53282242j68915k14577j81846r1019L5553J66283K54440K51846J42784k4948
1906C53451843j44806j03988J43356N29060Q90923J055260R34944N82351J61210j45264
$$ plain form
1837 350233345 352057800 353711205 354784012 354948730 354170647 352784119 351372719 350510902 350510674 351311302
1847 351311302 352562981 353839264 354848862 355532074 356011276 356453819 356949081 357473526 357951202
1856 357951202 358352089 358752632 359310646 360166130 361326942 362609520 363678970 364179802 363896332
1865 363896332 362866287 361384277 359889297 358784828 358278084 358314857 358636436 358921089 358931541 358595543
1875 358595543 357992287 357274475 356583862 356008148 355584641 355322876 355212135 355205688 355206642 355084839 354735374
1886 354735374 354145279 353424644 352768250 352363853 352298965 352520790 352872467 353177948 353321571 353282242
1896 353282242 353113327 352898750 352716904 352625885 352661438 352827721 353082161 353334007 353476791 353451843
1906 353451843 353307037 353203049 353346405 353875465 354766388 355821648 356756592 357338943 357500153 357354889
1916C57354889k33879j27182N7144J88408K01301J23330M1961L7537J29051K62795
1926C58035355L47519L10897J42479r6245l01551l77732k84576o1836J83983L24173
1936C58222466K67944R308l63922p06940q86192q46329o37856l90472k45056k79656
1946C54143295m71344p13005q73337q64868o84280m03862j25466P4425J78414K26059
1956C50486031K79655L83301N34744O86493P71408P38258N80368L40119R0752r7809
1966C54793320j88866j92795j54381j23519j25313j45378j40763o8893Q3198K85149
1976C54021759M75922N95665O16340N56679M69589M11492M09889M49524M80728M51317
1986C58938904L37066J59684k0943j35765j39618l2539J40037L09944M17099M33846
$$ plain form
1916 357354889 357121010 356993828 357050972 357239380 357440681 357564011 357605972 357643509 357772560 358035355
1926 358035355 358382874 358693771 358836250 358740005 358438454 358060722 357776146 357714310 357898293 358222466
1936 358222466 358490410 358499718 358135796 357428856 356542664 355696335 355058479 354668007 354422951 354143295
1946 354143295 353671951 352958946 352085609 351220741 350536461 350132599 350007133 350081558 350259972 350486031
1956 350486031 350765686 351148987 351683731 352370224 353141632 353879890 354460258 354800377 354891129 354793320
1966 354793320 354604454 354411659 354257278 354133759 354008446 353863068 353722305 353653412 353736610 354021759
1976 354021759 354497681 355093346 355709686 356266365 356735954 357147446 357557335 358006859 358487587 358938904
1986 358938904 359275970 359435654 359414711 359278946 359139328 359106789 359246826 359556770 359973869 360407715
1996C60407715L71628K68135J65519Q9989M4365J4763j5526n2452q7814j05515r3765
2007C61007042n5618j0796J1749j1940q6593j92948k92968l47176l33023k58179j57280
2018C59272270p5989m8217p8965j42822j98593k12517j75514j07117m1351p095j2322
2029C58171768m1885o8474o9427l8643J1673N7602P5874N4245m273q1749j51176j85585
2041C57729950j68304j01548q659P3357J08833P9918l853j10474k00920k48604k50625
2052C56899071k24800j96839j83105j84403j90468j91574j89895j99967k38228l09944
2062C54789848l99398m74587n00984m59595l59115k33117j26457p4768q7891j46217
2072C51927719k10190k40516k16637j45493n6266J6403N1002M9782L3493K7085M1961
$$ plain form
1996 360407715 360779343 361047478 361212997 361302986 361347351 361362114 361346588 361294136 361206322 361100807 361007042
2007 361007042 360951424 360940628 360952377 360940437 360853844 360660896 360367928 360020752 359687729 359429550 359272270
2018 359272270 359196281 359148064 359069099 358926277 358727684 358515167 358339653 358232536 358191185 358184090 358171768
2029 358171768 358129883 358061409 357991982 357953339 357965012 358022614 358098488 358152733 358148460 358066711 357915535 357729950
2041 357729950 357561646 357460098 357451439 357524796 357633629 357713547 357709694 357599220 357398300 357149696 356899071
2052 356899071 356674271 356477432 356294327 356109924 355919456 355727882 355537987 355338020 355099792 354789848
2062 354789848 354390450 353915863 353414879 352955284 352596169 352363052 352236595 352161827 352073936 351927719
2072 351927719 351717529 351477013 351260376 351114883 351058617 351075020 351126022 351175804 351209297 351236382 351278343
2083C51278343O9237Q4457O4392M044p8239j48201j73111j39237n9891L1281R4719
2094C51027794J03416N2491l8758j35574k01187k11106j62201p4806J4839O8474O3248
2105C50506630K212q5258j56899j77421j36604n3406L3226Q5640Q6670M5585q392m4861
2117C50097122m8904k7504j717O218j2398n0583r0980j16997j22032j11465r6589q8501
2129C49335670r2506j06926j26152j42975j51367j46904j27525r3727m8752K098N3177
2140C48354111J00212J38664J62468J61896J26762N2605n0583j56441k29149k40097
2150C48420448j84822r0332m654K7199j2321j01281j89247k25715j89286j00898j2932
2161C47336159K0828k4529j30805k47422l18603l13187k38686j33934m7378j4191m1122
$$ plain form
2083 351278343 351347580 351432037 351496429 351500473 351422234 351274033 351100922 350961685 350901794 350933075 351027794
2094 351027794 351131210 351183701 351144943 351009369 350808182 350597076 350434875 350360069 350374908 350443382 350506630
2105 350506630 350508842 350423584 350266685 350089264 349952660 349899254 349932480 350018120 350104790 350150375 350141983 350097122
2117 350097122 350048218 350020714 350018997 350025215 350012817 349962234 349871254 349754257 349632225 349520760 349424171 349335670
2129 349335670 349243164 349136238 349010086 348867111 348715744 348568840 348441315 348347588 348298836 348300934 348354111
2140 348354111 348454323 348592987 348755455 348917351 349044113 349096718 349046135 348889694 348660545 348420448
2150 348420448 348235626 348145294 348140640 348167839 348155518 348054237 347864990 347639275 347449989 347349091 347336159
2161 347336159 347356987 347332458 347201653 346954231 346635628 346322441 346083755 345949821 345902443 345888252 345847130
2172C45847130j09596j87798k45743k66342k48642k05231j55830j19667j08452j21612
2182C44078217j45951j61171j49994j07498m4479J7013N7564O9466O1645N2109N3940
2193C43780861O5689P0572M7531j3504j02272j91078k49748k62375k36092j96457j71585
2204C42541542j75476j99738k19039k07253j53084o9275J2665N7297M2801k8496j29929
2215C41472015k22816k73628k68326k18964j56669j16692j21880j71546k42539l01361
2225C39377594l20549k92015k30446j63841j19057j07880j22757j42326j45264j22489
2235C37610970q3275n0087m6845q3771j49650k14996k44942k17629j37405l5248M5319
2246C36392441O9999L3799l5630r0484r0294k4986P7171J62468J80550J11274k4566
$$ plain form
2172 345847130 345737534 345549736 345303993 345037651 344789009 344583778 344427948 344308281 344199829 344078217
2182 344078217 343932266 343771095 343621101 343513603 343469124 343486137 343543701 343613167 343674812 343726921 343780861
2193 343780861 343846550 343917122 343964653 343951149 343848877 343657799 343408051 343145676 342909584 342713127 342541542
2204 342541542 342366066 342166328 341947289 341740036 341586952 341517677 341530342 341587639 341630440 341601944 341472015
2215 341472015 341249199 340975571 340707245 340488281 340331612 340214920 340093040 339921494 339678955 339377594
2225 339377594 339057045 338765030 338534584 338370743 338251686 338143806 338021049 337878723 337733459 337610970
2235 337610970 337527695 337477608 337430763 337346992 337197342 336982346 336737404 336519775 336382370 336347122 336392441
2246 336392441 336462440 336496239 336460609 336370125 336279831 336254845 336332016 336494484 336675034 336786308 336761742
2257C36761742j75286k84843l19367k80571k00615j22795p9841q0490j09444j38626
2267C34969864j42288j10970n5466l013J5907j6479r3956j83831k39715k22092j18866
2278C33799095M5509K18277L40271L72162L09220J80893L4523q4954j51710j62316
2288C34900970j31645q1367l1929M616K6054L9062N6191Q9455J44882K18963L00446
2299C35535698L76167M36173M74853M85764M55894L65868K00462l2730k88544m84237
2309C37525368n24445l40881O4812O00128J097259J367378J276703Q13713J11390n91965
2319C41399460j049347j118698q36449m08363j10855j47591n38483j106643j575127
2328C34507904j721077j496048j039085n79186k96440k37617l44773n64422r43489
$$ plain form
2257 336761742 336586456 336301613 335982246 335701675 335501060 335378265 335298424 335217934 335108490 334969864
2267 334969864 334827576 334716606 334661140 334658127 334674034 334657555 334563599 334379768 334140053 333917961 333799095
2278 333799095 333844604 334062881 334403152 334775314 335084534 335265427 335299950 335214996 335063286 334900970
2288 334900970 334769325 334687958 334656029 334660645 334686699 334725761 334781952 334871407 335016289 335235252 335535698
2299 335535698 335911865 336348038 336822891 337308655 337764549 338130417 338330879 338298149 338009605 337525368
2309 337525368 337000923 336660042 336724854 337324982 338422241 339789619 341066322 341880035 341991425 341399460
2319 341399460 340350113 339231415 338394966 337986603 337875748 337728157 337189674 336083031 334507904
2328 334507904 332786827 331290779 330251694 329672508 329376068 329138451 328793678 328229256 327285767
2337C27285767j612091k638779l846722m741592m650727l048954R2144M143544P976227
2346C18958817J0393905J0633660Q683395N253143J430168j793632l877564m821510
2354C44860382m992103m831963m626389m436912m187470l806324l317814k833385k473392
2363C09354630k285691k219257k161980k007809j709327j287766q08391l43514N4245
2372B96585140L61576N82085P40986Q78620J037617J246929J503887J769066J978054
2381C06683960K067814K004433J798439J499290J174831Q85983O68716N28469M46034
2390C17757969L89938L30735K52075J57032O5002J850j4972J2588O1550R8820R7904
2401C19210491N2262k2183r8705j53713j79882j84594j81713j80397j79539j71241
$$ plain form
2337 327285767 325673676 323034897 319188175 314446583 309795856 306746902 306839046 310982590 318958817
2346 318958817 329352722 339986382 348669777 353922920 355353088 353559456 349681892 344860382
2354 344860382 339868279 335036316 330409927 325973015 321785545 317979221 314661407 311828022 309354630
2363 309354630 307068939 304849682 302687702 300679893 298970566 297682800 296874409 296530895 296585140
2372 296585140 296946716 297528801 298269787 299148407 300186024 301432953 302936840 304705906 306683960
2381 306683960 308751774 310756207 312554646 314053936 315228767 316114750 316783466 317311935 317757969
2390 317757969 318147907 318478642 318730717 318887749 318952751 318954601 318939629 318952217 319013767 319112587 319210491
2401 319210491 319262753 319240570 319141865 318988152 318808270 318623676 318441963 318261566 318082027 317910786
2411C17910786j48888j13201p3223m1294k7504l5458o3743j06507j55315j99166k26059
2422C16720428k27413k04029j68800j44081j51291j98307k72961l46603l88756l82690
2432C14235497l34969k71721k23350k07062k17953k32925k25697j82743j11828l7403
2442C12189846J4401K9544J4363r957k0103l605L4256P4825R6722Q7757N0793J793
2454C12560635l8891n6534m9515k8858j3676k1648o0272j22242j87817k32563k39429
2465C11509190k07463j54285j08605r5958j25428j83467k39678k63557k41051j83697
2475C09706001j24721j00060j30043k05021k89764l39890l25451k46944j37119m4880
2485C07762108j2245n3597j49116k54727l24173l30486k77576j95389j23444r0237
$$ plain form
2411 317910786 317761898 317648697 317575474 317534180 317506676 317471218 317407475 317300968 317145653 316946487 316720428
2422 316720428 316493015 316288986 316120186 315976105 315824814 315626507 315353546 315006943 314618187 314235497
2432 314235497 313900528 313628807 313405457 313198395 312980442 312747517 312521820 312339077 312227249 312189846
2442 312189846 312204247 312233791 312248154 312238197 312218094 312214489 312248745 312323570 312420292 312508049 312558842 312560635
2454 312560635 312521744 312465210 312415695 312386837 312373161 312351513 312291241 312168999 311981182 311748619 311509190
2465 311509190 311301727 311147442 311038837 310942879 310817451 310633984 310394306 310130749 309889698 309706001
2475 309706001 309581280 309481220 309351177 309146156 308856392 308516502 308191051 307944107 307806988 307762108
2485 307762108 307749863 307696266 307547150 307292423 306968250 306637764 306360188 306164799 306041355 305951118
2495C05951118j01528j40857j81904k03991k02542j88236j78833j87435k15130k52800
2505C04097862k85911l03154k99664k77366k42444k02579j65558j38721j26477j28708
2515C01927280j38301j43357j32293j00670n3940o180K7466L9062L1529J6003M291
2526C01470890J144J622n169k7580o5518j08738j42155j53350j38741j04713o3248
2537C00664444k5654K403K1305L5325M7397N6820N8308M5910J6193k8496p9651j25122
2549C00689182j53942j60503j47362j24893j07708j08833j34469j80740k34394k77767
2559B99058571k95468k80876k38533j82628j30520r5978q5011r4890j17664j45188
2569B97391815j71833j95312k14310k26975k30979k25430k14233k05479k08645k29015
$$ plain form
2495 305951118 305849590 305708733 305526829 305322838 305120296 304932060 304753227 304565792 304350662 304097862
2505 304097862 303811951 303508797 303209133 302931767 302689323 302486744 302321186 302182465 302055988 301927280
2515 301927280 301788979 301645622 301513329 301412659 301358719 301352539 301380005 301419067 301450596 301466599 301470890
2526 301470890 301472034 301473656 301468487 301440907 301375389 301266651 301124496 300971146 300832405 300727692 300664444
2537 300664444 300638790 300641193 300662498 300697823 300745220 300802040 300860348 300906258 300922451 300893955 300814304 300689182
2549 300689182 300535240 300374737 300227375 300102482 299994774 299885941 299751472 299570732 299336338 299058571
2559 299058571 298763103 298482227 298243694 298061066 297930546 297834568 297749557 297654667 297537003 297391815
2569 297391815 297219982 297024670 296810360 296583385 296352406 296126976 295912743 295707264 295498619 295269604
2579B95269604k63062k97832l16334l05328k62738k00329j38950j00860r9087j33152
2589B93151932j89018k46602k88868l09982l16429l22266l39431l68653l96595m01382
2599B89972706l64647k84309j79425q3923l1872l9825r8782j77689k39906k60677k38629
2610B87973022j92699j50490j31836j40838j68171j99662k25715k44141k55947k59190
2620B86004333k46505k10572j51386q1653k3384L337q068m6310q8825j15300j19800
2631B84915867j12953j12934j30692j61743j87493j89037j61152j17778q4591q1997
2641B83575497j10684j49326j66607j41315p5989J774N5523O0043J5831n1823j07403
2652B82905521j25370j02367n6744j5373J526r632l7537o5632q2798q8882r1686r9678
$$ plain form
2579 295269604 295006542 294708710 294392376 294087048 293824310 293623981 293485031 293384171 293285084 293151932
2589 293151932 292962914 292716312 292427444 292117462 291801033 291478767 291139336 290770683 290374088 289972706
2599 289972706 289608059 289323750 289144325 289060402 289028530 288988705 288889923 288712234 288472328 288211651 287973022
2610 287973022 287780323 287629833 287497997 287357159 287188988 286989326 286763611 286519470 286263523 286004333
2620 286004333 285757828 285547256 285395870 285314217 285290833 285294170 285286102 285239792 285150967 285035667 284915867
2631 284915867 284802914 284689980 284559288 284397545 284210052 284021015 283859863 283742085 283657494 283575497
2641 283575497 283464813 283315487 283148880 283007565 282931576 282933350 282988873 283048916 283064747 283012924 282905521
2652 282905521 282780151 282677784 282621040 282605667 282607193 282597561 282560024 282494392 282411594 282322712 282231026 282131348
2664B82131348j15185j32485j42307j38683j23005j04313r4128j00002j21403j50470
2674B80909367j76220j90411j91479j83773j73874j65920j59454j50891j38435j25599
2684B79253311j22146j38112j77135k30217k77596k96421k73475k13623j40076q4724
2694B77299786p3815j15013j95331k87076l62262m03900m11187l96137l74889l59154
2704B74321022l52859l52440l51677l44696l29037l05328k78931k58865k57550k86007
2714B71203632l48816m38327n34325o09684o41537o21757n62306m88567m28734l99189
2724B66130390l98731m12140m20914m15783m02088l95336m10976m53301n10902n62210
2734B61748009n84526n65472n06954m23699l36418k64129k19422k06985k24800k64836
$$ plain form
2664 282131348 282016163 281883678 281741371 281602688 281479683 281375370 281281242 281181240 281059837 280909367
2674 280909367 280733147 280542736 280351257 280167484 279993610 279827690 279668236 279517345 279378910 279253311
2684 279253311 279131165 278993053 278815918 278585701 278308105 278011684 277738209 277524586 277384510 277299786
2694 277299786 277225971 277110958 276915627 276628551 276266289 275862389 275451202 275055065 274680176 274321022
2704 274321022 273968163 273615723 273264046 272919350 272590313 272284985 272006054 271747189 271489639 271203632
2714 271203632 270854816 270416489 269882164 269272480 268630943 268009186 267446880 266958313 266529579 266130390
2724 266130390 265731659 265319519 264898605 264482822 264080734 263685398 263274422 262821121 262310219 261748009
2734 261748009 261163483 260598011 260091057 259667358 259330940 259066811 258847389 258640404 258415604 258150768
2744B58150768l15799l64857m01249m19808m22496m17786m15325m21219m34303m47216
2754B54090710m50840m40274m17823l92437l74775l71361l82309m00257m15669m20608
2764B50024357m13037l97415l82995l80478l98369m39415m99897n69344o33182o77490
2774B45232735o93512o81114o49262o11458n80044n59463n44510n22919m83341m22840
2784B39484272l50475k84233k42615k34394k53830k83585l03840l02906k83776k60505
2794B36684113k50397k63729k98558l43875l85991m16202m33121m39892m39319m31252
2804B32981777m13723l87249l57017l31688l18527l18623l26042l31555l28140l14636
2814B29554577k94323k72141k51426k33975k23865k28024k53925l02982l65315m21238
$$ plain form
2744 258150768 257834969 257470112 257068863 256649055 256226559 255808773 255393448 254972229 254537926 254090710
2754 254090710 253639870 253199596 252781773 252389336 252014561 251643200 251260891 250860634 250444965 250024357
2764 250024357 249611320 249213905 248830910 248450432 248052063 247612648 247112751 246543407 245910225 245232735
2774 245232735 244539223 243858109 243208847 242597389 242017345 241457882 240913372 240390453 239907112 239484272
2784 239484272 239133797 238849564 238606949 238372555 238118725 237835140 237531300 237228394 236944618 236684113
2794 236684113 236433716 236169987 235871429 235527554 235141563 234725361 234292240 233852348 233413029 232981777
2804 232981777 232568054 232180805 231823788 231492100 231173573 230854950 230528908 230197353 229869213 229554577
2814 229554577 229260254 228988113 228736687 228502712 228278847 228050823 227796898 227493916 227128601 226707363
2824B26707363m51126m47102m20856l97491m01459m39835m96101n38540n39761m92859
2834B22082233m17575l48149l14579l27892l77522m43019n07641n66922o25820o88533
2844B17464581p51191q02517q32767q42819q46558q63209r05914r72748j048851j114654
2854B08483353j156216j170197j161098j135731j100292j062717j036873j042404j096669
2863A98521156j202907j340275j467781j538258j520557j414642j252404j083965r56173
2872A86744194q95843r04122r63859j051655j147995j241036j323662j390361j436463
2881A76389198j460876j469803j476688j498986j550083j633816j741390j855984j958637
2890A61742935k036409k085514k110186k117834k112532k091808k048464j974144j865997
$$ plain form
2824 226707363 226256237 225809135 225388279 224990788 224589329 224149494 223653393 223114853 222575092 222082233
2834 222082233 221664658 221316509 221001930 220674038 220296516 219853497 219345856 218778934 218153114 217464581
2844 217464581 216713390 215910873 215078106 214235287 213388729 212525520 211619606 210646858 209598007 208483353
2854 208483353 207327137 206156940 204995842 203860111 202759819 201697102 200660229 199617825 198521156
2863 198521156 197318249 195977974 194510193 192971935 191451378 190036736 188784332 187700367 186744194
2872 186744194 185848351 184944229 183980370 182928715 181780720 180539684 179216022 177825661 176389198
2881 176389198 174928322 173458519 171981831 170482845 168932762 167298946 165557556 163701572 161742935
2890 161742935 159706526 157621012 155510826 153392992 151280460 149188652 147140188 145166044 143300047
2899A43300047j729698j578369j427622j290217j172905j076851r99736r38607q88986
2908A32197056q43973p93782p29608o49901n66024n01566m83980n31264o40735p86639
2918A25669584r30204j034861j081876j074925j034307r84459r40047r02261q60281
2927A16826363q00295p13530o00710m71210l40510k24399j35012p6151m1714j6088
2937A13406744J9236P7266J56918K40021K97145L00608K38114J20325k2736j53875
2947A14679766k43893k82116k77042k48680k16513j92642j78633j70956j66177j64967
2957A12538147j71452j89523k19317k57034k97594l39575l87897m52366n42279o59237
2967A09021873p93075r22365j021471j069775j058016r89046q71439p11641n07708
$$ plain form
2899 143300047 141570349 139991980 138564358 137274141 136101236 135024385 134024649 133086042 132197056
2908 132197056 131353083 130559301 129829693 129179792 128613768 128112202 127628222 127096958 126456223 125669584
2918 125669584 124739380 123704519 122622643 121547718 120513411 119528952 118588905 117686644 116826363
2927 116826363 116026068 115312538 114711828 114240618 113900108 113675709 113540697 113464546 113422832 113406744
2937 113406744 113425980 113503246 113660164 113900185 114197330 114497938 114736052 114856377 114833641 114679766
2947 114679766 114435873 114153757 113876715 113628035 113411522 113218880 113040247 112869291 112703114 112538147
2957 112538147 112366695 112177172 111957855 111700821 111403227 111063652 110675755 110223389 109681110 109021873
2967 109021873 108228798 107306433 106284962 105215187 104157171 103168125 102296686 101585045 101077337
2976A01077337k51493O3543M31414Q28209J214227J545496J788121J927814J972199
2985A10596867J943693J869898J775093J678600J595783J542235J530819J568851J650057
2994A25751896J753216J845340J892786J873084J783418J640425J472483J307726J164321
3003A40484695J047230R51796Q70924Q01706P46832P10201O90890O77662O49814N84269
3013A48216019M65469K94285R0980j11456k77595l84016m26960m23555m03204l94574
3023A46645393m13856m59709n17168n69029o06327o34547o69517p25565q03041q82664
3033A40363970r30929r15270q21333o62661m78067l17307k22234k12326k81229m03967
3043A35118647n49450o92301q18691r26504j021367j111183j201982j294098j380768
$$ plain form
2976 101077337 100825844 100889387 101320801 102149010 103363237 104908733 106696854 108624668 110596867
2985 110596867 112540560 114410458 116185551 117864151 119459934 121002169 122532988 124101839 125751896
2994 125751896 127505112 129350452 131243238 133116322 134899740 136540165 138012648 139320374 140484695
3003 140484695 141531925 142483721 143354645 144156351 144903183 145613384 146304274 146981936 147631750 148216019
3013 148216019 148681488 148975773 149066753 148955297 148677702 148293686 147866726 147443171 147039967 146645393
3023 146645393 146231537 145771828 145254660 144685631 144079304 143444757 142775240 142049675 141246634 140363970
3033 140363970 139433041 138517771 137696438 137033777 136555710 136238403 136016169 135803843 135522614 135118647
3043 135118647 134569197 133876896 133058205 132131701 131110334 129999151 128797169 127503071 126122303
3052A26122303j448965j484261j478023j434260j370983j314230j287393j299734j343184
3061A13661270j397686j442222j465855j469288j460114j443500j417036j374521j313935
3070A00877113j245222j189728j170597j199455j268139j351976j420851j454525j450081
3079H9126539j419868j381550j345635j310577j263838j190672j082439r42335p85737
3088G8403888o36897n22070m63052m70333n38330o46386p63755q60605r17163r29799
3098G1655498r08342q67729q18591p62606o94914o11677n16810m23327l47953l02119
3108F5401430k85058k83241k76041k45419j83525r5773K861R3666J62677K04749K25707
3119F4722033K38504K59199L00121L66211M52524N46846O33459O98648P34682P42201
$$ plain form
3052 126122303 124673338 123189077 121711054 120276794 118905811 117591581 116304188 115004454 113661270
3061 113661270 112263584 110821362 109355507 107886219 106426105 104982605 103565569 102191048 100877113
3070 100877113 99631891 98442163 97271566 96072111 94803972 93451996 92031145 90576620 89126539
3079 89126539 87706671 86325121 84979486 83668909 82405071 81214399 80131960 79189625 78403888
3088 78403888 77766991 77244921 76781869 76311536 75773206 75126820 74363065 73502460 72585297 71655498
3098 71655498 70747156 69879427 69060836 68298230 67603316 66991639 66474829 66051502 65703549 65401430
3108 65401430 65116372 64833131 64557090 64311671 64128146 64032373 64035234 64128900 64291577 64496326 64722033
3119 64722033 64960537 65219736 65519857 65886068 66338592 66885438 67518897 68217545 68952227 69694428
3129F9694428P29156P08990O96945P06511P45172Q12579Q98756R86839J057396J094327
3139G8131099J090269J048484R80777R02873Q28599P65725P15255O72779O32496N91021
3149H6359377N49030N11341M84505M72679M74024M79403M74739M46338L86915L00036
3159I0938387J98917J01824K3270l1748o9504j02968j43833j96257k54536l07588l46508
3170H9809456l70493l88107m11263m47502m93011n33705n52511n39513m99439m51069
3180H5122843m16899m11768m33197m62923m76723m58231m08725l47376l01600k94342
3190H1111059l33690m11635n09562o07009o88463p44910p72366p69797p39550o89755
3200G4844322o34694n93576n82815o09569o67009p36423p94682q23555q17652p85485
$$ plain form
3129 69694428 70423584 71132574 71829519 72536030 73281202 74093781 74992537 75979376 77036772 78131099
3139 78131099 79221368 80269852 81250629 82153502 82982101 83747826 84463081 85135860 85768356 86359377
3149 86359377 86908407 87419748 87904253 88376932 88850956 89330359 89805098 90251436 90638351 90938387
3159 90938387 91137304 91239128 91262398 91230650 91161146 91058178 90914345 90718088 90463552 90155964 89809456
3170 89809456 89438963 89050856 88639593 88192091 87699080 87165375 86612864 86073351 85573912 85122843
3180 85122843 84705944 84294176 83860979 83398056 82921333 82463102 82054377 81707001 81405401 81111059
3190 81111059 80777369 80365734 79856172 79249163 78560700 77815790 77043424 76273627 75534077 74844322
3200 74844322 74209628 73616052 73033237 72423668 71756659 71020236 70225554 69401999 68584347 67798862
3210F7798862p45105p16739p14350p41219p90429q48441r02405r44472r73968r94616
3220E9427118j009335j015687j005058r66774q95133p95450o84571n85189n16419m84996
3230E1468506m82941m92272m93703m75512m37502l88237l39169k98200k65641k35386
3240D7559943j97835j43628o6523L4756J56851K91643M28047N53766O58898P38668
3250E0014586P95031Q36663Q76904R30219J009016J119933J263008J430449J608873
3259E9884682J782636J937971K066870K169123K250543K319679K383361K444029K499337
3268G9738231K544951K576828K593632K597113K591266K581892K575903K580652K602158
3277A02982626K642202K695837K751246K792520K805558K784013K731247K658797K580146
$$ plain form
3210 67798862 67053757 66337018 65622668 64881449 64091020 63242579 62340174 61395702 60421734 59427118
3220 59427118 58417783 57402096 56397038 55430264 54535131 53739681 53055110 52469921 51953502 51468506
3230 51468506 50985565 50493293 49999590 49524078 49086576 48698339 48359170 48060970 47795329 47559943
3240 47559943 47362108 47218480 47151957 47186713 47343564 47635207 48063254 48617020 49275918 50014586
3250 50014586 50809617 51646280 52523184 53453403 54462419 55582352 56845360 58275809 59884682
3259 59884682 61667318 63605289 65672159 67841282 70091825 72411504 74794865 77238894 79738231
3268 79738231 82283182 84860010 87453642 90050755 92642021 95223913 97799816 100380468 102982626
3277 102982626 105624828 108320665 111071911 113864431 116669989 119454002 122185249 124844046 127424192
3286A27424192K506228K442293K390776K353210K332049K328386K336969K344723K333403
3295A48792229K287569K202787K088823J964274J846132J739607J636906J524677J396751
3304A65479755J262722J147404J077900J067944J108665J170254J215992J219559J175537
3313A75925732J099777J018047R52778R14536R00402R00669R05266R08069R06220Q97712
3323A85329208Q80146Q51422Q12626P69329P29484P00093O82582O73275O64769O51950
3333A92744884O34079O15826O03676O01788O09340O21033O29692O29711O18134N94177
3343A98902340N57022N04532M34189L45649K43588J37672L9616m1828j05362j56670
3353B00860748k03724k49176k84595k90718k44847j32598M3544K62776M92840P03678
$$ plain form
3286 127424192 129930420 132372713 134763489 137116699 139448748 141777134 144114103 146458826 148792229
3295 148792229 151079798 153282585 155371408 157335682 159181814 160921421 162558327 164083004 165479755
3304 165479755 166742477 167889881 168967781 170035725 171144390 172314644 173530636 174750195 175925732
3313 175925732 177025509 178043556 178996334 179910870 180811272 181711941 182617207 183525276 184431496 185329208
3323 185329208 186209354 187060776 187873402 188642731 189372215 190072308 190754890 191428165 192092934 192744884
3333 192744884 193378963 193994789 194598465 195200253 195809593 196430626 197060318 197690029 198308163 198902340
3343 198902340 199459362 199963894 200398083 200743732 200987320 201124992 201164608 201122780 201017418 200860748
3353 200860748 200657024 200407848 200123253 199832535 199587688 199455090 199498634 199761410 200254250 200957928
3363B00957928Q77723J012688J116028J194515J246624J263046J234208J160469J055297
3372B11118526R41468Q39615P57751O88648O17352N33218M39224L51735K91328K70138
3382B16849003K83832L14885L42865L58238L67145L88146M39834N29118O45237P63111
3392B21281414Q53577Q94699Q79478Q17299P30000O43940N81970N56831N66178N94635
3402B28400021O19030O18324N83134N20191M49352L94630L71705L80783M05578M21753
3412B33164501M07276L51944K61307J54209N5180j2207l2826k613O9657J65271K58809
3423B34840508L25984L50056L28007K72217K05497J52741J29452J36203J58806J76544
3433B37076015J75343J54686J27850J11885J14288J24454J19706Q0089O504p2479j11923
$$ plain form
3363 200957928 201835651 202848339 203964367 205158882 206405506 207668552 208902760 210063229 211118526
3372 211118526 212059994 212899609 213657360 214346008 214963360 215496578 215935802 216287537 216578865 216849003
3382 216849003 217132835 217447720 217790585 218148823 218515968 218904114 219343948 219873066 220518303 221281414
3392 221281414 222134991 223029690 223909168 224726467 225456467 226100407 226682377 227239208 227805386 228400021
3402 228400021 229019051 229637375 230220509 230740700 231190052 231584682 231956387 232337170 232742748 233164501
3412 233164501 233571777 233923721 234185028 234339237 234394417 234382210 234349384 234346771 234416428 234581699 234840508
3423 234840508 235166492 235516548 235844555 236116772 236322269 236475010 236604462 236740665 236899471 237076015
3433 237076015 237251358 237406044 237533894 237645779 237760067 237884521 238004227 238084316 238090820 238018341 237906418
3444B37906418p5646L8701J92108L20186L66802L14522J94989P1868O142K5101J11503
3455B39472694K18029K95353L16086K83356K21004J57414J11961R1419R3632J10970
3465B41371918J33648J50909J54190J43414J28994J27678J51729J96724K40002K51465
3475B43050671K12497J30349L6163l1319m7302j3142M9649J14688J65329J97583K10914
3486B44076080K00196J57680Q5640R003k8153J4859J44386L15380M45843M58355L26461
3497B46205730R6398j32141k58103k32410q3618J00956K24209K31704J36337M864q2340
3508B46211586p4062K8896J80378L17059L91082L89939L36837K73343K35519K35023
3518B48525600K54059K55890K05479R1629o2161k02999k69928k24285p1449J35364
$$ plain form
3444 237906418 237830772 237869473 238061581 238381767 238748569 239063091 239258080 239329948 239336090 239361191 239472694
3455 239472694 239690723 239986076 240302162 240585518 240806522 240963936 241075897 241167316 241260948 241371918
3465 241371918 241505566 241656475 241810665 241954079 242083073 242210751 242362480 242559204 242799206 243050671
3475 243050671 243263168 243393517 243429680 243398361 243351059 243337917 243387566 243502254 243667583 243865166 244076080
3486 244076080 244276276 244433956 244519596 244528599 244500446 244515305 244659691 244975071 245420914 245879269 246205730
3497 246205730 246302128 246169987 245911884 245679474 245595856 245696812 245921021 246152725 246289062 246293926 246211586
3508 246211586 246137524 246166420 246346798 246663857 247054939 247444878 247781715 248055058 248290577 248525600
3518 248525600 248779659 249035549 249241028 249332657 249270496 249067497 248797569 248573284 248501835 248637199
3528B48637199L14866L95603L52611K24953J01566P8125K03610M46014O97193Q21648
3538B52273388P26204M14657m940l69968n42946m79813k46086K7180K19383K83337
3548B52300396K55642K16083K27089K98329L97815M94919N94483P27558R02157J053753
3558B57468224J045227P34996Q0471p90939j601639k039642j910763j242637k76070
3567B51467228O50310J254693J423378J224155Q37326M56352K18792J87683L63045
3576B58082962O91452J063004J315269J275272Q41980O9828q09555j465759j623592
3585B59440861j210327m06380M38595R82017J053257P17049K06222k21595m08993l38783
3595B60251923q7090K55165O27403R86996J269264J372624J197891P20787M3717o19011
$$ plain form
3528 248637199 248952065 249347668 249700279 249925232 250026798 250104923 250308533 250754547 251451740 252273388
3538 252273388 252999592 253414249 253409309 253039341 252496395 252016582 251770496 251797676 252017059 252300396
3548 252300396 252556038 252772121 252999210 253297539 253695354 254190273 254784756 255512314 256414471 257468224
3558 257468224 258513451 259248447 259328918 258537979 256936340 254896698 252985935 251743298 251467228
3567 251467228 252117538 253372231 254795609 256019764 256857090 257313442 257532234 257719917 258082962
3576 258082962 258774414 259837418 261152687 262427959 263269939 263339767 262530212 261064453 259440861
3585 259440861 258230534 257824154 258262749 259244766 260298023 261015072 261221294 260999699 260590706 260251923
3595 260251923 260164833 260419998 261047401 262034397 263303661 264676285 265874176 266594963 266638680 266019669
3605B66019669j025887j017094n89294R8267P83214J192761J137447N84392l03478
3614B66879997j183891j629658j299114j28536J552715L083000L721791L003444J007786
3623B75007534j614437l906117n032882m655953l051891r28516R38968K046871K307015
3632B61110592J969032J419640R97143R04121J201725J820850K552243L048458K902012
3641B77925816J824913j43834k541523m603195n584678n125733l447819j254940O11268
3650B57660275J569900J533909Q67500J29318k24742j6327O59504J558494K415009
3659B66152840L010597L186874K857609K047539R29432k03705j053734j472740j552715
3668B73901997j570912j805362k331982k940140l233032k854786j702786L663J829052
$$ plain form
3605 266019669 264993782 263976688 263387394 263485661 264268875 265461636 266599083 267183475 266879997
3614 266879997 265696106 264066448 262767334 262638798 264191513 267274513 270996304 273999748 275007534
3623 275007534 273393097 269486980 264454098 259798145 256746254 255817738 256756706 258803577 261110592
3632 261110592 263079624 264499264 265496407 266400528 267602253 269423103 271975346 275023804 277925816
3641 277925816 279750729 279606895 277065372 272462177 266877499 261751766 258303947 257049007 257660275
3650 257660275 259230175 260764084 261631584 261760902 261536160 261519833 262179337 263737831 266152840
3659 266152840 269163437 272350311 275207920 277255459 278184891 277981186 276927452 275454712 273901997
3668 273901997 272331085 270525723 268193741 265253601 262020569 259165783 257462997 257466660 259295712
3677B59295712L320064M167862M256878L613167K336960N90114j364078l137017m281711
3686B68797951m451294l572254j916237r232J581116K466030K548809J990509J084633
3695B68520031J33057o15063r70116q11786j39943Q58117J798725K212352J755105
3704B72740479M16831j407451l051987l868160l521042k135601k20928J573734K732773
3713B63258648L043308K599468J683789O15635l51525j056137j407108j358776r11007
3722B66116295j32466Q16384J684551K171860K011833J081715m95301k309894l742695
3731B67202282m171753l252258j139565J485272L651924M522495L795261J864109l76701
3740B73581066j995430k500629k060147j334495j030827j450500k312336k951012k760048
$$ plain form
3677 259295712 262615776 266783638 271040516 274653683 276990643 277580757 276216679 273079662 268797951
3686 268797951 264346657 260774403 258858166 258848934 260430050 262896080 265444889 267435398 268520031
3695 268520031 268653088 268038025 267067909 266256123 266116180 266974297 268773022 270985374 272740479
3704 272740479 273157310 271749859 268697872 264829712 261308670 259173069 258952141 260525875 263258648
3713 263258648 266301956 268901424 270585213 271200848 270849323 269793186 268386078 267027302 266116295
3722 266116295 265983829 266800213 268484764 270656624 272668457 273750172 273254871 270944977 267202282
3731 267202282 263030529 259778271 258638706 260123978 263775902 268298397 272093658 273957767 273581066
3740 273581066 271585636 269085007 267024860 265690365 264659538 263209038 260896702 257945690 255185642
3749B55185642j593685J24245J644287K327995K003594J030635N4608l79143j14860
3758B60283318N77793J209697J368885R29051P1220q52756j506310j696682j405124
3767B58979092p46003Q8940Q74252J388207J467647J074944L40824m63486j035156
3776B61969261j182136r16863m39033j1311J95351J89705J28040J88541M42009Q09021
3786B61372585J126499J269951J236229J124955J036262R67884P97348L74489l42274
3795B68963928j208362j944237k293377k180595j757622j295548r92775q33435n99956
3804B55858021m3469R04961K026672K897988L118610K541580J359062j0299j153412
3813B67499714j864319k189560k308559k349186k275543j929627j185970j00765J059894
$$ plain form
3749 255185642 253591957 253716202 255360489 257688484 259692078 260722713 260777321 260398178 260283318
3758 260283318 260861111 262070808 263439693 264368744 264439964 263587208 262080898 260384216 258979092
3767 258979092 258233089 258322029 259196281 260584488 262052135 263127079 263467903 263004417 261969261
3776 261969261 260787125 259870262 259431229 259419918 259615269 259804974 259933014 260121555 260563564 261372585
3786 261372585 262499084 263769035 265005264 266130219 267166481 268134365 268931713 269306202 268963928
3795 268963928 267755566 265811329 263517952 261337357 259579735 258284187 257291412 256457977 255858021
3804 255858021 255814552 256719513 258746185 261644173 264762783 267304363 268663425 268653126 267499714
3813 267499714 265635395 263445835 261137276 258788090 256512547 254582920 253396950 253296185 254356079
3822B54356079J944008K310162K162189J732063J318570J089572R77726P40014J41735
3831B66772118q54988k023297k970142l343353l019257k153397j065635l4867Q59318
3840B52166500J739502K766705L914203M837761M959946L758640J120625k449017n914287
3849B66900578q088761q149261o023007k449684J325855M082795N117759M471188K802486
3858B59989948J005211k23427o48822m98181k35176k58713o89373j337337j841698
3867B55262432j884098j358986m19006O11381J395130J726494J592217J133995N50308
3876B58609867J621m31728p30801q93459r08260p69062n13134k38381o7100o9561j96457
3887B53793545k79389j18789L84140J131744J839581K158317J846352Q96358m50268
$$ plain form
3822 254356079 256300087 258610249 260772438 262504501 263823071 264912643 265890369 266630383 266772118
3831 266772118 265917130 263893833 260923691 257580338 254561081 252407684 251342049 251307182 252166500
3840 252166500 253906002 256672707 260586910 265424671 270384617 274143257 275263882 272814865 266900578
3849 266900578 258811817 250662556 244639549 242189865 243515720 247598515 252716274 257187462 259989948
3858 259989948 260995159 260771732 260122910 259624729 259389553 259130840 258441467 257104130 255262432
3867 255262432 253378334 252019348 251600342 252211723 253606853 255333347 256925564 258059559 258609867
3876 258609867 258611488 258179760 257448959 256555500 255647240 254878178 254365044 254126663 254059563 253990002 253793545
3887 253793545 253514156 253395367 253779507 254911251 256750832 258909149 260755501 261651859 261201591
3896B61201591j807270k801532l204727k983895k268390j272717k20222P05375J380539
3905B48728752J746349J803990J602116J215991P24869J99757k93408o87255r13697
3914B54127464r28154p39097m22020r6150J29738K10896J81236J20048Q9303R0313
3924B52763577O8645l5133k26574m35925n51071m84238k28710J31569M61769O40869
3934B52104778O13079M04187J01699j84955l65486l98751l05023j56460m4937l7670
3944B51730461j42135k98844m14600m16603k94514j04904O5937J54705J51729R3022
3954B50524254K5253k7294o7997j09501j51768j79519j79043j55125j29623j21479
3964B49428158j27621j27373j06277p7438p5627j23901k02847k55909k35920j53408
$$ plain form
3896 261201591 259394321 256592789 253388062 250404167 248135777 246863060 246642838 247348213 248728752
3905 248728752 250475101 252279091 253881207 255097198 255822067 256021824 255728416 255041161 254127464
3914 254127464 253199310 252460213 252038193 251942043 252071781 252282677 252463913 252583961 252673264 252763577
3924 252763577 252832222 252797089 252570515 252134590 251583519 251099281 250870571 251002140 251463909 252104778
3934 252104778 252717857 253122044 253223743 253038788 252673302 252274551 251969528 251813068 251768131 251730461
3944 251730461 251588326 251289482 250874882 250458279 250163765 250058861 250124798 250279503 250431232 250524254
3954 250524254 250549507 250522213 250454216 250344715 250192947 250013428 249834385 249679260 249549637 249428158
3964 249428158 249300537 249173164 249066887 248989449 248913822 248789921 248587074 248331165 248095245 247941837
3974B47941837q1043r7313k12307l41987l67737k43397n6896K0237j24722m27017o64806
3985B45344849o34613l55111j12896k65541r12532j702919k007637j437550l89195
3994B37526855j80950k530651q548069j7803230k8092365l6178217
4000A44193373
$$ plain form
3974 247941837 247860794 247763481 247551174 247209187 246841450 246598053 246541157 246561394 246436672 246009655 245344849
3985 245344849 244710236 244355125 244242229 243976688 243064156 241361237 239353600 237916050 237526855
3994 237526855 237345905 234815254 226267185 208463955 180371590 144193373
4000 144193373
##END=$$ End of the data block
