##TITLE=H14611 - Espuma interna $$ Begin of the data block
##JCAMP-DX=5.00 $$ ACD/SpecManager v 10.08
##SPECTROMETER/DATA SYSTEM=Alpha
##DATE=29 Jul 2016 08:08:58
##DATA TYPE=INFRARED SPECTRUM
##DATA CLASS=XYDATA
##ORIGIN=
##OWNER=
##NPOINTS=1667
##FIRSTX=599.57470703
##LASTX=3997.16503906
##MAXX=3997.16503906
##MINX=599.57470703
##MAXY=0.95800042
##MINY=0.67845458
##XFACTOR=1.0000000000
##YFACTOR=1.000000000000000e-9
##FIRSTY=0.75772387
##DELTAX=2.03937006
##XUNITS=1/CM
##YUNITS=ARBITRARY UNITS
##XYDATA=(X++(Y..Y))
599.6 757723868 757878006 758078158 758499742 759093761 759631574 759839416 759923220 760562062 761359751 761521816
620 761521816 761531472 761714458 761668444 761220455 760667562 760488212 760493815 760277748 760132134 760230184 760135353
642.4 760135353 759732723 759390831 759325981 759544909 759716213 759534717 759286821 759265125 759511769 759985983
662.8 759985983 760509133 761218667 762355208 763489783 764428556 765106618 765540540 765848398 766237557
681.1 766237557 766551495 766112089 764701307 761927128 756227851 745875835 731255233 717895150
697.5 717895150 714289308 723198354 739577234 757107913 771851361 782605231 791161001 798973024
713.8 798973024 804377973 805919707 804505169 801961601 800190270 800309837 801799178 803533137 805016041
732.1 805016041 805966616 806101859 805262625 803496718 800886095 797490656 793575525 789626956 786154985
750.5 786154985 783345580 781348586 780680418 781939864 785328805 790409446 796379745 802584827 808500648
768.8 808500648 813449383 816979229 819088638 819981635 820083439 819796264 819270849 818721175 818252683
787.2 818252683 817548335 816422760 815112352 813681006 811922848 809746444 807278216 804947615 803208232
805.6 803208232 802092433 801462710 801454723 802533507 804907739 808119535 811673284 815375149 819069147
823.9 819069147 822585642 825791955 828494132 830435812 831619501 832274675 832441866 832184851 831698716
842.3 831698716 830877960 829877496 829158127 828414440 827111125 825278819 823098719 820721030 818172395
860.6 818172395 815429807 812590778 809587240 806421220 804103374 804434896 808028877 813559949 819151938
879 819151938 823964000 828404486 832555711 835751474 837670207 838389099 838081419 837110102 835760832
897.3 835760832 834072292 832278013 830735862 829388559 828244686 827562392 827123046 826534986 825593829
915.7 825593829 824212015 822689712 821481168 820802331 820668221 821076035 821897507 822947979 824280202
934 824280202 825821757 827465355 829454422 831755579 833819389 835181355 835666001 835260332 834136248
952.4 834136248 832601309 830900073 829080164 827143848 825296402 823789358 822644293 821668863 820766926
970.7 820766926 820043564 819410741 818596840 817316830 815327883 812795997 809979856 806676090 802587867
989.1 802587867 797747552 792376161 786765456 781484723 777380705 775085509 774466097 774668932 774753869
1007.4 774753869 774205327 773145258 772252738 772274494 773464799 775228739 776542604 776913583 776229739
1025.8 776229739 774349749 771638751 768766284 765898585 762688220 758808434 754264653 749153852
1042.1 749153852 743597090 737785339 731903255 726263463 721055031 716198087 711690426 707545877
1058.4 707545877 703645349 699930370 696363628 692880452 689592957 686653554 684062243 681880414
1074.7 681880414 680234492 679139197 678580225 678454578 678570032 678928316 679697931 680918872 682595491
1093.1 682595491 684851766 687771142 691411555 695761442 700661898 706044137 711798310 717576861
1109.4 717576861 723231673 728965998 735067844 741733611 748923242 756281555 763284147 769657493
1125.7 769657493 775415599 780664623 785653234 790610492 795522273 800124586 804032505 807030141
1142.1 807030141 809086442 810356855 811244667 812014639 812801600 813747525 814874828 816173315 817608297
1160.4 817608297 819263637 821183562 823095441 824739218 825950563 826563239 826553762 825958312 824688911
1178.8 824688911 822791874 820668280 818707228 817046404 815538406 813732624 811290801 808218777
1195.1 808218777 804689109 801007926 797512472 794248104 790853083 786910951 782398880 777740955
1211.4 777740955 773389935 769641340 766944885 765700281 765937865 767688632 770988226 775507271
1227.7 775507271 780707836 786196351 791840434 797547340 803140104 808539748 813721955 818584085
1244 818584085 822980642 826725125 829593658 831446052 832330048 832493365 832330108 832233727 832497478
1262.4 832497478 833254337 834418595 835818410 837304592 838780284 840222061 841637790 842999816
1278.7 842999816 844150305 844861865 845056355 844770193 843999028 843011022 842472434 842916250 844358563
1297 844358563 846454263 848826349 851182818 853400946 855487645 857425988 859290719 861196578 863052607
1315.4 863052607 864768922 866374791 867837608 869107604 870184004 870969296 871330202 871296525 870835602
1333.8 870835602 869873166 868634403 867848694 868190527 869558930 871456027 873334885 874762654 875548720
1352.1 875548720 875580668 874576271 872263610 868392885 862653315 855272710 846931338 838654220 832636178
1370.5 832636178 830695271 833285570 839116037 845796585 851649046 855739594 857827902 858233929
1386.8 858233929 857518852 856163204 854145885 851328254 848110855 844776988 841408432 837964773
1403.1 837964773 834439695 831688643 830433667 830868006 832737207 835178435 837633312 840053678
1419.4 840053678 841880083 842893004 843295813 842820287 841036618 837944746 833860993 828357577 821977377
1437.8 821977377 816719174 812439084 808911443 806624472 805810511 806644678 809333444 813952744 820777833
1456.1 820777833 827873528 831499279 832521439 831983566 830273271 828174531 826106369 824736595
1472.4 824736595 825316489 827605307 830187082 831855774 832168996 831156135 828849256 825149238 820689738
1490.8 820689738 817462206 816310883 816371024 815730393 813946366 812108636 810800195 810433030 810960352
1509.1 810960352 811214983 810456157 808420420 805282533 801595986 797251344 793123543 790017128 787836909
1527.5 787836909 786864698 786898971 787911415 789627016 791799784 795208097 799660385 804121017 808884263
1545.9 808884263 813885927 819443703 825640380 832255244 838872313 847215116 858154774 866314352
1562.2 866314352 873120308 879980266 886333823 891921878 895335197 896177649 894428670 890840352
1578.5 890840352 886454761 881348968 876250446 871743441 867896736 864746928 862331212 860626161
1594.8 860626161 859753489 860001922 861653030 864838541 869171321 873875856 878304601 882068396 884949803
1613.2 884949803 887289882 889564097 891333580 892255723 892059922 890253663 886427224 880626738 874118328
1631.5 874118328 867496014 860892415 857147634 857056558 858940899 861779928 865357101 869305789 872337162
1649.9 872337162 875096321 878758848 881789804 884121299 886377275 888701916 890965343 892731607
1666.2 892731607 894228935 895794809 897051036 897926331 898733139 899329185 899602354 899706841 899951458
1684.5 899951458 900318503 900441706 900271475 899841845 899028122 897838831 896451890 894757450 893248320
1702.9 893248320 891753793 890106678 888721466 887554109 886585534 886013567 886273444 887211382 887974262
1721.2 887974262 888496637 889266729 890864909 893699288 897837400 904424489 912883341 920219064 927325249
1739.6 927325249 934105694 939395189 943394899 946224749 948151946 949642599 950725675 951326430
1755.9 951326430 951633871 951698899 951590121 951585472 951587498 951407135 951145411 950902164 950811803 950838149 950738549
1778.4 950738549 950522065 950391114 950368345 950326920 950109005 949717879 949432611 949383736 949328601 949172497
1798.7 949172497 949098349 949223161 949354529 949281633 949093044 948989689 948960602 948927283 948937356 948988974 948898196
1821.2 948898196 948619366 948440731 948446572 948366225 948277771 948329628 948376775 948375344 948291302 948031425 947717726
1843.6 947717726 947652519 947769880 947798491 947676778 947526455 947464287 947415948 947308958 947203994 947072148
1864 947072148 946785271 946451366 946370602 946457565 946453989 946393788 946363986 946325839 946247399 946168602 946105361 946013808
1888.5 946013808 946005642 946091175 946089029 946047544 946051240 946035862 945991635 945920050 945772290 945642650 945664585 945765793
1913 945765793 945801437 945715845 945581675 945449293 945351243 945367992 945421755 945440829 945463777 945465624 945411325 945286810
1937.4 945286810 945083678 944861054 944734275 944681823 944612086 944577694 944590271 944611192 944649398 944644868 944583416
1959.9 944583416 944553077 944572210 944578350 944527626 944471478 944504023 944606066 944708943 944759011 944690704 944584489
1982.3 944584489 944604337 944709897 944705188 944553733 944419444 944401860 944467664 944556773 944599152 944570363 944509685
2004.7 944509685 944489479 944525480 944549739 944502831 944360971 944236457 944241822 944278061 944278240 944306791 944340527 944292068
2029.2 944292068 944199145 944183588 944244564 944244385 944177091 944195092 944294751 944319129 944233596 944171369 944211423 944267571
2053.7 944267571 944273412 944230020 944177985 944195509 944202483 944110334 944025457 944018602 944062471 944105983 944072306 943974018
2078.1 943974018 943946540 944050312 944191158 944225013 944123447 944019258 943985760 943946779 943893135 943910241 943920016
2100.6 943920016 943797886 943685770 943731964 943782091 943713725 943631589 943534672 943388700 943359077 943453848 943506479
2123 943506479 943550706 943663955 943703413 943593383 943523705 943545759 943613291 943742871 943789959 943691909 943607926
2145.4 943607926 943606317 943621755 943609357 943540335 943426549 943341196 943359315 943444133 943445504 943364859 943344653 943367124
2169.9 943367124 943305790 943245411 943291008 943275332 943172574 943182766 943202794 943100631 943014622 942905486 942718267
2192.3 942718267 942639112 942721605 942741632 942587435 942417383 942344606 942326427 942317903 942282081 942168653 942072093
2214.8 942072093 942073703 942007065 941745222 941510022 941444576 941282928 940894485 940329909 939551413 938787699
2235.2 938787699 938440502 938513935 938681364 938747108 938713908 938531041 938097298 937426925 936682522 936019421
2255.6 936019421 935401917 934761047 934107721 933523595 933070719 932764590 932735860 933046460 933551788 934115052
2276 934115052 934758186 935559392 936557174 937634230 938522339 939212799 939953804 940741539 941331327 941740334
2296.4 941740334 942180455 942590237 942862093 943109155 943246782 943155766 943144560 943437576 943692923 943656623
2316.7 943656623 943689525 943959475 944148779 944241703 944402158 944515586 944578409 944752097 944859922 944755137
2337.1 944755137 944563210 944457471 944474995 944375515 944246113 944364309 944600642 944627166 944529355 944773972
2357.5 944773972 945079565 944868207 944521844 944385886 944309235 944406807 944568157 944480300 944263458 944209456
2377.9 944209456 944397628 944623709 944710493 944765508 944798172 944667161 944445014 944340467 944454253 944650233
2398.3 944650233 944688022 944580615 944568872 944713652 944878817 944960892 944917381 944808960 944725811 944696426 944704950
2420.7 944704950 944726527 944732189 944725275 944792390 944897950 944900274 944776356 944625199 944562078 944598317 944705844
2443.2 944705844 944813192 944828570 944739878 944595277 944509387 944539428 944602251 944594562 944537580 944513738 944524825
2465.6 944524825 944543183 944531739 944474816 944428623 944383204 944291770 944232106 944289446 944365561 944356501 944344640 944364667
2490.1 944364667 944339395 944241941 944072545 943933547 943973184 944156885 944277525 944232762 944133997 944074869 944044650
2512.5 944044650 944003761 943971574 943981886 944007993 944020510 943983436 943956971 944036126 944134951 944145024 944124639
2535 944124639 944150507 944222867 944301307 944283843 944185257 944109678 944077671 944085717 944089234 944076061 944034398 943936467
2559.4 943936467 943858564 943851411 943885565 943900287 943912089 943933725 943895221 943826079 943762600 943697393 943663776 943702042
2583.9 943702042 943737507 943663478 943609238 943641901 943659782 943687618 943748653 943761885 943690538 943634391 943667829
2606.3 943667829 943682849 943640113 943642795 943675339 943699300 943706155 943641186 943568766 943565547 943546057 943448782 943329692
2630.8 943329692 943239927 943257451 943393588 943436146 943361938 943338752 943324983 943281054 943246067 943201363 943162680
2653.2 943162680 943137050 943093121 943087518 943095565 943019450 942918241 942845464 942834258 942869425 942794383 942650795
2675.7 942650795 942595720 942590892 942606866 942641854 942642629 942629814 942601562 942514539 942429483 942359567 942243397 942189038
2700.1 942189038 942213595 942161500 942037642 941880047 941673458 941526175 941524744 941541910 941461504 941306472 941138208
2722.6 941138208 940982401 940793216 940594316 940488517 940481722 940446556 940321207 940191388 940158010 940169215
2743 940169215 940087080 939973414 939945638 939947486 939871550 939738691 939634919 939541519 939390421 939178467 939003468
2765.4 939003468 938916981 938846707 938707948 938521862 938394010 938270032 938049495 937822402 937696815 937610090
2785.8 937610090 937456191 937258303 937071860 936915994 936791420 936714470 936690390 936627686 936437786 936102509
2806.2 936102509 935768425 935642362 935624123 935436666 934990942 934404314 933866441 933447421 932971358 932302833
2826.6 932302833 931530595 930682838 929631889 928326011 926823735 925108373 923207164 921236813 919193387
2844.9 919193387 917057753 914887309 912766099 910830796 909161687 907717407 906580925 905921996
2861.2 905921996 905627549 905523956 905690074 906199992 906951845 907878876 909043491 910361350 911527872
2879.6 911527872 912326515 912804365 913111567 913262069 913229406 913117945 913059771 913139641 913278461 913357437
2900 913357437 913499236 913815022 914161623 914350271 914316595 914149702 913982928 913745046 913307428 912811279
2920.4 912811279 912490487 912357032 912305892 912439466 913011253 914110005 915646851 917526186 919620752
2938.7 919620752 921649456 923294485 924479544 925230205 925541818 925497949 925057709 924138427 922829330
2957.1 922829330 921224236 919361770 917376637 915645599 914717257 915041924 916553617 918683469 921025515
2975.4 921025515 923517585 926051497 928526521 930939436 933175325 935194433 937079966 938726723
2991.8 938726723 940042377 941075504 941887915 942573249 943137467 943589091 943917394 944003582 943872094
3010.1 943872094 943623185 943322837 943010628 942595840 942036688 941444457 940913856 940615892 940664172 940926790
3030.5 940926790 941313028 941758215 942093790 942246377 942313612 942379117 942445695 942511737 942493796 942279458
3050.9 942279458 941968083 941738904 941572070 941379547 941242814 941290796 941457033 941602170 941661000 941708088
3071.3 941708088 941846490 941908836 941803515 941692054 941620052 941586137 941684127 941933215 942265987 942594469
3091.7 942594469 942787290 942866027 942947567 943004251 943034291 943013012 942895949 942821145 942797601 942673564 942489803
3114.1 942489803 942371547 942335427 942354441 942373514 942269742 942060769 941897571 941781044 941710949 941724122
3134.5 941724122 941740274 941715956 941666424 941528797 941343307 941276848 941201210 941004515 940906644 940939307 940894306
3156.9 940894306 940718830 940534949 940385759 940233648 940043330 939839482 939701617 939614177 939486504 939209223
3177.3 939209223 938844085 938554466 938361108 938239098 938076556 937768936 937412918 937145591 936916590 936656296
3197.7 936656296 936436176 936241150 936061144 935977101 935859621 935544670 935143232 934845388 934621513 934311569
3218.1 934311569 934001148 933754623 933420956 933007956 932565212 932064116 931551099 931152880 930869579 930540383
3238.5 930540383 930146039 929733455 929243326 928800285 928544283 928247869 927811205 927477002 927302182 927133560
3258.9 927133560 926918685 926709175 926548243 926322758 925975859 925723433 925709069 925842941 925927281 925881147
3279.3 925881147 925787687 925832689 926086009 926325142 926481009 926654816 926850438 927030087 927218854 927531123
3299.7 927531123 927874625 928051054 928266287 928782701 929347575 929697871 929963112 930350125 930841625 931301951
3320.1 931301951 931713223 932094574 932477355 932857573 933215141 933559597 933881938 934261680 934756100 935230970
3340.5 935230970 935493588 935601056 935864985 936334252 936804891 937202036 937534332 937879622 938294053 938716292
3360.9 938716292 939062476 939363182 939725161 940136254 940562606 941041946 941639960 942335844 942922115 943264306
3381.3 943264306 943522751 943890393 944319189 944667459 945021927 945548952 946071267 946416080 946716130 947008312
3401.7 947008312 947207332 947431564 947838187 948281288 948526740 948594868 948624074 948662698 948791325 949050069
3422 949050069 949370980 949779272 950236201 950555682 950684011 950674117 950605273 950577199 950566828 950548053 950585604
3444.5 950585604 950784504 951139748 951362252 951295316 951208830 951316118 951479197 951583207 951593757 951453388
3464.9 951453388 951339841 951399684 951502025 951505601 951384485 951300979 951442301 951738238 951962113 952008843
3485.3 952008843 951957762 951933920 951991558 952069461 952020168 951790333 951599598 951584935 951581120 951548457 951558471
3507.7 951558471 951553345 951607943 951800585 951938927 951960623 951991439 952031493 952084720 952156007 952221334 952380955
3530.1 952380955 952598095 952667773 952619553 952622414 952655137 952607036 952517748 952564895 952712417 952767611 952879608
3552.6 952879608 953142762 953343153 953437150 953401148 953184605 952867866 952705681 953028500 953565359 953839302
3573 953839302 953831196 953870296 954097271 954237401 954078197 953656316 953348041 953647137 954138935 954309821
3593.4 954309821 954360187 954543114 954692960 954707742 954715669 954587817 954262376 954064608 954140544 954409659
3613.7 954409659 954617977 954532623 954477608 954711318 954929292 954904377 954607725 954450846 954721689 955104053
3634.1 955104053 955389321 955515742 955545723 955573499 955518007 955301464 955069840 955091178 955270767 955377400
3654.5 955377400 955508649 955787361 956080854 956344068 956643879 956823945 956614733 956289530 956219733 956186652
3674.9 956186652 956172705 956289530 956393421 956406057 956393480 956309974 956151724 956311107 956725776 956980586
3695.3 956980586 957033396 956957161 956813455 956834137 957001150 957018316 956786454 956508160 956498563 956801176 957124770
3717.7 957124770 957166672 956878603 956579566 956593752 956753194 956772864 956500828 956059575 956072927 956494868
3738.1 956494868 956612587 956259549 955909133 956073582 956269681 956235528 956423879 956732452 956788778 956717968
3758.5 956717968 956820428 956916571 956811488 956716537 956711650 956823647 957066715 957296729 957346201 957180142
3778.9 957180142 957123637 957237601 957271099 957243383 957239628 957249045 957265496 957282782 957348287 957367480 957258761
3801.4 957258761 957235813 957198322 957109809 957247496 957561791 957690775 957346141 956978917 956849813 956704080
3821.8 956704080 956732452 956902146 956951916 956870854 956746101 956593454 956396818 956346989 956672013 957092524
3842.1 957092524 957294047 957222223 957001388 956809878 956583619 956464469 956733525 957004070 957032502 956985295
3862.5 956985295 956972003 956900477 956955969 957245886 957336664 957156062 957117438 957172513 956957042 956560194 956461012
3885 956461012 956778705 957042634 957175612 957432687 957595646 957334220 956862152 956791401 957195938 957545578
3905.4 957545578 957586467 957543314 957574189 957561970 957455933 957364261 957435310 957716405 957976520 958000422 957805634
3927.8 957805634 957525194 957346857 957427442 957734644 957962453 957899272 957694173 957523942 957388639 957350194
3948.2 957350194 957433403 957473576 957515955 957532048 957324326 957161725 957274675 957449079 957548380 957601786 957700968
3970.6 957700968 957784891 957744181 957681239 957683504 957803130 957933843 957836807 957667947 957665086 957606971 957437634
3993.1 957437634 957476556 957686424
3997.1 957686424
##END=$$ End of the data block
