##TITLE=Goma arabica padrao $$ Begin of the data block
##JCAMP-DX=5.00 $$ ACD/SpecManager v 10.08
##SPECTROMETER/DATA SYSTEM=Alpha
##DATE=24 Jun 2014 11:35:20
##DATA TYPE=INFRARED SPECTRUM
##DATA CLASS=XYDATA
##ORIGIN=
##OWNER=
##NPOINTS=1765
##FIRSTX=399.75695801
##LASTX=3997.56933594
##MAXX=3997.56933594
##MINX=399.75695801
##MAXY=0.83187079
##MINY=0.43830252
##XFACTOR=1.0000000000
##YFACTOR=1.000000000000000e-9
##FIRSTY=0.64936566
##DELTAX=2.03957629
##XUNITS=1/CM
##YUNITS=ARBITRARY UNITS
##XYDATA=(X++(Y..Y))
399.8F49365664j432121O34610M92812j388729j520455J89185Q44777k15948j292646
$$ 649365664 647933543 648568153 649060965 647672236 646151781 646340966 647185743 646969795 645677149
418.1F45677149p93695J05083o25193j619101r88126R3401k38180j311601j274406
$$ 645677149 644883454 644988537 644363344 642744243 641756117 641849518 641611338 640299737 639025331
436.5F39025331k25842J35898n41866q90672k45333K60651k0980n27919l56853M61936
$$ 639025331 638799489 638935387 638393521 637502849 637257516 637518167 637497187 636969268 636612415 637074351
456.9F37074351N23568m49360p89583j40011K98679j7524m27365l67880k4199R8049
$$ 637074351 637597919 637148559 636358976 636218965 636517644 636500120 636072755 635704875 635680676 635778725
477.3F35778725j5616p6473P0214K42055J21712k56419m85182l11493j84060m76420
$$ 635778725 635763109 635686636 635756850 635998905 636120617 635864198 635379016 635067523 634883463 634407043
497.7F34407043p85350o64533k96294l20137p72834q79108m35770k60234p73191j240373
$$ 634407043 633621693 632957160 632660866 632340729 631567895 630688787 630253017 629992783 629219592 627979219
518.1F27979219q05974o1572k39908j146555j254261l10302P2241o75022j076103k95400
$$ 627979219 627173245 627111673 626871765 625725210 624470949 624160647 624232888 623557866 622481763 622186363
538.4F22186363M22239q6486r61006o11186N50926O91890k10166m14550N72682J222431
$$ 622186363 622608602 622522116 621561110 620949924 621500850 622192740 621982574 621568024 622140706 623363137
558.8F23363137M99726m08590N4478J056672O85989n45978m92513P83682R89496l36289
$$ 623363137 623862863 623454273 623508751 624565423 625251412 624705434 624212921 624996603 625986099 625649810
579.2F25649810r13918J21951Q12173q0824j125634p31528K33531n2571j127899j205146
$$ 625649810 624735892 624857843 625670016 625589192 624463558 623732030 623965561 623912990 622785091 621579945
599.6F21579945j47223L64780m52459j118302m38512L94226O3359n82575R238J401842
$$ 621579945 621432722 621797502 621345043 620226741 619788229 620182455 620245814 619663239 619672477 621074319
620F21074319J783013J048923P96973J646460K180934J468896P10130J132906J869976
$$ 621074319 622857332 623906255 624703228 626349688 628530622 629999518 630709648 631842554 633712530
638.4F33712530J554549O94692O65605J295388J282334N02288J79351P61926J176953
$$ 633712530 635267079 635961771 636627376 637922764 639205098 639707386 639886737 640648663 641825616
656.7F41825616P04289K01285N71012R10640L17812K12073J421273J933038J716316
$$ 641825616 642529905 642731190 643302202 644212842 644530654 644742727 646164000 648097038 649813354
675.1F49813354J120269R25064J328290J416445Q35120L46780M42028N74351J58846
$$ 649813354 650933623 651858687 653186977 654603422 655438542 655785322 656227350 656801701 656960547
693.5F56960547m05133m49002j90138k69294n12839l42786J28925L06785J72317M02153
$$ 656960547 656555414 656106412 655916274 655646980 655134141 654791355 654920280 655227065 655399382 655801535
713.8F55801535J204133J875043K093911K432585L130793L541470L134906K474308
$$ 655801535 657005668 658880711 660974622 663407207 666538000 670079470 673214376 675688684
730.2F75688684K308249K401829K007425J107812P08997J058936J105845M28677p1704
$$ 675688684 677996933 680398762 682406187 683513999 684222996 685281932 686387777 686816454 686744750
748.5F86744750K52366O14583J8299r07362j004040n97775q17657j722693k041221
$$ 686744750 686997116 687611699 687629998 686722636 685718596 685120821 684303164 682580471 680539250
766.9F80539250j137316j51634j07646j47224R14872K342880K597809J919627J872122
$$ 680539250 679401934 679250300 679142654 678995430 679910302 682253182 684850991 686770618 688642740
785.2F88642740K716720K984345K031625J262784J714110K220929J319050k00390m40061
$$ 688642740 691359460 694343805 696375430 697638214 699352324 701573253 702892303 702691913 702251852
803.6G02251852N92470J133024P00295R79603K772808M395544M343510L547251L597021
$$ 702251852 702844322 703977346 704677641 705657244 708430052 712825596 717169106 720716357 724313378
821.9G24313378L978610K812446J53601j736999j918912j917481k650619k619385n09859
$$ 724313378 728291988 731104434 731258035 729521036 727602124 725684643 723034024 720414639 719904780
840.3G19904780K285064L461837L048480K882004L343642K865076R34660n75840l50833
$$ 719904780 722189844 725651681 728700161 731582165 734925807 737790883 738725543 738149703 737798870
858.7G37798870K29299n55992k020956k326369j563608j564861k737224l371775k537072
$$ 737798870 738028169 737472177 735451221 733124852 731561244 729996383 727259159 723887384 721350312
877G21350312j549184j724482k226889j546025j28090K78353o54697j410485j067638
$$ 721350312 719801128 718076646 715849757 714303732 714175642 714453995 713799298 712388813 711321175
895.4G11321175o57916j227021j982808j622916n27858q4997l47256j31071Q05080
$$ 711321175 710663259 709436238 707453430 705830514 705302656 705217659 704870403 704739332 705544412
913.7G05544412J241982L29852j089215j777768k008259k799750m015207m628956m415453
$$ 705544412 706786394 707116246 706027031 704249263 702241004 699441254 695426047 690797091 686381638
932.1F86381638m352152n103052n933881n964637n541861n482375n740822n610287
$$ 686381638 682029486 676926434 670992553 665027916 659486055 654003680 648262858 642652571
948.4F42652571n018353m750133n247593n914747o038547n781889n703032n777419
$$ 642652571 637634218 632884085 627636492 621721745 615683198 609901309 604198277 598420858
964.7E98420858n456090m626333l869891l668011l768444l618955l243208l090859
$$ 598420858 592964768 588338435 584468544 580800533 577032089 573413134 570169926 567079067
981E67079067l244459l286183k978802k659976k678752k895177k919495k687693k603530
$$ 567079067 563834608 560548425 557569623 554909647 552230895 549335718 546416223 543728530 541125000
999.4E41125000k866030l118694l085494k935410k933979l000736k759635k151549
$$ 541125000 538258970 535140276 532054782 529119372 526185393 523184657 520425022 518273473
1015.7E18273473j597285j397551j316309j046836o84559n31078o11245n72861k74479
$$ 518273473 516676188 515278637 513962328 512915492 512230933 511699855 511088610 510515749 510241270
1034.1E10241270n6446k23517n64277p03752o66976p73966j060069j178980r64522
$$ 510241270 510184824 509961307 509397030 508693278 508026302 507252336 506192267 505013287 504048765
1052.4E04048765p11024p16388p81954n56290j43349o020k14100l16203m4226L43501
$$ 504048765 503337741 502621353 501839399 501283109 501139760 501133740 500919640 500603437 500559211 500902712
1072.8E00902712N21958O73890J176715J902700K313077K306760K374589K792001L191888
$$ 500902712 501424670 502098560 503275275 505177975 507491052 509797812 512172401 514964402 518156290
1091.2E18156290L199279L073991L273427L664851L665924L163815K695918K578378
$$ 518156290 521355569 524429560 527702987 531367838 535033762 538197577 540893495 543471873
1107.5E43471873K362370J672149R74000Q44061J084387J108885Q99076R20892J260758
$$ 543471873 545834243 547506392 548480392 549324453 550408840 551517725 552416801 553337693 554598451
1125.8E54598451J460135J230359P65562L90053J17063l13163p68423p25865j12176
$$ 554598451 556058586 557288945 558054507 558444560 558561623 558248460 557480037 556754172 556641996
1144.2E56641996N51045R47118J345753K010405K691806L013968L073037L317356L826320
$$ 556641996 557193041 558140159 559485912 561496317 564188123 567202091 570275128 573592484 577418804
1162.6E77418804M160345M139006M150391M502892M952610N138993N196571N540788
$$ 577418804 581579149 585718155 589868546 594371438 599324048 604463041 609659612 615200400
1178.9F15200400O123543O441891O365359O251514O209970N919397N190730M297554
$$ 615200400 621323943 627765834 634131193 640382707 646592677 652512074 657702804 662000358
1195.2F62000358L605723L045321K327502J530409J030624Q70287O76036L13461O5148
$$ 662000358 665606081 668651402 670978904 672509313 673539937 674410224 675086260 675399721 675464869
1213.5F75464869Q9764J31846m6790k53737k27988j26481k34246m80950n79119m96149
$$ 675464869 675554633 675686479 675639689 675385952 675157964 675031483 674797237 674316287 673737168 673241019
1233.9F73241019n07593o88374p24614m92751l30448m29571n41031m55618l58761n43952
$$ 673241019 672733426 672045052 671320438 670827687 670497239 670067668 669526637 669071019 668712258 668168306
1254.3F68168306q39293p45892j44363O33777J317501J882553K243876K157211J587570
$$ 668168306 667329013 666583121 666438758 667072535 668390036 670272589 672516465 674673676 676261246
1272.7F76261246R76145P44880O71804L30388j42932l08335j93238k80261o96957r41038
$$ 676261246 677237391 677982271 678654075 678984463 678841531 678533196 678339958 678059697 677362740 676421702
1293.1F76421702o82891l44276l82304n45383l67760J8239M5836k99752m10736q1896
$$ 676421702 675738811 675394535 675012231 674466848 674099088 674117327 674163163 673863411 673452675 673370779
1313.5F73370779J94788M6551k22326j02222K32041J47403l64721o57678m72128l19958
$$ 673370779 673565567 673612118 673389792 673287570 673519611 673667014 673302293 672644615 672172487 671852529
1333.9F71852529n96523r73463r47237n80073m31299n60880m64081l4929J34409k73466
$$ 671852529 671256006 670282543 669335306 668755233 668323934 667763054 667298973 667264044 667398453 667124987
1354.3F67124987o88315n64813l71993q63194j533390j440048r78291o96122p59960
$$ 667124987 666436672 665871859 665499866 664636672 663103282 661663234 660684943 659988821 659228861
1372.6F59228861q86857m58002J30176Q8632j02937M56512J272023J151860M27186
$$ 659228861 658342004 657884002 658014178 658102810 657999873 658456385 659728408 660880268 661307454
1391F61307454o6221l49462n97775j179993j638293j527846j445055j565158j798749
$$ 661307454 661241233 660891771 660293996 659114003 657475710 655947864 654502809 652937651 651138902
1409.3F51138902j942873j566947r15408q80897j485288j189947l35455P2300K61069
$$ 651138902 649196029 647629082 646713674 645832777 644347489 643157542 642822087 642894387 643155456
1427.7F43155456M34637Q16703J352488J528085J245022J232981J576424J676083J426637
$$ 643155456 643590093 644406796 645759284 647287369 648532391 649765372 651341796 653017879 654444516
1446F54444516J050710R74656J282691J617253J715064J431525J499295K076865K623975
$$ 654444516 655495226 656469882 657752573 659369826 661084890 662516415 664015710 666092575 668716550
1464.4F68716550K781808K993405L690481M441202M181623L680706L736318M017055
$$ 668716550 671498358 674491763 678182244 682623446 686805069 690485775 694222093 698239148
1480.7F98239148M134655M012882M096866M172802L752470L149807L115237L239870
$$ 698239148 702373803 706386685 710483551 714656353 718408823 721558630 724673867 727913737
1497G27913737K891660K578259K561807K819359K650738J594544J273691J446069J672983
$$ 727913737 730805397 733383656 735945463 738764822 741415560 743010104 744283795 745729864 747402847
1515.4G47402847J904368J840353J345337P10666O82056Q34644Q24034O92129L44515
$$ 747402847 749307215 751147568 752492905 753203571 753885627 754720271 755544305 756236434 756580949
1533.7G56580949M96149J014054N34594r95040j215756q17478o96719j072585j260161
$$ 756580949 757077098 758091152 758625746 757630706 756414950 755597472 754900753 753828168 752568007
1552.1G52568007q21829l29197j613736m129708k907693k019227k404928l504395m763902
$$ 752568007 751746178 751416981 749803245 745673537 742765844 740746617 738341689 734837294 730073392
1570.5G30073392m191398m256904o860733p511497o454945o571948p072151p455349
$$ 730073392 725881994 721625090 714764357 707252860 700797915 694225967 687153816 679698467
1586.8F79698467p312655o654442o075680n960166n686999m787147l826379l361226
$$ 679698467 672385812 665731370 659655690 653695524 648008525 643221378 639394999 636033773
1603.1F36033773l116190k605736j911700j355231j052379j140476j248777m23312
$$ 636033773 632917583 630311847 628400147 627044916 625992537 624852061 623603284 623179972
1619.4F23179972R3639k58088l30985J80066N33402P69854J122236J460433J546085
$$ 623179972 623273611 623015523 622684538 622864604 623398006 624167860 625290096 626750529 628296614
1637.8F28296614J584232J823723K311468L130615L403008K811968K991557L455699
$$ 628296614 629880846 631704569 634016037 637146652 640549660 643361628 646353185 649808884
1654.1F49808884K821266K762199L115833L479600L749668L751695L874481L820062
$$ 649808884 652630150 655392349 658508182 661987782 665737450 669489145 673363626 677183688
1670.4F77183688L548622L922820M091680L579438L570199M178166M581750L476440
$$ 677183688 680732310 684655130 688746810 692326248 695896447 700074613 704656363 708132803
1686.7G08132803K808094L123641L364623L542543L235757K590477K373100K002716
$$ 708132803 710940897 714064538 717429161 720971704 724207461 726797938 729171038 731173754
1703G31173754J505553J048148R57787J271546J434386J140892M77553K24650O46889
$$ 731173754 732679307 733727455 734685242 735956788 737391174 738532066 739009619 739234269 739881158
1721.4G39881158Q62300R07719J268566J923263K243877J938521J484335J702428K201199
$$ 739881158 740743458 741651177 742919743 744843006 747086883 749025404 750509739 752212167 754413366
1739.7G54413366K221346J996696K145231K529383K563297K111972J851380K084374
$$ 754413366 756634712 758631408 760776639 763306022 765869319 767981291 769832671 771917045
1756.1G71917045K316177K108991J667380J415253J632035J873434J667261J086592
$$ 771917045 774233222 776342213 778009593 779424846 781056881 782930315 784597576 785684168
1772.4G85684168Q07405J088917J261413J002550P51257R07481J166880J200497R77040
$$ 785684168 786491573 787580490 788841903 789844453 790595710 791503191 792670071 793870568 794847608
1790.7G94847608P31408Q21114R77218P84218M92811N80669Q61287Q57651N85020M70936
$$ 794847608 795579016 796400130 797377348 798161566 798654377 799235046 800096333 800953984 801539004 802009940
1811.1H02009940O62744P77364N16057L09169N92649R34959P80642L89874K66850M27961
$$ 802009940 802672684 803450048 803966105 804275274 804867923 805802882 806583524 806973398 807240248 807668209
1831.5H07668209N66423L53634J26303M29153Q70347O54459J7107r180M21942N93900
$$ 807668209 808234632 808588266 808714569 809143722 810014069 810668528 810685635 810676455 811098397 811692297
1851.9H11692297K88547O0081L25501O64651N26131K11119K93911N68509M45783M1485
$$ 811692297 811980844 812040925 812366426 813031077 813557208 813768327 814062238 814630747 815076530 815118015
1872.3H15118015p9274K44498O01172M35412J2934L3200M84646O15120J42216j50740
$$ 815118015 815038741 815283239 815884411 816319823 816332757 816365957 816850603 817465723 817607939 817457199
1892.7H17457199J40548M50551K82646m4525L2246M35770N16831Q1480k00748J29401
$$ 817457199 817597747 818048298 818330944 818286419 818318665 818754435 819271266 819352746 819151998 819281399
1913.1H19281399N26667L25739j36137n7101L28541L22580n1856k04563J16646L89576
$$ 819281399 819808066 820133805 819997668 819940567 820269108 820591688 820539832 820335269 820451915 820841491
1933.5H20841491J46926j72615P748L85165K76924j70410k78890O6936L21984Q0586
$$ 820841491 820988417 820815802 820823550 821208715 821485639 821315229 821036339 821103275 821425259 821505845
1953.9H21505845k43485r7752K69532K43306p5459j61409P4863K09689k8431k52843
$$ 821505845 821262360 821164608 821434140 821677446 821601987 821440578 821515441 821725130 821696699 821443856
1974.3H21443856n2870K59579J63674j71185j91152J29462K65300j5736k78949r6977
$$ 821443856 821390986 821650565 821814239 821643054 821451902 821581364 821846664 821830928 821551979 821455002
1994.7H21455002J92821P3731k30849j99795R9123J55627j24990k81573p0393J59562
$$ 821455002 821647823 821721554 821490705 821290910 821390033 821545660 821420670 821139097 821068704 821228266
2015.1H21228266J0550k97308k66373J3768M5121k19345l10957p0632R5725o1572k67148
$$ 821228266 821238816 820941508 820675135 820688903 820734024 820514679 820203722 820133090 820228815 820167243 819900095
2037.5H19900095j75297M9949O854k25007k52128j1742J08421p6413k19345o8426J17540
$$ 819900095 819724798 819774747 819781601 819556594 819304466 819292724 819401145 819324732 819105387 819036961 819154501
2060H19154501M4703j47879j34051R4235J71721l0934j66715O795K04444R2209j24157
$$ 819154501 819199204 819051325 818917274 819011509 819183230 819152296 818985581 818992376 819196820 819289029 819164872
2082.4H19164872p4625J35601J41859o6877j35719N7280J78694L2783j28031m5717
$$ 819164872 819090247 819225848 819367707 819300830 819165111 819222391 819401085 819433868 819305837 819260120
2102.8H19260120J36853J09136q0705j12057O9261J54138K026j30951l6359J25050
$$ 819260120 819396973 819506109 819425404 819313347 819382608 819536746 819538772 819407821 819371462 819496512
2123.2H19496512Q5473q1479p3493J08004J56939n603j09494K2650J79827J17898k8729
$$ 819496512 819581985 819500506 819427013 819535017 819691956 819686353 819576859 819599509 819779336 819897234 819868505
2145.6H19868505J0550J83284J99318L7492k3902J20044K56657J99080O2406Q0168
$$ 819868505 819879055 820062339 820261657 820299149 820275247 820395291 820651948 820851028 820913434 820993602
2166H20993602K24412K51889J13249M5359J82569L19958K44677R6798J24871K62261
$$ 820993602 821218014 821469903 821583152 821628511 821811080 822131038 822375715 822472513 822597384 822859645
2186.4H22859645K65777J37329R9242K25544L03745J94013P0572J34528K83122K79963
$$ 822859645 823125422 823262751 823361993 823587537 823891282 824085295 824155867 824290395 824573517 824853480
2206.8H24853480J43885R3401K04086L08752K51234J29700J32143K24650K35200J61290
$$ 824853480 824997365 825090766 825294852 825603604 825854838 825984538 826116681 826341331 826576531 826737821
2227.2H26737821J51754K25842K60293K09808J31727J26838K07365K38597J65046J05977
$$ 826737821 826889575 827115417 827375710 827585518 827717245 827844083 828051448 828290045 828455091 828561068
2247.6H28561068J46150K13921J99557J09613P7426J41442J77920J26958Q6307J33276
$$ 828561068 828707218 828921139 829120696 829230309 829307735 829449177 829627097 829754055 829840362 829973638
2268H29973638J86622J54793R6024J05142J66893J89304J41025Q3268P3254J13964
$$ 829973638 830160260 830315053 830411077 830516219 830683112 830872416 831013441 831096709 831169963 831283927
2288.4H31283927J07467K504p2897j8358O4015R358r9182j12295q0645p7665j39833
$$ 831283927 831391394 831393898 831321001 831302643 831366658 831376016 831276834 831164539 831083894 831006229 830866396
2310.8H30866396k08914j58369j08242k55228m25398l26753j08242j10805k74360k89023
$$ 830866396 830657482 830499113 830390871 830135643 829710245 829383492 829275250 829164445 828890085 828601062
2331.2H28601062j02699j5497j49071k75552j71006J87695O11544O02960L8088n84960
$$ 828601062 828498363 828482866 828333795 828058243 827887237 828074932 828686476 829289436 829327524 828742564
2351.6H28742564q30531p38383n98073l53574M6432L53872M25875M56870O10232P38740
$$ 828742564 827912033 827173650 826575577 826222003 826268435 826622307 827048182 827505052 828115284 828854024
2372H28854024O52254M89354M92335N84304M90010K11417J1087J6510O9499l1233k04980
$$ 828854024 829506278 829995632 830487967 831072271 831562281 831773698 831784785 831801295 831870794 831839561 831634581
2394.4H31634581k04921m7624j0907j56880k31147j15335k7656j24514k56062k24888
$$ 831634581 831429660 831382036 831371129 831214249 830983102 830867767 830840111 830715597 830459535 830234647
2414.8H30234647r1970r2983k44677l04282j78218q0049j76966l17455k98917j79350
$$ 830234647 830142677 830049694 829805017 829500735 829322517 829242468 829065502 828748047 828449130 828269780
2435.2H28269780j61589k64585l02195k10166j58966k53379l57926l29316k51352k59996
$$ 828269780 828108191 827843606 827541411 827331245 827172279 826918900 826560974 826231658 825980306 825720310
2455.6H25720310l22819l32653k60592k10702k84255l69966l30746k59995k80738l44455
$$ 825720310 825397491 825064838 824804246 824593544 824309289 823939323 823608577 823348582 823067844 822723389
2476H22723389l36647k64407k45332l09170l63111l34263k70247k83897l53039l43680
$$ 822723389 822386742 822122335 821877003 821567833 821204722 820870459 820600212 820316315 819963276 819619596
2496.4H19619596k49267k20358l06070l55482l11434k78354k88725l04043l01123k77102
$$ 819619596 819370329 819149971 818843901 818488419 818176985 817898631 817609906 817305863 817004740 816727638
2516.8H16727638k48968k49267k70665k80142k84433k88248k87890k93196k93910k54572
$$ 816727638 816478670 816229403 815958738 815678596 815394163 815105915 814818025 814524829 814230919 813976347
2537.2H13976347k15590k54094l15249l20494k80559k44379k51949k78175k70963k29001
$$ 813976347 813760757 813506663 813191414 812870920 812590361 812345982 812094033 811815858 811544895 811315894
2557.6H11315894k33233l17871l56079k65955j80901k36511l45647l37482k53796k72811
$$ 811315894 811082661 810764790 810408711 810142756 809961855 809725344 809379697 809042215 808788419 808515608
2578H08515608l85225m08768l08693k76267l77774m39048l73543k96890l47018m82977
$$ 808515608 808130383 807721615 807412922 807136655 806758881 806319833 805946290 805649400 805302382 804819405
2598.4H04819405n20348m10676l23117m04716n45084n30839m13835m25399n81443o48618
$$ 804819405 804299057 803888381 803565264 803160548 802615464 802084625 801670790 801245391 800663948 800015330
2618.8H00015330n32150m55856n73814o93202o19710m93228n53131p41959p75218o22809
$$ 800015330 799483180 799027324 798453510 797760308 797140598 796647370 796094239 795352280 794577062 793954253
2639.2G93954253n71608p17759q16346p05719n89132o84857q47042q26478o47008n89490
$$ 793954253 793382645 792664886 791848540 791142821 790553689 789868832 789021790 788195312 787548304 786958814
2659.6G86958814p50065q25286o67095n35429o13332p59124p33734n59330n20706o80864
$$ 786958814 786208749 785383463 784716368 784180939 783567607 782808483 782074749 781515419 780994713 780313849
2680G80313849p62462o08266m42743n07891o59883o24120m60446m53234o09100o46889
$$ 780313849 779551387 778943121 778500378 777992487 777332604 776708484 776248038 775794804 775185704 774538815
2700.4G74538815m97937l84331m63664o08981n75841m16874m09842n64635o01589m27008
$$ 774538815 774040878 773656547 773192883 772583902 772008061 771591187 771181345 770616710 770015121 769588113
2720.8G69588113l27766m62413o02961n48422m05013m16398n37098n14567l73661l42429
$$ 769588113 769260347 768797934 768194973 767646551 767241538 766825140 766288042 765773475 765399814 765057385
2741.2G65057385m68731n53071m67301l73363m43638n78463n85437m80234m56393n64933
$$ 765057385 764588654 764035583 763568282 763194919 762751281 762172818 761587381 761107147 760650754 760085821
2761.6G60085821o47425o07431n60463o23882o93202o69896o42360o86109p79986q39829
$$ 760085821 759438396 758830965 758270502 757646620 756953418 756283522 755641162 754955053 754175067 753335238
2782G53335238p90239p18355p50542q46088q80420q47399q70228r91821j090706j059591
$$ 753335238 752544999 751826644 751076102 750230014 749349594 748502195 747631967 746640146 745549440 744489849
2802.3G44489849j016379j091122j163602j147986j144588j219153j320183j354576
$$ 744489849 743473470 742382348 741218746 740070760 738926172 737707019 736386836 735032260
2818.7G35032260j342177j405597j532137j602888j602590j620233j691699j733780
$$ 735032260 733690083 732284486 730752349 729149461 727546871 725926638 724234939 722501159
2835G22501159j693189j684368j787365j854479j794398j717269j745105j847625j883924
$$ 722501159 720807970 719123602 717336237 715481758 713687360 711970091 710224986 708377361 706493437
2853.3G06493437j840591j814664j901209k076447k152026k111673k106369k102136
$$ 706493437 704652846 702838182 700936973 698860526 696708500 694596827 692490458 690388322
2869.7F90388322j984537j874745j874268j794994j579880j372278j231849j183748
$$ 690388322 688403785 686529040 684654772 682859778 681279898 679907620 678675771 677492023
2886F77492023j156807j041115q80778q13424q90076r68278q84831p61449q02875r10699
$$ 677492023 676335216 675294101 674413323 673599899 672709823 671741545 670856714 670095265 669292390 668381691
2906.4F68381691q84950p74622q03292j011372j172423j134097r93372q55386p02977
$$ 668381691 667496741 666722119 665918827 664907455 663735032 662600935 661607563 660752177 660049200
2924.7F60049200m64857j93715q3208l5405K23518O53505J046240J347423J600086
$$ 660049200 659584343 659390628 659307420 659272015 659495533 660149038 661195278 662542701 664142787
2943.1F64142787J833022K023101K134740K203703K222896K210378K239407K283752
$$ 664142787 665975809 667998910 670133650 672337353 674560249 676770627 679010034 681293786
2959.4F81293786K313375K329111K322674K270102K166868K082050K013981J863062
$$ 681293786 683607161 685936272 688258946 690529048 692695916 694777966 696791947 698655009
2975.7F98655009J682520J550675J370310J160324J050711J009226R74416Q58188O06060
$$ 698655009 700337529 701888204 703258514 704418838 705469549 706478775 707453191 708311379 708917439
2994.1G08917439L90768K50220R7990j2457j35303k92718l31104k84016m08590p31349
$$ 708917439 709308207 709558427 709656417 709643960 709508657 709215939 708884835 708600819 708192229 707460880
3014.5G07460880r72986j040339j059354j071334j137495j240492j241266j174331
$$ 707460880 706487894 705447555 704388201 703316867 702179372 700938880 699697614 698523283
3030.8F98523283j150191j259982j412869j346111j217663j330734j553654j634062
$$ 698523283 697373092 696113110 694700241 693354130 692136467 690805733 689252079 687618017
3047.1F87618017j523733j451611j542926j606405j598656j594484j574755j530945
$$ 687618017 686094284 684642673 683099747 681493342 679894686 678300202 676725447 675194502
3063.4F75194502j484573j537979j679659j713991j622498j464069j335263j452565
$$ 675194502 673709929 672171950 670492291 668778300 667155802 665691733 664356470 662903905
3079.7F62903905j696766j787602j761556j693308j664222j769006j817465j662254
$$ 662903905 661207139 659419537 657657981 655964673 654300451 652531445 650713980 649051726
3096F49051726j513958j596868j776874j738847j530587j501262j688660j674354j402735
$$ 649051726 647537768 645940900 644164026 642425179 640894592 639393330 637704670 636030316 634627581
3114.4F34627581j345456j586974j859903j961827j835227j679123j662433j697898
$$ 634627581 633282125 631695151 629835248 627873421 626038194 624359071 622696638 620998740
3130.7F20998740j676261j607657j526892j541793j669705j718939j690685j672507
$$ 620998740 619322479 617714822 616187930 614646137 612976432 611257493 609566808 607894301
3147F07894301j514077j345277j541316j871526j869142j659751j548648j587451j655996
$$ 607894301 606380224 605034947 603493631 601622105 599752963 598093212 596544564 594957113 593301117
3165.4E93301117j606226j505017j532376j636386j642048j536727j464188j542985
$$ 593301117 591694891 590189874 588657498 587021112 585379064 583842337 582378149 580835164
3181.7E80835164j633883j579761j484633j505494j626849j661539j552344j470983
$$ 580835164 579201281 577621520 576136887 574631393 573004544 571343005 569790661 568319678
3198E68319678j513540j540721j449168j361966j420080j537264j503944j353801j309216
$$ 568319678 566806138 565265417 563816249 562454283 561034203 559496939 557992995 556639194 555329978
3216.4E55329978j388073j437604j383483j303852j325488j378894j274764j113952
$$ 555329978 553941905 552504301 551120818 549816966 548491478 547112584 545837820 544723868
3232.7E44723868j187503j369059j344025j195371j090169j042605j101851j213610
$$ 544723868 543536365 542167306 540823281 539627910 538537741 537495136 536393285 535179675
3249E35179675j170636j016080r82583j042246j010299r40085r69111r98736q78930
$$ 535179675 534009039 532992959 532010376 530968130 529957831 529017746 528048635 527049899 526170969
3267.4E26170969o96540p46906r85682j096904j050115r67025r52661j003504j009047
$$ 526170969 525474429 524727523 523741841 522644937 521594822 520627797 519675136 518671632 517662585
3285.7E17662585r18448p91669p96795r45449j053095j108050j117885r94086q63016
$$ 517662585 516744137 515952468 515155673 514210224 513157129 512049079 510931194 509937108 509074092
3304.1E09074092r25183j151741j379073j444220j329541j241625j287222j323551
$$ 509074092 508148909 506997168 505618095 504173875 502844334 501602709 500315487 498991936
3320.4D98991936j248031j196385j338452j521468j506865j378238j251519j170993
$$ 498991936 497743905 496547520 495209068 493687600 492180735 490802497 489550978 488379985
3336.7D88379985j311600j552642j603990j579494j518815j356721j423061j703262
$$ 488379985 487068385 485515743 483911753 482332259 480813444 479456723 478033662 476330400
3353D76330400j739294j548320j401186j397163j423835j280427j161039j358688j673222
$$ 476330400 474591106 473042786 471641600 470244437 468820602 467540175 466379136 465020448 463347226
3371.4D63347226j690209j428902j258790j248926j260251j220405j116693r15051
$$ 463347226 461657017 460228115 458969325 457720399 456460148 455239743 454123050 453207999
3387.7D53207999o66469p41273j122534j186967p72238m80294p81834j195848j071155
$$ 453207999 452541530 451800257 450677723 449490756 448718518 448238224 447456390 446260542 445189387
3406.1D45189387p27177o12110o53863p79509q16972o16669m65453m71026l89576k09093
$$ 445189387 444462210 443850100 443196237 442416728 441599756 440983087 440517634 440046608 439657032 439447939
3426.5D39447939p5757r2864j07438L0o4224l22342l58641j24186J29491K47806J84954
$$ 439447939 439372182 439279318 439171880 439171910 439107686 438785344 438426703 438302517 438432008 438679814 438864768
3448.9D38864768J41650K39879L73661M93199N66214M82530N06311Q38727R62198N93245
$$ 438864768 439006418 439246297 439619958 440113157 440679371 441161901 441668212 442506939 443469137 444062382
3469.3D44062382K21968K94268O00964Q64654Q98630O62386O26207Q40872Q39055P63476
$$ 444062382 444284350 444578618 445179582 446044236 446942866 447605252 448231459 449072331 449911386 450674862
3489.7D50674862R01580J043111J070708J031458J073569J169652R98139P70092Q94159
$$ 450674862 451576442 452619553 453690261 454721719 455795288 456964940 457963079 458733171 459627330
3508D59627330J182616J360923J281530J093656J170545J452893J635820J477122J200080
$$ 459627330 460809946 462170869 463452399 464546055 465716600 467169493 468805313 470282435 471482515
3526.4D71482515J222521J432538J578808J675815J689881J631021J747549J938432
$$ 471482515 472705036 474137574 475716382 477392197 479082078 480713099 482460648 484399080
3542.7D84399080J898557J670212J612574J727432J814007J917422K063215K155036
$$ 484399080 486297637 487967849 489580423 491307855 493121862 495039284 497102499 499257535
3559D99257535K124518K062976K142906K396107K439022K248824K264678K499104K640128
$$ 499257535 501382053 503445029 505587935 507984042 510423064 512671888 514936566 517435670 520075798
3577.4E20075798K699375K844751K962709K879202K691448K718567K861143K993643
$$ 520075798 522775173 525619924 528582633 531461835 534153283 536871850 539732993 542726636
3593.7E42726636L100097L163457L186941L208637L224969L188312L297151L454029
$$ 542726636 545826733 548990190 552177131 555385768 558610737 561799049 565096200 568550229
3610E68550229L491461L494919L316879L291964L567637L432452L140271L113449L505587
$$ 568550229 572041690 575536609 578853488 582145452 585713089 589145541 592285812 595399261 598904848
3628.4E98904848L789246L336966L147304L237367L282905L334820L289819L193676
$$ 598904848 602694094 606031060 609178364 612415731 615698636 619033456 622323275 625516951
3644.7F25516951L313720L686428L479839K668798K496779K994716L046214K628744
$$ 625516951 628830671 632517099 635996938 638665736 641162515 644157231 647203445 649832189
3661F49832189K437890K506077K504110K479971K461612K112031K020836K096295J819253
$$ 649832189 652270079 654776156 657280266 659760237 662221849 664333880 666354716 668451011 670270264
3679.4F70270264J744032J881242K019584K181053J898945J206874J051486J248181
$$ 670270264 672014296 673895538 675915122 678096175 679995120 681201994 682253480 683501661
3695.7F83501661J304626J262963J307011J318693J218259J159966J109898J059294
$$ 683501661 684806287 686069250 687376261 688694954 689913213 691073179 692183077 693242371
3712F93242371J017451R04084Q66413R12666R23038Q19802P18236P27296Q09133J029134
$$ 693242371 694259822 695163906 696030319 696942985 697866023 698685825 699404061 700131357 700940490 701969624
3732.4G01969624J105129R05633P44701N61416L61860N56171Q15510N21481L56913
$$ 701969624 703074753 703980386 704725087 705286503 705648363 706204534 707020044 707541525 707898438
3750.7G07898438N34296N88119N11885N04791N50449M86732M58002M85063M71472M52161
$$ 707898438 708432734 709020853 709532738 710037529 710587978 711074710 711532712 712017775 712489247 712941408
3771.1G12941408L93510M46439O23226O20186M07577K73168K93076L47793M26531M79400
$$ 712941408 713334918 713781357 714404583 715024769 715432346 715705514 715998590 716346383 716772914 717252314
3791.5G17252314M23193M64261N36501L63946L12209L37780K34842L24488L47852K72274
$$ 717252314 717675507 718139768 718676269 719040215 719352424 719690204 719925046 720249534 720597386 720869660
3811.9G20869660L03567M85599M98235K16007K21312K69592K02537K42769K80083M16219
$$ 720869660 721173227 721658826 722157061 722373068 722594380 722863972 723066509 723309278 723589361 724005580
3832.3G24005580N42521L46721J07944J16229J58667J79351J84357K04742J74820J55986
$$ 724005580 724548101 724894822 725002766 725118995 725277662 725457013 725641370 725846112 726020932 726176918
3852.7G26176918L48210K89082J48893K14517K48551K19286J61588J75595K87295J42574
$$ 726176918 726525128 726814210 726963103 727177620 727426171 727645457 727807045 727982640 728269935 728412509
3873.1G28412509K7895Q6844J82688L01540K10822J41620J38760M4405O8367J01626
$$ 728412509 728440404 728527248 728709936 729011476 729222298 729363918 729502678 729547083 729615450 729717076
3893.5G29717076P3910J58071K43008J77145R3818O8128j4603o4671J4305R4652J33753
$$ 729717076 729790986 729949057 730192065 730369210 730463028 730531156 730516553 730451882 730466187 730560839 730694592
3915.9G30694592J47104J07587N2571M2438O1632O0439R3102J46866P1764n1141l9398
$$ 730694592 730841696 730949283 731001854 731044292 731105924 731166363 731259465 731406331 731478095 731426954 731387556
3938.4G31387556N3286J41025J37210L5226K086K3723J19k8312j4961M5121R4414N1140
$$ 731387556 731440842 731581867 731719077 731754303 731756389 731780112 731780231 731751919 731736958 731782079 731876493 731927633
3962.9G31927633n722O0022J44780Q8632j7047k0087L3796M8220N1737P2956P2599
$$ 731927633 731921911 731981933 732126713 732215345 732198298 732178211 732212007 732260227 732311964 732384920 732457519
3985.3G32457519J6570m4108m8220o378P0274J15216
$$ 732457519 732474089 732429981 732381761 732375383 732445657 732560873
3997.5G32560873
$$ 732560873
##END=$$ End of the data block
