##TITLE=Goma arabica - Instant $$ Begin of the data block
##JCAMP-DX=5.00 $$ ACD/SpecManager v 10.08
##SPECTROMETER/DATA SYSTEM=Alpha
##DATE=24 Jun 2014 11:35:20
##DATA TYPE=INFRARED SPECTRUM
##DATA CLASS=XYDATA
##ORIGIN=
##OWNER=
##NPOINTS=1765
##FIRSTX=399.75695801
##LASTX=3997.56933594
##MAXX=3997.56933594
##MINX=399.75695801
##MAXY=0.80599809
##MINY=0.35645187
##XFACTOR=1.0000000000
##YFACTOR=1.000000000000000e-9
##FIRSTY=0.57080173
##DELTAX=2.03957629
##XUNITS=1/CM
##YUNITS=ARBITRARY UNITS
##XYDATA=(X++(Y..Y))
399.8E70801735j183927j42694K8253j028538j279115p8440J90198j016974j474738
418.1E64815760m33267k80201j091003j122058n13851p38860j460492r15647Q2076
436.5E58342457m97103j386225q49724k4438l39210p81655k04265M08888N8352k71618
456.9E54455459K50518M15147m34041q66294k09749J05322m71592n70655J49309K39730
477.3E53063154l30925j92344L88503J09553n77449l89874J37031l45052j089632p46250
497.7E50026715j64330n37932j066566p20739l51906p53939j090705p24078m59313
516E44157207q56638j101196o82473n62370j178384j219034l74198j47402p77960r30428
536.4E36327124l09885q0407n49078o05821P391J47164j84417J47760Q08954O25253
$$ y = [570801735, 569617808, 569475114, 569503367, 568474829, 567195714, 567117274, 567307472, 566290498, 564815760, 564382493, 564102292, 563011289, 561889231, 561375380, 560636520, 559176028, 558260381, 558342457, 557845354, 556459129, 555609405, 555584967, 555245757, 554464102, 554259837, 554668725, 554727077, 554455459, 554705977, 555121124, 554687083, 553820789, 553611040, 553716362, 553244770, 552674115, 552823424, 553063154, 552732229, 552539885, 552928388, 553037941, 552460492, 552070618, 552207649, 551862597, 550772965, 550026715, 549862385, 549324453, 548257887, 547537148, 547185242, 546431303, 545340598, 544616520, 544157207, 543300569, 542199373, 541516900, 540954530, 539776146, 538557112, 538182914, 538035512, 537257552, 536327124, 536017239, 535936832, 535387754, 534781933, 534789324, 534936488, 534752071, 534899831, 535708785, 536334038]
556.8E36334038P5280L13402P87675N09381N96K26736O66798K99871k27213R4711N15223
579.2E39596498N5552m91322k35855Q7261m18842r91761o26505k13325o73115j016379
599.6E35072207m51684k7477n40793r99809n18739o2108m34160n25117N18382J440525
620E33471227J260698J113116J748801K052068J365543R53376J513362J858771J271963
638.4E46608925Q84890J405597J625419Q44359L88086J027465J381397O81341K81274
656.7E55128753R23991J232326N19813j46270J65879J549304J595318J109422J690626
675.1E63769162K029717J234948Q44419J509607J587212N45979L5405N61893N23448
693.5E72641790m90785r04560k63691j07884q36790r12905P9334N82040R6321J93238
$$ y = [536334038, 536409318, 536722720, 537510395, 538019776, 538020372, 538247108, 538913906, 539213777, 538986564, 539081275, 539596498, 539652050, 539160728, 538924873, 539012134, 538593292, 537601531, 536975026, 536761701, 536088586, 535072207, 534620523, 534593046, 534052253, 533052444, 532533705, 532471597, 532037437, 531512320, 532030702, 533471227, 534731925, 535845041, 537593842, 539645910, 541011453, 541964829, 543478191, 545336962, 546608925, 547493815, 548899412, 550524831, 551369190, 551757276, 552784741, 554166138, 554847479, 555128753, 556052744, 557285070, 557804883, 557658613, 557824492, 559373796, 560969114, 562078536, 563769162, 565798879, 567033827, 567878246, 569387853, 570975065, 571521044, 571556449, 572118342, 572641790, 572151005, 571246445, 570982754, 570874870, 570038080, 569125175, 569204509, 569786549, 569882870, 570076108]
713.8E70076108J433074K280176K258301K773404L974319M311263L436923K861381
730.2E93404949L161847K944470J739323J077831J516640J493454N33581K06470Q86321
748.5F06964886R21309j17957o28949j64628k84731j372635j884759j421749j300335
766.9F00710452j813889j512647k6226J131118J399815J995682L267289L794193L157377
785.2F12103164K929211L676295L883362K998054K383292K481997J991689N24402m10021
803.6F32561445k0623N25832O52433J498282L312468M618824M781723M862964N166471
821.9F57959819M423082K253651J22428j165986k463221l808976l873825k277910k20895
840.3F50948167J537680L390074N026698N192757L894627K615154J998424J236022
$$ y = [570076108, 571509182, 573789358, 576047659, 578821063, 582795382, 587106645, 590543568, 593404949, 596566796, 599511266, 601250589, 602328420, 603845060, 605338514, 605872095, 606078565, 606964886, 607886195, 607768238, 607139289, 606974661, 606689930, 605317295, 603432536, 602010787, 600710452, 598896563, 597383916, 597357690, 598488808, 599888623, 601884305, 605151594, 608945787, 612103164, 615032375, 618708670, 622592032, 625590086, 627973378, 630455375, 632447064, 632971466, 632561445, 632540822, 633066654, 633719087, 635217369, 638529837, 643148661, 647930384, 652793348, 657959819, 662382901, 664636552, 664758980, 663592994, 661129773, 657320797, 653446972, 651169062, 650948167, 652485847, 655875921, 660902619, 666095376, 669990003, 672605157, 674603581, 675839603]
856.6F75839603J8537p80463q77977j175999k049566k682983k751053k935827l404081
875F59200191l443539k879262k398491k075433j358092m45068j19686m79519r08852
893.3F45092249j146615j466989j860857j849711j394332j014053p14958m3094P76648
911.7F36378288J089275Q74698M39108l52323j624227k929389l855825m533946n192817
930F20292842n738914o011843o270767o771385p179260p177532o995797o857276o567061
948.4E60723007o114424o032466o514907p016361p188618p292033p401406p103801
964.7E06058991o276459n428224m923165m495472m007399l808707l916323l843457
981D69359785l471106l238589l300190l252387k938628k796918l016144l181368l065914
$$ y = [675839603, 675858140, 675077677, 674199700, 673023701, 670974135, 668291152, 665540099, 662604272, 659200191, 655756652, 652877390, 650478899, 648403466, 647045374, 646600306, 646480620, 646001101, 645092249, 643945634, 642478645, 640617788, 638768077, 637373745, 636359692, 635644734, 635601640, 636378288, 637467563, 638342261, 638781369, 638429046, 636804819, 633875430, 630019605, 625485659, 620292842, 614553928, 608542085, 602271318, 595499933, 588320673, 581143141, 574147344, 567290068, 560723007, 554608583, 548576117, 542061210, 535044849, 527856231, 520564198, 513162792, 506058991, 499782532, 494354308, 489431143, 484935671, 480928272, 477119565, 473203242, 469359785, 465888679, 462650090, 459349900, 456097513, 453158885, 450361967, 447345823, 444164455, 441098541]
999.4D41098541l040224l336102l557473l428847l270090l264963l034085k410114
1015.7D15756643j840294j600831j373083r73880p12037p43836p11829l59773n2959
1034.1D07388121j48147m11243m99487o06984r89288j333356j301020j143753j205087
1052.4C99749756j232416q80688m49032l61234l85880j99288k861p2658j76370J05798
1072.8C96095127O54250J079172J431793K015382K657920K932281K958119L233462
1089.1D13057506L672958L789246L729283L956646M274339M131794L605395L209174
1105.4D43426341K916366K255976J380741R18359Q41022O53296M46499O93082J180739
1123.8D54712421J275748J055896J081198J112015N10811l86953p78556o65456n55456
$$ y = [441098541, 438058317, 434722215, 431164742, 427735895, 424465805, 421200842, 418166757, 415756643, 413916349, 412315518, 410942435, 409968555, 409256518, 408512682, 407800853, 407441080, 407388121, 407239974, 406828731, 406329244, 405722260, 404732972, 403399616, 402098596, 400954843, 399749756, 398517340, 397636652, 397187620, 396826386, 396440506, 396241218, 396238357, 396165699, 395989329, 396095127, 396749377, 397828549, 399260342, 401275724, 403933644, 406865925, 409824044, 413057506, 416730464, 420519710, 424248993, 428205639, 432479978, 436611772, 440217167, 443426341, 446342707, 448598683, 449979424, 450897783, 451738805, 452392101, 452838600, 453531682, 454712421, 455988169, 457044065, 458125263, 459237278, 459748089, 459361136, 458582580, 457917124, 457361668]
1142.2D57361668l83317K86043J291096K011984K401412K949059L649771L994256M008651
1160.5D77570623M272282M783094M961431M834682N084157N749404O109953O095529
1176.8E19461155O464660P268131P628143P415116P419645P637203P199109O088435
1193.1E76581597N233765M782140L898919K562821J756072J605093J193881M15683
1209.5E98029971J71244M82679L50356k70188l79562O5684N6028m85480n84423j88053
1229.9E97248256k65538q75414j011431n39959m43697q64327q46684k54571o1870m59373
1250.3E91625392n17129l875J98841j14381N6505R67205J517713J330376J305818J710653
1270.6E98077118J663924R29653M65632O08206M80532k33888o45578l88086l60608
$$ y = [457361668, 456978351, 457264394, 458555490, 460567474, 462968886, 465917945, 469567716, 473561972, 477570623, 481842905, 486625999, 491587430, 496422112, 501506269, 507255673, 513365626, 519461155, 525925815, 533193946, 540822089, 548237205, 555656850, 563294053, 570493162, 576581597, 581815362, 586597502, 590496421, 593059242, 594815314, 596420407, 597614288, 598029971, 598201215, 598683894, 599034250, 598764062, 598384500, 598450184, 598506212, 598020732, 597436309, 597248256, 596982718, 596107304, 595095873, 594555914, 594112217, 593247890, 592401206, 592146635, 592084765, 591625392, 591108263, 591104388, 591303229, 591188848, 591245353, 592212558, 593730271, 595060647, 596366465, 598077118, 599741042, 600670695, 601136327, 601744533, 602225065, 601991177, 601345599, 600957513, 600596905]
1289F00596905r55343j246155p93755m59552o90817p01130j28746J60694k68757n34475
1309.4E94978869j24931J58369j69098l19541J76728M61459L934l93152k02239j42157
1329.8E94428241o87122j089275q44896o63578j014591j108884n67079j59264l40640
1348.1E87952912m93944j69337l7849n61773j060665j019001r87709j361310j615822
1366.5E80645502j367629r71198j024187j066029l59773L16023K02716L5524O61671
1384.9E77072620J423955J106322K30670j66535l77655r63569j614749j605332j497746
1403.2E73607981k019107k424121k223969j980781k043724k085924j814723j309216
1419.5E57706416q91984o57737r2447O24716Q91090R59396J292706J988351K318263
$$ y = [600596905, 599641562, 598395407, 597601652, 597142100, 596451283, 595750153, 595621407, 595782101, 595513344, 594978869, 594853938, 595012307, 594843209, 594523668, 594700396, 595161855, 595165789, 594772637, 594570398, 594428241, 593741119, 592651844, 591806948, 591143370, 590128779, 589019895, 588452816, 588293552, 587952912, 587458968, 587289631, 587251782, 586690009, 585629344, 584610343, 583622634, 582261324, 580645502, 579277873, 578306675, 577282488, 576216459, 575856686, 576172709, 576375425, 576410949, 577072620, 578496575, 579602897, 579833567, 579667032, 579289377, 578325808, 576711059, 575105727, 573607981, 571588874, 569164753, 566940784, 564960003, 562916279, 560830355, 559015632, 557706416, 556814432, 556156695, 556064248, 556688964, 557580054, 558539450, 559832156, 561820507, 564138770]
1437.9E64138770J855254J825869J983822J639008J146913J158297J393676J315474
1454.2E76457083J332641K160013K678334K614498K933860L591061L887832M067540
1470.5E99722862M788220N401015N467833N137503M763603M827499M901886M782081
1486.8F39792502M679322M765570M401446L972113L873467L724933L463805K904474
1503.2F71577632K432526K767741K882362K319336J838326J746237K083183J921177
1519.5F89568520J465618J426339J551867J335621Q42154O35206O88613N42343Q583
1537.8F98064864n49913n49733n35012q97467j051962j143992j424492j852989k026558
1556.2F88032746k724051l545642k648056k684772l257155m279733n600810n340099
$$ y = [564138770, 565994024, 567819893, 569803715, 571442723, 572589636, 573747933, 575141609, 576457083, 577789724, 579949737, 582628071, 585242569, 588176429, 591767490, 595655322, 599722862, 604511082, 609912097, 615379930, 620517433, 625281036, 630108535, 635010421, 639792502, 644471824, 649237394, 653638840, 657610953, 661484420, 665209353, 668673158, 671577632, 674010158, 676777899, 679660261, 681979597, 683817923, 685564160, 687647343, 689568520, 691034138, 692460477, 694012344, 695347965, 696190119, 696825325, 697513938, 698056281, 698064864, 697514951, 696965218, 696430206, 695532739, 694480777, 693336785, 691912293, 690059304, 688032746, 685308695, 681763053, 679114997, 676430225, 673173070, 668893337, 663292527, 657952428]
1572.5F57952428n807102q247793q413791p578910q097767q624733q756161q439064
1588.8E93987107p850408p311225o823778n966008m944503m244507l652096k814292
1605.1E50380290k011657j582861j255691q08239m76957l35753j10864R5129L00884
1623.5E44194281K98619J33336L36826P18176Q20935R70840J476527J771330J797319
1641.8E52518189J692593K084434K804339K443790K357007L530025L475428K965152
1658.2E73870957K939343L399015L959417L673256L590345M162729M222154M328490
1674.5F04145706M465759M097878M011035M346490N109907M766404M294217M348576
1690.8F39585972L668010L447056L803491L594518L376484K807736K598823K579808
$$ y = [657952428, 652145326, 643897533, 635483742, 627904832, 619807065, 611182332, 602426171, 593987107, 586136699, 578825474, 572001696, 566035688, 561091185, 556846678, 553194582, 550380290, 548368633, 546785772, 545530081, 544721842, 544244885, 543909132, 543798268, 543893397, 544194281, 544492900, 544626236, 544963062, 545681238, 546502173, 547473013, 548949540, 550720870, 552518189, 554210782, 556295216, 559099555, 561543345, 563900352, 567430377, 570905805, 573870957, 576810300, 580209315, 584168732, 587841988, 591432333, 595595062, 599817216, 604145706, 608611465, 612709343, 616720378, 621066868, 626176775, 630943179, 635237396, 639585972, 643253982, 646701038, 650504529, 654099047, 657475531, 660283267, 662882090, 665461898]
1707.1F65461898J856446J339078J408458J421392J091718J095176J564801J761258
1723.4F77000225J595258J591802K136588K489865K544165K674579K785444L098190
1739.7F95916116K939940K585947K866268L199161L064095K883435K951264L053844
1756.1G19460070K729535K205730K379060K540230J978696J408159J511097J996518
1772.4G36209095J843512J346469J423716J721263J475215J061857J233458J504183
1788.7G47818768J204610Q71003J146555J443982J190543P94053R75609J319766J117408
1807G57882297O81698P70152J147270J025617O20663O79136R76443Q04544M39107N52356
1827.4G65579283R06766Q85844N73754N47409Q03709P47025L64781L00705P04050P56741
$$ y = [665461898, 667318344, 668657422, 670065880, 671487272, 672578990, 673674166, 675238967, 677000225, 678595483, 680187285, 682323873, 684813738, 687357903, 690032482, 692817926, 695916116, 698856056, 701442003, 704308271, 707507432, 710571527, 713454962, 716406226, 719460070, 722189605, 724395335, 726774395, 729314625, 731293321, 732701480, 734212577, 736209095, 738052607, 739399076, 740822792, 742544055, 744019270, 745081127, 746314585, 747818768, 749023378, 749894381, 751040936, 752484918, 753675461, 754469514, 755445123, 756764889, 757882297, 758563995, 759334147, 760481417, 761507034, 762127697, 762806833, 763783276, 764587820, 765026927, 765579283, 766486049, 767371893, 767945647, 768493056, 769296765, 770043790, 770408571, 770709276, 771413326, 772170067]
1847.8G72170067M34995M25338O88494O53982L64482M02033O76275O26087K97308K78830
1868.2G77017891O52016O98804M03584L49938N56767N07832K57969K94268M99248L96967
1888.6G81635284J71423K76149M87446M19856J95145K39969M53531L91126J42574J71960
1909G84584463M20868L96013J42694J27435L62992L01480N3942J77384M27425K95102
1929.4G87289798J8418Q1956K93911K11060k7299K4200K84135K27094m4823K1994K75672
1951.9G88656116J67250j26183m5478K72274K13146j11938q7141K07006J58489j27613
1972.3G89175928o5804K26438J63317j64569j23858K07484J77502j71065j77383J73449
1992.6G89421439J89066j55151j68681J62900J27554k60592k79486Q7678J17958k46346
$$ y = [772170067, 772605062, 773030400, 773718894, 774372876, 774737358, 775139391, 775815666, 776441753, 776739061, 777017891, 777669907, 778368711, 778772295, 779122233, 779679000, 780186832, 780444801, 780739069, 781238317, 781635284, 781806707, 782082856, 782570302, 782990158, 783185303, 783425272, 783878803, 784269929, 784412503, 784584463, 785005331, 785401344, 785544038, 785671473, 786034465, 786335945, 786389887, 786567271, 786994696, 787289798, 787308216, 787390172, 787684083, 787895143, 787867844, 787892044, 788176179, 788403273, 788358450, 788380444, 788656116, 788823366, 788697183, 788651705, 788923979, 789137125, 789025187, 788938046, 789145052, 789303541, 789175928, 789110124, 789336562, 789499879, 789335310, 789211452, 789418936, 789596438, 789425373, 789247990, 789421439, 789610505, 789455354, 789286673, 789449573, 789577127, 789316535, 789037049, 789124727, 789242685, 788996339]
2013G88996339l13163K7597Q6665k90036l74258j4960O0796k99155l68655j192R5904
2035.5G87605882k66135l86179j9311J11341k37107l75986m0710J35600j56879l14772
2055.9G86055744o557J72436j14321k86401J6034K35379l4511k35975L4273K35974
2076.3G86072075k7179k27809L3974K26200l3557k26558L6896K45571j1623k39194
2096.7G85848796n841K26081L278k45750m6075K08676K4975k01166n364K08616J9491
2119.1G86035717j96338k9564J96874N9605j49250m351K07126P5400j26422K0623K43843
2141.5G86333263J12832r3282M7624K69652J68144j8894R6440L03209K15709L9399
2161.9G87474096J72198L83794K63929O9559K05338M17888L14713J20401K36571M39167
$$ y = [788996339, 788683176, 788710773, 788797438, 788507402, 788133144, 788118184, 788178980, 787879825, 787511170, 787509978, 787605882, 787339747, 786953568, 786934257, 787045598, 786808491, 786432505, 786391795, 786527395, 786370516, 786055744, 786049187, 786221623, 786107302, 785820901, 785836935, 786072314, 786037803, 785801828, 785836101, 786072075, 786044896, 785817087, 785851061, 786077261, 786043704, 785817146, 785854042, 786099613, 786087990, 785848796, 785842955, 786069036, 786072314, 785826564, 785780489, 785989165, 786014140, 785812974, 785807610, 786016226, 786035717, 785839379, 785809815, 786006689, 786066294, 785917044, 785912693, 786119819, 786195219, 786068797, 786089420, 786333263, 786446095, 786352813, 786400437, 786670089, 786838233, 786819339, 786915779, 787218988, 787434697, 787474096, 787646294, 788030088, 788294017, 788363576, 788568914, 788986802, 789301515, 789421916, 789658487, 790097654]
2182.3G90097654L16203R3519J99616M37558L57628J42216K25604M16219L36588J67071
2202.7G92789876K40446M02569L37184J73986K45690M29392L56197J50085K07603M19915
2223.1G95752943L96728K09928K38895M14908L57032J62661K17557M25219L71099J33514
2243.5G98680484J60992L90232L65138J39952J44660L25918L05534J11699J15991L14653
2263.9H01055253L21269J37269J37568L17514L07798J13666J23203L41177L57687J29640
2284.3H03342044K7299J38998J46687l0219l5942J55688J20222j36733j94728n2870
2304.7H03480446o6697k67208l07262r5069k4200l00228n35846m26233k45511k60354
2325.1H00951838l06189k27987j50860k14338k92659k15292j17123q9228J83403Q29280
$$ y = [790097654, 790413857, 790507376, 790706992, 791144550, 791502178, 791644394, 791869998, 792286217, 792622805, 792789876, 793030322, 793432891, 793770075, 793944061, 794189751, 794619143, 794975340, 795125425, 795333028, 795752943, 796149671, 796359599, 796598494, 797013402, 797370434, 797533095, 797750652, 798175871, 798546970, 798680484, 798841476, 799231708, 799596846, 799736798, 799881458, 800207376, 800512910, 800624609, 800740600, 801055253, 801376522, 801513791, 801651359, 801968873, 802276671, 802390337, 802513540, 802854717, 803212404, 803342044, 803369343, 803508341, 803655028, 803624809, 803588867, 803744555, 803864777, 803728044, 803533316, 803480446, 803413749, 803146541, 802839279, 802744210, 802720010, 802419782, 801883936, 801457703, 801212192, 800951838, 800645649, 800417662, 800266802, 800052464, 799759805, 799544513, 799427390, 799338162, 799521565, 800350845]
2345.5H00350845R81569J84417p98345j229047j101673q49128m37736R9241M77553
2363.8G97677696O56247P64668Q89599R45211Q78155Q80122R68039Q97706O36160M20213
2384.2H05613816K89738R4533j22011j50025l8922n4240j76489j85847j02163j21116
2404.6H05047274k29955k20001r5010j06573k69472k96772j66356j76371l46839l57747
2425H02782178j88351j62005l26514l94345k81393k42949l79860m18008k75135k53975
2445.4G99859643m01616m42088l26037k94328m29749m87626l41535k64108m19080n08785
2465.8G95944691l76582l23773m77552n34475l77774l12210m61280n30898l93510l39568
2486.2G91817069m88520n45680l79622k88308m26292n17190m00960l17753m33981n24461
$$ y = [800350845, 801332414, 801516831, 800718486, 799489439, 798387766, 797538638, 797100902, 797200143, 797677696, 798333943, 799098611, 799988210, 800933421, 801811576, 802691698, 803659737, 804557443, 805193603, 805613816, 805903554, 805998087, 805876076, 805726051, 805687129, 805632889, 805456400, 805270553, 805168390, 805047274, 804817319, 804597318, 804502308, 804395735, 804126263, 803829491, 803663135, 803486764, 803139925, 802782178, 802593827, 802431822, 802105308, 801710963, 801429570, 801186621, 800806761, 800388753, 800113618, 799859643, 799458027, 799015939, 798689902, 798395574, 797965825, 797478199, 797136664, 796872556, 796453476, 795944691, 795568109, 795244336, 794766784, 794232309, 793854535, 793542325, 793081045, 792550147, 792156637, 791817069, 791328549, 790782869, 790403247, 790114939, 789688647, 789171457, 788770497, 788452744, 788018763, 787494302]
2506.6G87494302m01616k79665l76940m99070m24802l34740m14312m71413l57568k71976
2527G83662200l73840m74394l79145k82466l81828m84228l96013k87771l47317m21285
2547.4G79833913l61085l06785l73423m35710l61264k63095l29912m44591m00543l22938
2567.8G76234567m00960m96030m09365l18229m19080n18859m56273m12524n15640n83112
2588.2G71704495n00739m38630n36919o41763n77986n08905n98311o74010o06298n50568
2608.6G66070366o36816p38502p12156o76036p55548q30591p87675p43032q22186r14514
2629G58453310q89540q46625r21011j003265r38237q59201r40203j058877j026153
2647.3G49970198r43482j008332j111627j053393r35673r57906j038373r76741q82686
$$ y = [787494302, 787092686, 786813021, 786436081, 785937011, 785512209, 785177469, 784763157, 784291744, 783934176, 783662200, 783288360, 782813966, 782434821, 782152355, 781770527, 781286299, 780890286, 780602515, 780255198, 779833913, 779472828, 779166043, 778792620, 778356910, 777995646, 777732551, 777402639, 776958048, 776557505, 776234567, 775833607, 775337577, 774928212, 774609983, 774190903, 773672044, 773215771, 772803247, 772287607, 771704495, 771203756, 770765126, 770228207, 769586444, 769008458, 768499553, 767901242, 767227232, 766620934, 766070366, 765433550, 764695048, 763982892, 763306856, 762551308, 761720717, 760933042, 760190010, 759367824, 758453310, 757563770, 756717145, 755796134, 754792869, 753854632, 752995431, 752055228, 750996351, 749970198, 749026716, 748018384, 746906757, 745853364, 744917691, 743959785, 742921412, 741944671, 741061985]
2665.7G41061985r64343j061380r53615q06987q52704r59516r12070p96378q07940
2684.1G32947052q91507q44836p05660p12871q27730p88093o59942o77645p82490p52628
2704.5G25303650o37055o62565p72714p42674o15716o27637p54178p54237o12378n58078
2724.8G18566418o66678p27296o42479o09815o81579o53446n38051n51343o74963o96003
2745.2G12124765n91278n74052o96362p43031o49810o33418p69318q51035p85470p63356
2765.6G05067635q72970r34124q62300q20041r13322j017809j022279j020551j090646
2784F96513593j128793j079201j060546j151800j254797j246571j238943j350939j424372
2802.3F85577631j392007j389682j447618j538754j613795j618743j653731j755476
$$ y = [741061985, 740097642, 739036262, 738082647, 737275660, 736422956, 735463440, 734551370, 733754992, 732947052, 732055545, 731210709, 730505049, 729792178, 728964448, 728176355, 727516413, 726838768, 726056278, 725303650, 724666595, 724004030, 723231316, 722488642, 721872926, 721245289, 720491111, 719736874, 719124496, 718566418, 717899740, 717172444, 716529965, 715920150, 715238571, 714585125, 714047074, 713495731, 712820768, 712124765, 711533487, 710959435, 710263073, 709520042, 708870232, 708236814, 707467496, 706616461, 705830991, 705067635, 704194665, 703260541, 702398241, 701578200, 700664878, 699647069, 698624790, 697604239, 696513593, 695384800, 694305599, 693245053, 692093253, 690838456, 689591885, 688352942, 687002003, 685577631, 684185624, 682795942, 681348324, 679809570, 678195775, 676577032, 674923301, 673167825]
2818.7F73167825j826346j868248j946926k054572k113402k151430k226233k264858
2835F56715810k241432k232552k271116k291202k274752k275824k287806k285599k272487
2853.3F36283040k280950k336860k412498k503395k610505k671480k665997k617120
2869.7F16184235k538264k450168k345682k165317j925528j733482j573980j419723
2886F00032091j353323j314938j196087j077413j065553j095414j049161r80198j008153
2904.3E89891851j082480j077831j049042j146972j314580j379788j339138j290261
2920.6E80211759j174808r09209n94139l85702k59221Q047M34876Q09013J123369J546323
2941E80810308K019704K314806K427995K596438K874970K975762K848208K830386K982617
$$ y = [673167825, 671341479, 669473231, 667526305, 665471733, 663358331, 661206901, 658980668, 656715810, 654474378, 652241826, 649970710, 647679508, 645404756, 643128932, 640841126, 638555527, 636283040, 634002090, 631665230, 629252732, 626749337, 624138832, 621467352, 618801355, 616184235, 613645971, 611195803, 608850121, 606684804, 604759276, 603025794, 601451814, 600032091, 598678768, 597363830, 596167743, 595090330, 594024777, 592929363, 591880202, 590900004, 589891851, 588809371, 587731540, 586682498, 585535526, 584220946, 582841158, 581502020, 580211759, 579036951, 578127742, 577533603, 577147901, 576888680, 576896727, 577331603, 578140616, 579263985, 580810308, 582830012, 585144818, 587572813, 590169251, 593044221, 596019983, 598868191, 601698577, 604681194]
2959.4F04681194L006756K840340K723575K676010K503097K240300K077997K011538
2975.7F24760807J918196J764834J593590J493335J414835J230955J087666J018822
2992F36283040P63714M06981J82569N4061j04785l46422n06162m72129m86195p76410
3012.4F34998262j133621j257896j301110j465440j539290j459777j510024j667619
3028.7F23663485j672566j540065j589060j829862j845002j669884j694739j945615
3045.1F09876692k096712j942456j797617j928448k054990k002120j958906k009571
3061.4E94085872k016961j905263j867831k038240k173424k037108j773476j733601
3077.7E78539968j972557k105057k019286k045631k129078k052427k018451k117753
$$ y = [604681194, 607687950, 610528290, 613251865, 615927875, 618430972, 620671272, 622749269, 624760807, 626679003, 628443837, 630037427, 631530762, 632945597, 634176552, 635264218, 636283040, 637046754, 637453735, 637636304, 637690365, 637585580, 637239158, 636732996, 636260867, 635774672, 634998262, 633864641, 632606745, 631305635, 629840195, 628300905, 626841128, 625331104, 623663485, 621990919, 620450854, 618861794, 617031932, 615186930, 613517046, 611822307, 609876692, 607779980, 605837524, 604039907, 602111459, 600056469, 598054349, 596095443, 594085872, 592068911, 590163648, 588295817, 586257577, 584084153, 582047045, 580273569, 578539968, 576567411, 574462354, 572443068, 570397437, 568268359, 566215932, 564197481, 562079728]
3094E62079728k134323j971066j847089j966178k074778j919031j782120j942873k050638
3112.4E44391632j829386j668453j817822k102256k252221k117276j924992j910627
3128.7E28768599j949370j899600j834273j813889j812100j853407j927375j967431
3145E13711154j892983j691998j587510j775205j989543j932204j821816j843661j830369
3163.4D97345865j717508j670748j747340j781166j704931j658648j720250j753062
3179.7D83592212j680553j635223j663894j660228j597613j558959j596421j652301
3196D70547020j618832j537502j526445j544773j500845j472056j523435j538903j435816
3214.3D56848413j349390j401245j446069j376062j325608j346796j322091j205742
$$ y = [562079728, 559945405, 557974339, 556127250, 554161072, 552086294, 550167263, 548385143, 546442270, 544391632, 542562246, 540893793, 539075971, 536973715, 534721494, 532604218, 530679226, 528768599, 526819229, 524919629, 523085356, 521271467, 519459367, 517605960, 515678585, 513711154, 511818171, 510126173, 508538663, 506763458, 504773915, 502841711, 501019895, 499176234, 497345865, 495628357, 493957609, 492210269, 490429103, 488724172, 487065524, 485345274, 483592212, 481911659, 480276436, 478612542, 476952314, 475354701, 473795742, 472199321, 470547020, 468928188, 467390686, 465864241, 464319468, 462818623, 461346567, 459823132, 458284229, 456848413, 455499023, 454097778, 452651709, 451275647, 449950039, 448603243, 447281152, 446075410]
3230.7D46075410j119614j222610j357079j302063j188428j130879j077622j049816
3247D36627299j094342j124948j063555r92388r88066j001716r91672r70215r05871
3265.3D27494526p94053p32541q22187r65327j014560r87351r32247q80807q76695
3283.7D19488758q87215q31396p34627p29322q47459r61781j018852j015931q95470
3302D11566705p32750p69049j030326j218826j199871j093596j030237j047045j071095
3320.4D02373910j032472j006067j129925j240283j175076j105368j058191r95159
3336.7C93631369j062274j200914j226247j194805j127988j017988j098811j323045
3353C84379297j354604j191736j050204j016706r92984q85933q41469j020312j283050
$$ y = [446075410, 444955796, 443733186, 442376107, 441074044, 439885616, 438754737, 437677115, 436627299, 435532957, 434408009, 433344454, 432352066, 431364000, 430362284, 429370612, 428400397, 427494526, 426700473, 425967932, 425145745, 424180418, 423165858, 422178507, 421246260, 420365453, 419488758, 418601543, 417770147, 417035520, 416306198, 415458739, 414496958, 413478106, 412462175, 411566705, 410833955, 410064906, 409034580, 407815754, 406615883, 405522287, 404492050, 403445005, 402373910, 401341438, 400335371, 399205446, 397965163, 396790087, 395684719, 394626528, 393631369, 392569095, 391368181, 390141934, 388947129, 387819141, 386801153, 385702342, 384379297, 383024693, 381832957, 380782753, 379766047, 378773063, 377887130, 377045661, 376025349, 374742299]
3371.4C74742299j302242j079917r36180r24796r47952r41664q57860o80208m72665
3389.7C66598815n22882q17359q47309n05597l19272o06895r21398q00371n64098m94212
3410.1C60199422m67450n10126n63264m81248l82930l27200k21222r4980q017j1563
3430.5C57131422J1026Q2076n6833l04610l12894r8318J10179J88798J53422J43737
3450.9C57048005K04980K84523L81768M61310M19468M31805O57529P61479M89742J63883
3471.3C61304492K03132M55559O65277P05451N30332M82470O52909O96391O55204P32243
3491.7C67083460Q10742Q36850Q11368Q26955Q90136P63684O24567P48724R77963J146913
3512.1C75521362J096487Q87334Q61317J055122J259028J212001J029581J052588J203120
$$ y = [374742299, 373440057, 372360140, 371423960, 370499164, 369551212, 368609548, 367751688, 367071480, 366598815, 366075933, 365258574, 364411265, 363905668, 363586396, 362979501, 362058103, 361257732, 360693634, 360199422, 359731972, 359221846, 358658582, 358177334, 357794404, 357467204, 357245982, 357151002, 357142985, 357131422, 357142448, 357224524, 357167691, 356863081, 356550187, 356451869, 356562048, 356750846, 356904268, 357048005, 357252985, 357537508, 357919276, 358380586, 358800054, 359231859, 359889388, 360650867, 361140609, 361304492, 361507624, 361963183, 362628460, 363333911, 363864243, 364346713, 364999622, 365696013, 366351217, 367083460, 367894202, 368731052, 369542420, 370369375, 371259511, 372023195, 372647762, 373396486, 374374449, 375521362, 376617849, 377505183, 378366500, 379421622, 380680650, 381892651, 382922232, 383974820, 385177940]
3530.5C85177940J322836J432627J404047J283825J408577J621097J599312J407415
3546.8C96657676J366436J478910J537621J582087J693904J852274J887977J702100
3563.1D09758985J642376K060563K368301K160161K009601K142101K312750K449721
3579.4D26904559K552450K497703K342939K359867K602458K666891K644896K793759
3595.7D47365522K994180L034353K987504K914668K822309K965152L187925L231675
3612.1D71503288L248482L195078L274262L589689L526718L158480K926588L308892
3628.4D97731477L962129L828526L642440L586948L505230L534853L486872L229439
3644.7E26507914L130615L652811M078328L590644L300846L672599L716529L249347
$$ y = [385177940, 386500776, 387933403, 389337450, 390621275, 392029852, 393650949, 395250261, 396657676, 398024112, 399503022, 401040643, 402622730, 404316634, 406168908, 408056885, 409758985, 411401361, 413461924, 415830225, 417990386, 419999987, 422142088, 424454838, 426904559, 429457009, 431954712, 434297651, 436657518, 439259976, 441926867, 444571763, 447365522, 450359702, 453394055, 456381559, 459296227, 462118536, 465083688, 468271613, 471503288, 474751770, 477946848, 481221110, 484810799, 488337517, 491495997, 494422585, 497731477, 501693606, 505522132, 509164572, 512751520, 516256750, 519791603, 523278475, 526507914, 529638529, 533291340, 537369668, 540960312, 544261158, 547933757, 551650286, 554899633]
3661E54899633K935946K868771K733231K676308K847970K645492K514422K805472K777815
3679.4E79705060K573013K436936K293229K163291J971602J848340J847029J776338
3695.7E96614838J653075J528382J501382J568019J514554J321614J167714J304865
3712F08174443J623988J534343J168311R22382R14395J021623J106203J175880J051903
3730.3F18693471Q25643Q14081J070440J248776J007319M36902K92063Q97586Q80718
3748.7F26166999N42403Q89062J217783J016021P25865P34329Q06809P11918O21199
3767.1F33432388N51761O28232Q25406Q13067O58512N31375N20051N36620N35131O05285
3787.5F39637828O65903O18458M64499L28719L37243K64049K54214O01113N91337M69149
$$ y = [554899633, 557835579, 560704350, 563437581, 566113889, 568961859, 571607351, 574121773, 576927245, 579705060, 582278073, 584715009, 587008238, 589171529, 591143131, 592991471, 594838500, 596614838, 598267913, 599796295, 601297677, 602865696, 604380250, 605701864, 606869578, 608174443, 609798431, 611332774, 612501085, 613423467, 614337862, 615359485, 616465688, 617641568, 618693471, 619519114, 620333195, 621403635, 622652411, 623659730, 624096632, 624388695, 625286281, 626166999, 626709402, 627598464, 628816247, 629832268, 630558133, 631292462, 632099271, 632811189, 633432388, 633984149, 634612381, 635437787, 636250854, 636909366, 637440741, 637960792, 638497412, 639032543, 639637828, 640303731, 640922189, 641386688, 641715407, 642052650, 642316699, 642570913, 643172026, 643763363, 644232512]
3807.8F44232512O63220O35922K92778J14978L29494K98381L39806O65307O02544M34935
3828.2F48609877L90529L70384L50177J37150L219L54707O29306O25491N54740L55900
3848.6F52381480j00553o01769K0921R57728Q36372L66926N2155R4950K31623J12534
3869F54352367J51217M08292N01990M11034J39832J07050L33190K67863J94133J69873
3889.4F57036841M8876K02656L59177J27256j45972j13129Q2969L46661M88460L64542
3909.8F58798337K06947R4116k8431j3173J35124J68264Q4400Q6605J21713O7413P1347
3932.3F59792662J53720J57714P4089l0101m8101O7532J09256M4584O7234J00791R4474
3954.7F60583854J06692Q6188M1247J8954k682J192O3717Q5891M8160N0306P8381O5147
$$ y = [644232512, 644895732, 645531654, 645824432, 645939410, 646268904, 646567285, 646907091, 647572398, 648174942, 648609877, 649000406, 649370790, 649720967, 649858117, 649861336, 650216043, 650845349, 651470840, 652025580, 652381480, 652280927, 651679158, 651700079, 652657807, 653494179, 653861105, 653913260, 654008210, 654239833, 654352367, 654503584, 654911876, 655413866, 655824900, 655964732, 656071782, 656404972, 656672835, 656866968, 657036841, 657085717, 657288373, 657647550, 657774806, 657628834, 657515705, 657598674, 657945335, 658433795, 658798337, 659005284, 659099400, 659070969, 659057796, 659192920, 659361184, 659445584, 659532189, 659653902, 659721315, 659792662, 659946382, 660104096, 660178185, 660148084, 660099983, 660167515, 660276771, 660321355, 660388589, 660489380, 660583854, 660690546, 660776734, 660817981, 660836935, 660834253, 660835445, 660899162, 660985053, 661033213, 661083519, 661161900, 661227047]
3979.2F61227047O3301P3790M8280K0206j7226m6790j1920O3955R6798
3997.5F61517441
$$ y = [661227047, 661290348, 661364138, 661412418, 661432624, 661415398, 661368608, 661356688, 661420643, 661517441]
##END=$$ End of the data block
