##TITLE=Goma arabica - Fibre Gum $$ Begin of the data block
##JCAMP-DX=5.00 $$ ACD/SpecManager v 10.08
##SPECTROMETER/DATA SYSTEM=Alpha
##DATE=24 Jun 2014 11:35:20
##DATA TYPE=INFRARED SPECTRUM
##DATA CLASS=XYDATA
##ORIGIN=
##OWNER=
##NPOINTS=1765
##FIRSTX=399.75695801
##LASTX=3997.56933594
##MAXX=3997.56933594
##MINX=399.75695801
##MAXY=0.72278947
##MINY=0.20633873
##XFACTOR=1.0000000000
##YFACTOR=1.000000000000000e-9
##FIRSTY=0.36115676
##DELTAX=2.03957629
##XUNITS=1/CM
##YUNITS=ARBITRARY UNITS
##XYDATA=(X++(Y..Y))
399.8C61156762n55188j251906q05825R269n99891q62956j53989j26243m29153j42366
$$ 361156762 360601574 359349668 358543843 358553112 357953221 357090265 356936276 356810033 356380880 356238514
420.2C56238514m32521j245558j043171m83692q36640q19147j91927n08815r67145
$$ 356238514 355805993 354560435 353517264 353033572 352196932 351377785 351185858 350677043 349709898
438.5C49709898m80830k76924o54220l60340J82092J1325L6836N06907K22713k48343
$$ 349709898 349229068 348952144 348297924 347937584 348119676 348131001 348167837 348674744 348897457 348649114
458.9C48649114J88500K13504l67105k10822J42932j89841j82926M12404L26634q1212
$$ 348649114 348837614 349051118 348684013 348473191 348616123 348426282 348243356 348655760 348982394 348901182
479.3C48901182K07901M60297p1615l74257r4325k85804o18160l41952m16964r47535
$$ 348901182 349109083 349569380 349497765 349123508 349029183 348743379 348125219 347783267 347366303 346418768
499.7C46418768p88569l86298p17729r28641n99473p22409j027345p13528o29216j185268
$$ 346418768 345630199 345243901 344526172 343597531 342998058 342275649 341248304 340534776 339905560 338720292
520.1C38720292j108349n17755p09564j028329o08027n33253q87930n28991l1442l70920
$$ 338720292 337611943 337094188 336384624 335356295 334748268 334215015 333327085 332798094 332766652 332395732
540.5C32395732n12868M4853Q8989k55405J76906O64979L74616M30405R73701P79927
$$ 332395732 331882864 331927717 332016706 331761301 331938207 332603186 332977802 333408207 334381908 335161835
560.9C35161835L79264O01828N03004K4766L07679P09832J87784j70529K60413K03460
$$ 335161835 335541099 336142927 336645931 336670697 336978376 337688208 337875992 337705463 337965876 338169336
581.3C38169336k50965j07318o3330n96345o77675l60280o52522r38713m90338k88665
$$ 338169336 337918371 337811053 337747723 337151378 336473703 336113423 335460901 334522188 334031850 333743185
601.7C33743185p03067o05762j76579l83824n36799J7226L48299L66807J011789J678854
$$ 333743185 333040118 332434356 332257777 331873953 331337154 331354380 331702679 332069486 333081275 334760129
622.1C34760129J618565J629054J968980J814395J535773J853407J966297J451642
$$ 334760129 336378694 338007748 339976728 341791123 343326896 345180303 347146600 348598242
638.4C48598242J391321J783788J506091J013428J192867J186639O74755Q02785J229882
$$ 348598242 349989563 351773351 353279442 354292870 355485737 356672376 357347131 358149916 359379798
656.7C59379798Q96931N89847R52572J006126Q60274J527608J701295J245856J411438
$$ 359379798 360276729 360866576 361819148 362825274 363685548 365213156 366914451 368160307 369571745
675.1C69571745J998872J898140J372903J450420J420408O51688K70694M66287K2382
$$ 369571745 371570617 373468757 374841660 376292080 377712488 378364176 378634870 379101157 379123539
693.5C79123539n98252m41015m08292r21368q11816k44855l16471l02375N02050J025498
$$ 379123539 378525287 378084272 377675980 376754612 375942796 375697941 375381470 375079095 375581145 376606643
713.8C76606643J157969K056659L307432L805011M171282M904837M807651L929138
$$ 376606643 377764612 379821271 383128703 386933714 391104996 396009833 400817484 404746622
730.2D04746622L604352L320873K359003J780212J782685J241655O26474Q16286P87705
$$ 404746622 408350974 411671847 414030850 415811062 417593747 418835402 419461876 420278162 421065867
748.5D21065867N4747j78158j32978q64476j581550j636386j966059k634496k522200
$$ 421065867 421120614 420942456 420809478 419945002 418363452 416727066 414761007 412126511 409604311
766.9D09604311j863092j408220n21838J042098K173900K742946L589809M284680M201979
$$ 409604311 407741219 406332999 405811161 406853259 409027159 411770105 415359914 419644594 423846573
785.2D23846573M133731M477650M361182L822655L567874K971739J556158M23640M5895
$$ 423846573 427980304 432457954 436819136 440641791 444209665 447181404 448737562 449161202 449207097
803.6D49207097k96443k58357R37611K513647L646225M944503O307572O583870N887836
$$ 449207097 448910654 448652297 449589908 452103555 455749780 460694283 467001855 473585725 479473561
821.9D79473561M839778K823144j71423k666592m218609n314767n208880l206342m41641
$$ 479473561 484313339 487136483 486965060 484298468 480079859 474765092 469556212 466349870 465908229
840.3D65908229K122850M612863O225705N880475M513711L317058J811236J30385p19667
$$ 465908229 468031079 472643942 478869647 484750122 489263833 492580891 494392127 494522512 493802845
858.7D93802845j234710k249837l003478l195971l851205m733950m826784m661471
$$ 493802845 492568135 490318298 487314820 484118849 480267644 475533694 470706910 466045439
875D66045439m760682m299790l250182k493202j830221q67515m28796q81523j355350
$$ 466045439 461284757 456984967 453734785 451241583 449411362 448543847 448115051 447233528 445878178
893.3D45878178j649201k206683k575875k303004j975268j745999j001239k0712M87327
$$ 445878178 444228977 442022294 439446419 437143415 435168147 433422148 432420909 432400197 432887524
911.7D32887524P55757Q49516N8263j443684k777517l975212n267978o127328o440967
$$ 432887524 433643281 434492797 434551060 433107376 430329859 426354647 421086669 414959341 408518374
930D08518374o845206p328451p499873p660121p991731q012355p602691p175356o796301
$$ 408518374 401673168 394344717 386844844 379184723 371192992 363180637 355577946 348402590 341606289
948.4C41606289o367862o209374o455093o653845o649226o667406o509274n917192
$$ 341606289 335238427 329029053 322573960 315920115 309270889 302603483 296094209 290177017
964.7B90177017n200535m650473m117519l619194l411055l359973l177881l008276
$$ 290177017 284976482 280326009 276208490 272589296 269178241 265818268 262640387 259632111
981B59632111k974719k851010k646982k565936k516090k401427k396300k508149k491429
$$ 259632111 256657392 253806382 251159400 248593464 246077374 243675947 241279647 238771498 236280069
999.4B36280069k391458k399817k416447k314523k195626k083093j809269j446754
$$ 236280069 233888611 231488794 229072347 226757824 224562198 222479105 220669836 219223082
1015.7B19223082j195922r84937p51511o47902o52641n84185m67643m23298l89695
$$ 219223082 218027160 217042223 216290712 215642810 214990169 214405984 213938341 213515043 213125348
1034.1B13125348l03388l37094n05596o34149p14421p86752p88152o97881o08325n31524
$$ 213125348 212821960 212484866 211979270 211345121 210630700 209843948 209055796 208357915 207749590 207218066
1054.5B07218066l81306k20135j70827j07065N559J3604o199J18807L44456N71295
$$ 207218066 206836760 206616625 206445798 206338733 206344292 206357896 206351697 206470504 206814960 207386255
1074.8B07386255Q54567J213953J553818J834095K110511K322137K458379K677783
$$ 207386255 208240822 209454775 211008593 212842688 214953199 217275336 219733715 222411498
1091.2B22411498K949253L116653L196284L274992L259942L049940K749368K428264
$$ 222411498 225360751 228477404 231673688 234948680 238208622 241258562 244007930 246436194
1107.5B46436194J979053J456871J076401Q42899O97910P21395Q79139J006305J092017
$$ 246436194 248415247 249872118 250948519 251791418 252489328 253210723 254089862 255096167 256188184
1125.8B56188184J157999J092345P89284L24190j53869n55486p41154o26773l11702
$$ 256188184 257346183 258438528 259227812 259552002 259398133 258842647 258101493 257474720 257163018
1144.2B57163018J12265O71685J303762J857609K319991K761871L146917L441035L731460
$$ 257163018 257275283 257946968 259250730 261108339 263428330 266190201 269337118 272778153 276509613
1162.6B76509613M045486M294873M502683M804224N162895N507529N921930O440848
$$ 276509613 280555099 284849972 289352655 294156879 299319774 304827303 310749233 317190081
1178.9C17190081O954491P401288P806241Q043557P949293P589519P033676O220609
$$ 317190081 324144572 331545860 339352101 347395658 355344951 362934470 369968146 376188755
1195.2C76188755N243182M283786L371656K499431J795143J312167R19878O00964M10974
$$ 376188755 381431937 385715723 389087379 391586810 393381953 394694120 395613998 396214962 396625936
1213.5C96625936K43396N8651j8835l5733j20640k05905k30044l22848n20885o58184
$$ 396625936 396869332 396927983 396909148 396873415 396752775 396546870 396316826 395993978 395473093 394814909
1233.9C94814909o98537p27058o97940n48870m00781l26812k15859r2119o5088j3679
$$ 394814909 394116372 393389314 392691374 392142504 391741723 391414911 391199052 391106933 391041845 391028166
1254.3C91028166J68115L92645O62059J033872J407326J639246J728386J718849J574755
$$ 391028166 391196281 391588926 392250985 393284857 394692183 396331429 398059815 399778664 401353419
1272.7D01353419J295268R79334O60122K92569l0666k41399m70102p48068r16004r54092
$$ 401353419 402648687 403628021 404288143 404580712 404550046 404308647 403838545 403090477 402174473 401220381
1293.1D01220381r51767q36968n83202l68446k74747k22952k20179k97815l41147k45184
$$ 401220381 400268614 399431646 398848444 398479998 398205251 397982299 397762120 397464305 397123158 396877974
1313.5C96877974j35660q9437M1932J63645N9634j56164l38763n75095q45194j007140
$$ 396877974 396742314 396652877 396694809 396858454 396918088 396761924 396423161 395848066 395002872 393995732
1333.9C93995732j122683j245529j167059q56399o28889m77254k53558j04726j79708
$$ 393995732 392873049 391627520 390460461 389604062 388975173 388497919 388244361 388139635 387959927
1352.2C87959927l48478n06073p84845j175165j422137j411259j439810j517296j364320
$$ 387959927 387611449 387105376 386320531 385145366 383723229 382311970 380872160 379354864 377990544
1370.6C77990544j140297q29935k75045J45614K62856L67463O60896R61364Q53508
$$ 377990544 376850247 376020312 375745267 375890881 376153737 376521200 377182096 378143460 378996968
1388.9C78996968L60310k64585q80301j202851j429260j684010j955271k230435k277732
$$ 378996968 379357278 379092693 378212392 377009541 375580281 373896271 371941000 369710565 367432833
1407.3C67432833k291739k307505k131223j926810j856893j591027r43482m57793q0705
$$ 367432833 365141094 362833589 360702366 358775556 356918663 355327636 354384154 353926361 353845656
1425.7C53845656L08067O45607J010329J292318J704842K171546K141535K068043J883179
$$ 353845656 354153723 354799330 355809659 357101977 358806819 360978365 363119900 365187943 367071122
1444C67071122J620322J540155J455307J236856J158118J700193K751857K923011K939612
$$ 367071122 368691444 370231599 371686906 372923762 374081880 375782073 378533930 381456941 384396553
1462.4C84396553L637612M247308M172593M423678N707681O526232O414771O241143
$$ 384396553 388034165 392281473 396454066 400877744 406585425 413111657 419526428 425767571
1478.7D25767571O217658O349474O118715N928308O338418O728649N790531N086214
$$ 425767571 431985229 438334703 444453418 450381726 456720144 463448793 469239324 474325538
1495D74325538N479693N436987M531622L575653L366112M263759M148304L425360L057242
$$ 474325538 479805231 485242218 489773840 493349493 496715605 500979364 505127668 508553028 511610270
1513.4E11610270K680122K646387K603292K583385K466619K229989K053797J557767
$$ 511610270 514290392 516936779 519540071 522123456 524590075 526820064 528873861 530431628
1529.7E30431628J079142R35734P34985O8545o39379o81400n02468p09891j159906
$$ 530431628 531510770 532446504 533181489 533250034 532610655 531929255 531426787 530716896 529556990
1548E29556990j838744k262175k452552k769590m078746m529953k874851l356934m462540
$$ 529556990 527718246 525456071 523003519 520233929 516155183 511625230 508750379 505393445 500930905
1566.4E00930905n506634o771356o613970p384479j0106742j0011405r112209r840310
$$ 500930905 495424271 488652915 482038945 474654466 464547724 454536319 445424110 435583800
1582.7D35583800j0301888j0217607r785056r163380q467793p663220o620556n641878
$$ 435583800 425281912 415064305 405279249 396115869 387648076 379984856 373364300 367722422
1599C67722422m846811l943682l023148k335995j700401j039654o75083m69982M3183
$$ 367722422 362875611 358931929 355908781 353572786 351872385 350832731 350157648 349687666 349730849
1617.4C49730849N61893O40363Q30084J056731J048982J077115J152724J298309J860708
$$ 349730849 350292742 350933105 351763189 352819920 353868902 354946017 356098741 357397050 359257758
1635.7C59257758K386599K301217K136111K042621K570063L202766K630800K899409
$$ 359257758 361644357 363945574 366081685 368124306 370694369 373897135 376527935 379427344
1652C79427344M607796M017800L275812L530026M069745M297704L929197M219383M957617
$$ 379427344 384035140 388052940 391328752 394858778 398928523 403226227 407155424 411374807 416332424
1670.4D16332424M749357N008519N546242N019993M532277M911095O445825O263376
$$ 416332424 421081781 426090300 431636542 436656535 441188812 446099907 452545732 458809108
1686.7D58809108N306094N209953M583061M486263M719197M396022M624873L958613
$$ 458809108 464115202 469325155 473908216 478394479 483113676 487509698 492134571 496093184
1703D96093184L146201K983153K621412K088964J489759J085341J380324J924932J966775
$$ 496093184 499239385 502222538 504843950 506932914 508422673 509508014 510888338 512813270 514780045
1721.4E14780045J991629K217174K310693K458990K660155L259480L860950L561974
$$ 514780045 516771674 518988848 521299541 523758531 526418686 529678166 533539116 537101090
1737.7E37101090L597140L807068L854811L965676M054248M461170M949748M559875
$$ 537101090 540698230 544505298 548360109 552325785 556380033 560841203 565790951 570350826
1754E70350826M089176L999114L770650L669083L448606L022253K661228K349735K520442
$$ 570350826 574440002 578439116 582209766 585878849 589327455 592349708 595010936 597360671 599881113
1772.4E99881113K880573K617061K239525K189458K198398K084195K045930J884878
$$ 599881113 602761686 605378747 607618272 609807730 612006128 614090323 616136253 618021131
1788.7F18021131J543402J697004K093315J943886J599908J634539J866221J765549
$$ 618021131 619564533 621261537 623354852 625298738 626898646 628533185 630399406 632164955
1805F32164955J542926J452446J450479J452744J447797J405418J323402J179218J038670
$$ 632164955 633707881 635160327 636610806 638063550 639511347 640916765 642240167 643419385 644458055
1823.4F44458055J040757J017332J029134J296759J333594J077175J005948R77278
$$ 644458055 645498812 646516144 647545278 648842037 650175631 651252806 652258754 653236032
1839.7F53236032P15792O01291R77338J188993J083672J026631R40024Q28386Q19385
$$ 653236032 653951824 654553115 655530453 656719446 657803118 658829749 659769773 660598159 661417544
1858F61417544Q89420Q71182P61866N95749N34713Q60274J138926J026451P79271O75380
$$ 661417544 662306964 663178146 663940012 664535761 665070474 665930748 667069674 668096125 668875396 669550776
1878.4F69550776P00474O92547O39677N99622N43058N75602O63281O40035O08801N85914
$$ 669550776 670251250 670943797 671583474 672183096 672726154 673301756 673965037 674605072 675213873 675799787
1898.8F75799787N78940N68986N04374M45545M77851N47468N15819M09424L37422L96431
$$ 675799787 676378727 676947713 677452087 677897632 678375483 678922951 679438770 679848194 680185616 680582047
1919.2F80582047M31716M59671N32269M50254L45528L44276L07680K74062L28243K42471
$$ 680582047 681013763 681473434 682005703 682455957 682801485 683145761 683453441 683727503 684055746 684298217
1939.6F84298217O2347J75953L83973L19719K36392K73824K29657J44600J75477K32219
$$ 684298217 684360564 684536517 684920490 685240209 685476601 685750425 685980082 686124682 686300159 686532378
1960F86532378J79887J10924J09375J44243J52409J63853J79768J10388P7068J35601
$$ 686532378 686712265 686823189 686932564 687076807 687229216 687393069 687572837 687683225 687760293 687895894
1980.4F87895894J26422N1915O2466Q6129K2113M2081J67787J37210J0252K6643O9439
$$ 687895894 688022316 688074231 688136697 688222826 688244939 688287020 688454807 688592017 688602269 688628912 688698351
2002.8F88698351k3067j08003o0678n9843j36375j33693j06633j61231j83701j18554
$$ 688698351 688675284 688567281 688506603 688446760 688310385 688176692 688070059 687908828 687725127 687606573
2023.2F87606573j71840k82288k18451j21534j78754k13623j43170j69337k41637j52827
$$ 687606573 687434733 687152445 686933994 686812460 686633706 686420083 686276913 686107576 685865939 685713112
2043.6F85713112p8976j78098j82510o7830q1003j43587n7161J4663o3897m7743Q8930
$$ 685713112 685634136 685456038 685273528 685205698 685124695 684981108 684923947 684938610 684874713 684826970 684915900
2066.1F84915900P4208r894Q5950J44183K3008J8477J33634R7096L5703J28090J25170
$$ 684915900 684990108 684980214 685066164 685210347 685233355 685251832 685385466 685482562 685518265 685646355 685771525
2088.5F85771525j3292K205J07587M1902l1769O7055J00136J788M589N6923k2114m7504
$$ 685771525 685758233 685760438 685868025 685909927 685878158 685945213 686045349 686047137 686051726 686108649 686086535 686039031
2113F86039031O2108O8008o020N5552J25945K9504k4915Q5652J23024N0843J02341
$$ 686039031 686101139 686169147 686163127 686218679 686344624 686374128 686349213 686434865 686557889 686608732 686711073
2135.4F86711073J76907J00910P0930J81973K08616J38521K01881L03507K61247K31981
$$ 686711073 686887980 686988890 687059820 687241793 687450409 687588930 687790811 688094318 688355565 688587546
2155.8F88587546L08872L18825K90632L85344M49121L74675L93987N31971N17607M13537
$$ 688587546 688896418 689215243 689505875 689891219 690340340 690715015 691109002 691640973 692158580 692572117
2176.2F92572117M61340N20706M37975M32491N43952N19693M34399N03659N63323M63903
$$ 692572117 693033457 693554163 693992138 694424629 694968581 695488274 695922673 696426332 696989655 697453558
2196.6F97453558M53949N63920N18382M41491N39422N71132M67062M97639N98788N26369
$$ 697453558 697907507 698471427 698989809 699431300 699970722 700541854 701008916 701506555 702105343 702631712
2217G02631712M37796N36203N80311M81248N25356O39915N54025M50850N30064N66363
$$ 702631712 703069508 703605711 704186022 704667270 705192626 705832541 706386566 706837416 707367480 707933843
2237.4G07933843M88579N01752N43297M66048M32551N05269M68910L64482M24623N07951
$$ 707933843 708422422 708924174 709467471 709933519 710366070 710871339 711340249 711704731 712129354 712637305
2257.8G12637305L98219L43025M51624M36008L36587L97683M55200L52204L29435M39405
$$ 712637305 713035524 713378549 713830173 714266181 714602768 715000451 715455651 715807855 716137290 716576695
2278.2G16576695M24386L24785L57628L80159K63035K19762L16978L12447J95861K23398
$$ 716576695 717001081 717325866 717683494 718063653 718326688 718546450 718863428 719175875 719371736 719595134
2298.6G19595134K92182K02179J55807K28286J70528O6698J34408J81854N9188l6836
$$ 719595134 719887316 720089495 720245302 720473588 720644116 720710814 720845222 721027076 721086264 721049428
2319G21049428n543Q106K8610J08004R0539k0325k3961K3603l9219p1764K2828L5405
$$ 721049428 721043885 721051991 721080601 721188605 721279144 721258819 721234858 721258461 721219242 721147478 721170306 721205711
2343.5G21205711L4690K66969L26396O437k99692k23995j13606j56701k4497J34349
$$ 721205711 721240401 721507370 721833766 721840203 721540511 721316516 721202910 721046209 721021712 721156061
2363.8G21156061O6340J1325J61767K29299J28567J80900L03864K28107J25409J42037
$$ 721156061 721222401 721233726 721395493 721624792 721753359 721934259 722238123 722466230 722591639 722733676
2384.2G22733676N5790j23858j43468j05679k02895k52902j76788k22683l46004l05057
$$ 722733676 722789466 722665608 722522140 722416461 722213566 721960664 721783876 721561193 721215189 720910132
2404.6G20910132k41339l36707l72589k70187k88308l86596l62515l69847m80652m64618
$$ 720910132 720668793 720332086 719959497 719689310 719401002 719014406 718651891 718282044 717801392 717336774
2425G17336774l79682m62472n71549n02467m68791n97715o23942n31971n65648o31154
$$ 717336774 716957092 716494620 715923071 715420604 714951813 714354098 713730156 713198185 712632537 712001383
2445.4G12001383n68449n64814o73830o71268n95569o54757p23601o59764o37829p00951
$$ 712001383 711432934 710868120 710194290 709523022 708927453 708272696 707549095 706889331 706251502 705550551
2465.8G05550551o89745o59704p31230p60197o72341o58750p51317p43925o71804p07030
$$ 705550551 704860806 704201102 703469872 702709675 702037334 701378584 700627267 699883342 699211538 698504508
2486.2F98504508p20323o38306o51836p56025p25568o26206o56665o97493o57916o71923
$$ 698504508 697784185 697145879 696494043 695738018 695012450 694386244 693729579 693032086 692374170 691702247
2506.6F91702247p17342o62804o07967o60539o89447o22749o16312o74606o30438n59688
$$ 691702247 690984905 690322101 689714134 689053595 688364148 687741399 687125087 686450481 685820043 685260355
2527F85260355o01649o33657n77211n99981o69658o01649n27024n80967n95867n30005
$$ 685260355 684658706 684025049 683447838 682847857 682178199 681576550 681049526 680468559 679872692 679342687
2547.4F79342687n71132o40809n58078m94540n79536o19292n88179o39677o66142n67495
$$ 679342687 678771555 678130746 677572668 677078128 676498592 675879300 675291121 674651444 673985302 673417807
2567.8F73417807n45025o65605p05183o51717o95825p60674p05958p04646q25107q38160
$$ 673417807 672872782 672207177 671501994 670850277 670154452 669393778 668687820 667983174 667158067 666319907
2588.2F66319907p68483q28445r09030q63970q76903r79483r66072r25065j009345
$$ 666319907 665551424 664722979 663813949 662949979 662073076 661093593 660127521 659202456 658193111
2606.6F58193111j061081j016140j056254j160682j160979j143634j233638j288533
$$ 658193111 657132030 656115890 655059636 653898954 652737975 651594341 650360703 649072170
2622.9F49072170j243531j284659j394213j395404j389980j480222j501262j443625
$$ 649072170 647828639 646543980 645149767 643754363 642364383 640884161 639382899 637939274
2639.2F37939274j495063j568556j515627j508534j599848j584887j512111j549005
$$ 637939274 636444211 634875655 633360028 631851494 630251646 628666759 627154648 625605643
2655.5F25605643j564563j481652j486242j537978j464367j403094j450777j429379
$$ 625605643 624041080 622559428 621073186 619535208 618070841 616667747 615216970 613787591
2671.8F13787591j341998j357913j382768j287401j214445j233339j212895j149118
$$ 613787591 612445593 611087680 609704912 608417511 607203066 605969727 604756832 603607714
2688.1F03607714j141488j141847j082241j052857j082003j053750j003802j038790
$$ 603607714 602466226 601324379 600242138 599189281 598107278 597053528 596049726 595010936
2704.5E95010936j064539j004696r71913r90748r69053r36746r54986r84251r68933
$$ 595010936 593946397 592941701 591969788 590979040 590009987 589073241 588118255 587134004 586165071
2722.8E86165071r41158r43363r23395q80778q95082r12130q53002q07643q17120q15750
$$ 586165071 585223913 584280550 583357155 582476377 581581295 580669165 579816163 579008520 578191400 577375650
2743.2E77375650q40187r20832r53734r17494r27329r95219j025498j020491j053274
$$ 577375650 576535463 575614631 574660897 573743403 572816074 571820855 570795357 569774866 568721592
2761.6E68721592j101970j125574j170397j236737j264632j271367j311183j361787
$$ 568721592 567619622 566494048 565323651 564086914 562822282 561550915 560239732 558877945
2777.9E58877945j388907j425505j466453j482785j525283j611531j669526j682460
$$ 558877945 557489038 556063533 554597080 553114295 551589012 549977481 548307955 546625495
2794.2E46625495j714408j778543j819134j853526j935124k013684k056896k123833
$$ 546625495 544911087 543132544 541313410 539459884 537524760 535511076 533454180 531330347
2810.5E31330347k212107k265930k318859k428592k544343k623320k723038k845526
$$ 531330347 529118240 526852310 524533451 522104859 519560516 516937196 514214158 511368632
2826.8E11368632k917647k970576l065229l123551l070176k975136k906859k862602
$$ 511368632 508450985 505480409 502415180 499291629 496221453 493246317 490339458 487476856
2843.1D87476856k863706k907812k919406k888471k920508l027439l116221l206908
$$ 487476856 484613150 481705338 478785932 475897461 472976953 469949514 466833293 463626385
2859.5D63626385l346533l449052l464103l466517l417909l239930l025859k836287
$$ 463626385 460279852 456830800 453366697 449900180 446482271 443242341 440216482 437380195
2875.8D37380195k606035k324909k078354j913488j767814j623064j511544j378149
$$ 437380195 434774160 432449251 430370897 428457409 426689595 425066531 423554987 422176838
2892.1D22176838j237482j195073j200467j144767j097381j127363j171797j200497
$$ 422176838 420939356 419744283 418543816 417399049 416301668 415174305 414002508 412802011
2908.4D12802011j249403j318157j350909j331270j275390j158804r88334q13842o13123
$$ 412802011 411552608 410234451 408883542 407552272 406276882 405118078 404129744 403315902 402702779
2926.8D02702779l66271j06931J92046N78493J028687J487672J943022K400458K814025
$$ 402702779 402336508 402229577 402421623 403000116 404028803 405516475 407459497 409859955 412673980
2945.1D12673980L136307L429294L727615L926843M010439M060924M059911L958523
$$ 412673980 415810287 419239581 422967196 426894039 430904478 434965402 439025313 442983836
2961.4D42983836L801346L614127L364683L099113K909929K792895K689898K630233
$$ 442983836 446785182 450399309 453763992 456863105 459773034 462565929 465255827 467886060
2977.8D67886060K628327K557456K397061K230316K026141J796991J573204J305908
$$ 467886060 470514387 473071843 475468904 477699220 479725361 481522352 483095556 484401464
2994.1D84401464J016707P45088M93645K20329p6384k72989m05252o19262q76934j096963
$$ 484401464 485418171 486163259 486656904 486877233 486800849 486527860 486122608 485503346 484626412 483529449
3014.5D83529449j288504j424640j479566j559526j729965j860440j875579j883179
$$ 483529449 482240945 480816305 479336739 477777213 476047248 474186808 472311229 470428050
3030.8D70428050j922459j989961k082109k088755k041936k100945k229154k283096
$$ 470428050 468505591 466515630 464433521 462344766 460302830 458201885 455972731 453689635
3047.1D53689635k241641k223731k261191k271056k309859k365053k298146k196998
$$ 453689635 451447994 449224263 446963072 444692016 442382157 440017104 437718958 435521960
3063.4D35521960k205252k276481k331167k348691k301246k179295k110183k216280
$$ 435521960 433316708 431040227 428709060 426360369 424059123 421879828 419769645 417553365
3079.7D17553365k333700k302349k250314k244323k249569k286434k296001k220094
$$ 417553365 415219665 412917316 410667002 408422679 406173110 403886676 401590675 399370581
3096C99370581k129614k133877k196908k169072k062500k042442k110601k064794j946807
$$ 399370581 397240967 395107090 392910182 390741110 388678610 386636168 384525567 382460773 380513966
3114.4C80513966j958907k041429k126723k200425k146274j994163j934468j992256
$$ 380513966 378555059 376513630 374386907 372186482 370040208 368046045 366111577 364119321
3130.7C64119321k006143j917720j827031j816184j896560j980424j960516j849413
$$ 364119321 362113178 360195458 358368427 356552243 354655683 352675259 350714743 348865330
3147C48865330j743972j715809j755744j820535j843065j796842j736998j713127j708269
$$ 348865330 347121358 345405549 343649805 341829270 339986205 338189363 336452365 334739238 333030969
3165.4C33030969j686394j662702j647591j619429j593381j611531j618147j569867
$$ 333030969 331344575 329681873 328034282 326414853 324821472 323209941 321591794 320021927
3181.7C20021927j526087j524180j526952j504094j489937j490503j481653j445919
$$ 320021927 318495840 316971660 315444708 313940614 312450677 310960174 309478521 308032602
3198C08032602j405954j390130j368284j339227j343995j358956j336485j294673j271039
$$ 308032602 306626648 305236518 303868234 302529007 301185012 299826056 298489571 297194898 295923859
3216.4B95923859j256108j224041j212299j218289j195252j155436j109600j072407
$$ 295923859 294667751 293443710 292231411 291013122 289817870 288662434 287552834 286480427
3232.7B86480427j088411j116812j089633j051783j025200r83715r57608r45837q97824
$$ 286480427 285392016 284275204 283185571 282133788 281108588 280124873 279167265 278221428 277323604
3251.1B77323604q47787q49098q61228q40246q02010p86484p84516p45416o94364p17819
$$ 277323604 276475817 275626719 274765491 273925245 273123235 272336751 271552235 270806819 270112455 269394636
3271.4B69394636p72327p89255p97123p68184p06017p05690p40021p10964o53655o58571
$$ 269394636 268622309 267833054 267035931 266267747 265561730 264856040 264116019 263405055 262751400 262092829
3291.8B62092829p13587p62880q05825q08328p36982o72907p18057q46803r39339r56536
$$ 262092829 261379242 260616362 259810537 259002209 258265227 257592320 256874263 256027460 255088121 254131585
3312.2B54131585r11981q44657q36790q66860q77782r05082r66147r79542r26078r22426
$$ 254131585 253219604 252374947 251538157 250671297 249793515 248888433 247922286 246942744 246016666 245094240
3332.6B45094240r45121r11206r26167j008943j037180j010075r62168r15692r64820
$$ 245094240 244149119 243237913 242311746 241302803 240265623 239255548 238293380 237377688 236412868
3351B36412868j087189j119956j019761r19983r31293r46983q57592p97570q98853
$$ 236412868 235325679 234205723 233185962 232265979 231334686 230387703 229530111 228732541 227833688
3369.3B27833688j069009j071468r07704q03367p85127p90104p71254o98269n60567
$$ 227833688 226764679 225693211 224785507 223982140 223197013 222406909 221635655 220937386 220376819
3387.7B20376819m27618m97818o89164o64026m24161l05131m70147o77004o23942m34950
$$ 220376819 219949201 219451383 218762219 218098193 217674032 217368901 216898754 216221750 215597808 215162858
3408.1B15162858l50251l71188m24952m33266l44977k54154k29478j83284p6681J3008
$$ 215162858 214812607 214441419 214016467 213583201 213238224 212984070 212754592 212571308 212494627 212507635
3428.5B12507635m500J4886J16572M9144j44914j62944R239J83061K39357J94326K11239
$$ 212507635 212503135 212518021 212634593 212683737 212538823 212375879 212385118 212568179 212807536 213001862 213213101
3450.9B13213101K68668K93925L72187M72024M24534L77759N44191O73279N17308K69667
$$ 213213101 213481769 213775694 214147881 214619905 215044439 215422198 215966389 216639668 217156976 217426643
3471.3B17426643K74002M50313O03646O41838N15744M69625O20574O90892O28814O40691
$$ 217426643 217700645 218150958 218754604 219396442 219912186 220381811 221002385 221693277 222322091 222962782
3491.7B22962782P06687P68811P81089P85023P96109O94946O33195P67350R56357J075983
$$ 222962782 223669469 224438280 225219369 226004392 226800501 227495447 228128642 228895992 229852349 230928332
3512.1B30928332J024782Q60527Q23707R66996J164555J132712R62794J004592J188948
$$ 230928332 231953114 232813641 233637348 234604344 235768899 236901611 237864405 238868997 240057945
3530.5B40057945J328707J408473J383692J289472J368194J536564J546099J413912
$$ 240057945 241386652 242795125 244178817 245468289 246836483 248373047 249919146 251333058
3546.8B51333058J385540J481205J553357J624017J741440J849174J835018J707256
$$ 251333058 252718598 254199803 255753160 257377177 259118617 260967791 262802809 264510065
3563.1B64510065J725585K122104K424896K323001K222330K313107K455443K562702
$$ 264510065 266235650 268357754 270782650 273105651 275327981 277641088 280096531 282659233
3579.4B82659233K620250K609163K613574K727092K913624K940207K943457L106326
$$ 282659233 285279483 287888646 290502220 293229312 296142936 299083143 302026600 305132926
3595.7C05132926L346651L443033L389746L323912L282965L401756L570855L677040
$$ 305132926 308479577 311922610 315312356 318636268 321919233 325320989 328891844 332568884
3612.1C32568884L762036L737271L859371M208476M144936L774852L601074M035354
$$ 332568884 336330920 340068191 343927562 348136038 352280974 356055826 359656900 363692254
3628.4C63692254M664570M539668M396022M374534M306882M280925M182011L980547
$$ 363692254 368356824 372896492 377292514 381667048 385973930 390254855 394436866 398417413
3644.7C98417413L969670M516512N004406M679471M383534M588127M621059M274786
$$ 398417413 402387083 406903595 411908001 416587472 420971006 425559133 430180192 434454978
3661D34454978L997355L852546L602893L443718L659606L561228L317475L616751L759652
$$ 434454978 438452333 442304879 445907772 449351490 453011096 456572324 459889799 463506550 467266202
3679.4D67266202L517628L245741K968877K650977K399593K556324K738118K600015
$$ 467266202 470783830 474029571 476998448 479649425 482049018 484605342 487343460 489943475
3695.7D89943475K353966K113849J989841K121240K159447J854956J499772J558959
$$ 489943475 492297441 494411290 496401131 498522371 500681818 502536774 504036546 505595505
3712E05595505K097607K207398J834452J470566J318872J359284J446068J571358J430869
$$ 505595505 507693112 509900510 511734962 513205528 514524400 515883684 517329752 518901110 520331979
3730.3E20331979J051307R17077J262128J689553J667440R53436L68953J118898J319945
$$ 520331979 521383286 522300363 523562491 525252044 526919484 527872920 528241873 529360771 530680716
3748.7E30680716P32422J135051J739860J483977J035690J140296J262367R59695Q09311
$$ 530680716 531413138 532548189 534288049 535772026 536807716 537948012 539210379 540170074 540979385
3767.1E40979385Q19505R51647J205385J161397Q89122O64652P93755R05215Q18909
$$ 540979385 541798890 542750537 543955922 545117319 546006441 546671093 547464848 548370063 549188972
3785.4E49188972Q95619R49204Q89063P25388M82798N94437N38349K42412Q38995R91345
$$ 549188972 550084591 551033795 551922858 552648246 553131044 553725481 554263830 554506242 555345237 556336582
3805.8E56336582O60658R94861J116812N60284P4863M19915M07696L91721J027167
$$ 556336582 556997240 557992101 559108913 559669197 559744060 560163975 560571671 560963392 561990559
3824.2E61990559R66251O95407N93841M89176N83470L55661J4603M41014Q85308R31740
$$ 561990559 562956810 563652217 564246058 564735234 565318704 565674365 565688968 566129982 567015290 567947030
3844.6E67947030R31203Q12054K13683q92282l70025J341998J411438P01130J42932
$$ 567947030 568878233 569690287 569903970 569011688 568641663 569983661 571395099 572096229 572239161
3862.9E72239161J92284N42522K83420J49131N29170P25448P39455K85506J24753M67539
$$ 572239161 572431445 572973967 573257387 573406518 573935688 574661136 575400591 575686097 575810850 576278389
3883.3E76278389L03208M04597N04493R5249K91049O85752L45349j78814k23696N0902
$$ 576278389 576581597 576986194 577490687 577585936 577876985 578562737 578908086 578729272 578505576 578556478
3903.7E78556478N01573Q23915P01845M30405K10941j3113l4511K01106K69115J34051
$$ 578556478 579058051 579881966 580583811 581014216 581225157 581212044 581177533 581378639 581647754 581781805
3924.1E81781805J60217K30431R7573P5281L03626L70741K23517O9022j8715J04010
$$ 581781805 581942022 582172453 582270026 582345307 582648933 583019674 583243191 583312213 583293498 583397508
3944.5E83397508K01225Q6129J16527K68578K51472J41382R8348J05858J40667J76191
$$ 583397508 583598733 583684862 583801389 584069967 584321439 584462821 584561169 584667027 584807694 584983885
3964.9E84983885J68085J24991P2360O1632J23322J87099J46627J13308J49727J26303
$$ 584983885 585151970 585276961 585349321 585410953 585534275 585721374 585868001 585981309 586131036 586257339
3985.3E86257339P4088N3346O0380J12712J80006K12312
$$ 586257339 586331427 586384773 586445153 586557865 586737871 586950183
3997.5E86950183
$$ 586950183
##END=$$ End of the data block
