##TITLE=Goma B $$ Begin of the data block
##JCAMP-DX=5.00 $$ ACD/SpecManager v 10.08
##SPECTROMETER/DATA SYSTEM=Alpha
##DATE=21 Oct 2014 10:25:42
##DATA TYPE=INFRARED SPECTRUM
##DATA CLASS=XYDATA
##ORIGIN=
##OWNER=
##NPOINTS=1765
##FIRSTX=399.76428223
##LASTX=3997.64306641
##MAXX=3997.64306641
##MINX=399.76428223
##MAXY=0.79003072
##MINY=0.46810189
##XFACTOR=1.0000000000
##YFACTOR=1.000000000000000e-9
##FIRSTY=0.73242277
##DELTAX=2.03961372
##XUNITS=1/CM
##YUNITS=ARBITRARY UNITS
##XYDATA=(X++(Y..Y))
399.8 732422769 731643260 732651889 732182980 729960859 729159474 730328441 730517864 728952110 728368819
418.1 728368819 729815185 729582727 727062762 725626469 726647377 727103710 725123405 723357201 723942935
436.5 723942935 724634826 723303854 721732974 722022891 722574592 721298635 719789922 720282853 721342027
454.8 721342027 720473170 718731284 718782365 719453394 718384743 716562271 716340601 717145979 716523170
473.2 716523170 714797676 714438856 715460002 715646684 714562893 714191318 715047240 715359211 714508295
491.5 714508295 713986397 714429736 714426935 713400841 712668598 712877631 712856829 711838961 710779428 710494578
511.9 710494578 710294724 709488750 708526611 708103240 707959056 707410514 706526935 705941677 705777466 705600262
532.3 705600262 705234289 704896390 704569995 704137146 703673065 703179181 702712536 702346921 702081561 701943278
552.7 701943278 701862812 701992750 702490628 702910781 702903926 702901185 703299582 703668594 703464270 703046381 703147769
575.2 703147769 703533888 703285873 702668011 702833712 703509629 703422606 702590585 702237606 702653825 702532113
595.6 702532113 701382101 700705767 701326311 701817334 701211154 700782895 701666057 702743769 702610373
613.9 702610373 702151299 703013718 704490721 704817474 704552233 705516934 707286596 707861245 707330525
632.3 707330525 707760930 709454536 710398912 710021913 710253537 711987913 713307440 712902248 712575674
650.6 712575674 713886321 715225756 714783669 713885605 714645565 716129303 716225386 715375483 716379404
669 716379404 718546331 719227016 718774915 719263196 721132576 722123563 721418023 721129417 722379565 723275542
689.4 723275542 722437203 721617222 722547352 723790348 723430216 722549736 723185897 724603236 724633753 723684967
709.8 723684967 724012494 725684881 726595819 726366580 727115989 729607701 731746554 732409120 733282030
728.1 733282030 735687435 738129675 738931179 739271522 740962982 743122101 743891656 743905187 745064259
746.5 745064259 747051954 747960031 747723639 748088419 749382138 750013649 749355435 748766899 749029756
764.9 749029756 748960018 747657299 746263325 746094942 746584654 746635973 746706367 747808039 749455392 750352323
785.3 750352323 750457287 750858009 751786888 752259493 751889527 751523674 751668274 751765013 751465678 751406729
805.6 751406729 752259254 753782511 755420446 757341862 760147810 763800919 767495513 770614803 773233056
824 773233056 775418222 776718676 776765227 776018441 775359511 775084317 774962842 775040448 775786281 777347684
844.4 777347684 779080510 780206025 780763447 781343818 781897247 781742513 780823171 779931664 779402316
862.8 779402316 778559983 776980639 775359452 774326563 773332894 771714270 770048022 769325852 769304216
881.1 769304216 768995941 768487334 768794358 769915164 770540893 770163000 769881487 770272255 770239174 768979371
901.5 768979371 767406285 766503274 765591145 763751447 761849463 761329234 761753976 761440992 760200799
919.9 760200799 759245157 758509219 756482184 752832949 749002397 745632589 741519153 736052871 730606139
938.2 730606139 726282001 722150981 717104077 711864293 707562983 703564286 698558390 692886949
954.5 692886949 687943697 683887482 679639101 675061107 671393633 669077456 666930974 664223313
970.9 664223313 661914468 660864532 660296381 659246683 658250213 658144534 658228934 657119155 654796541
989.2 654796541 652299821 649730086 646252096 641923308 637901008 634674907 631452143 627722979
1005.5 627722979 624173462 621390045 618797541 615767896 612832606 610800087 609395742 607804716
1021.8 607804716 606037378 604746401 603967130 603077054 602034152 601589203 602032423 602671146 602939904
1040.2 602939904 603136599 603601933 603944182 603681386 603119969 602860749 602801919 602413833 601720035 601192892
1060.6 601192892 600898266 600405097 599581838 598892272 598638356 598520935 598294616 598307371 598976731 600167871
1081 600167871 601500034 602994084 604931533 607248962 609582186 611845911 614282131 616927803 619497895
1099.4 619497895 621811628 624016106 626284719 628513992 630508184 632328570 634215772 636191905
1115.7 636191905 638011694 639549911 640955865 642332852 643535495 644502401 645498157 646700919 647926986
1134 647926986 648909509 649572253 650057256 650527775 650995195 651449978 652082443 653149903 654648781 656346977
1154.4 656346977 658147871 660211980 662614346 665117800 667544425 670092344 672989249 676114678
1170.7 676114678 679273665 682593763 686362386 690568447 694876254 699171543 703676403 708345592
1187.1 708345592 712668538 716276169 719329953 722035408 724178493 725539804 726438820 727330685 728130221
1205.4 728130221 728476048 728469074 728527606 728620648 728347719 727702856 727154315 726881742 726508617 725864589
1225.8 725864589 725381136 725388229 725583196 725583792 725613415 726086736 726825476 727341831 727615654 727994621 728440464
1248.2 728440464 728509784 728167355 727930129 728011131 728025675 727774978 727621198 727813780 727981031 727705836
1268.6 727705836 727190733 726803243 726376951 725542963 724450409 723622501 723192275 722811162 722369790
1287 722369790 722189903 722360194 722501338 722411275 722366095 722578228 722812831 722776055 722619593 722662389 722827494
1309.4 722827494 722867191 722852647 723073304 723566592 723956048 724028111 724033713 724068463 723873079 723344922 722745776
1331.9 722745776 722332299 722042382 721651733 721096754 720515609 719970703 719357908 718658626 718032479 717540264
1352.3 717540264 717056394 716500819 716014683 715740681 715470195 714910209 714295268 713906825 713664353 713520765
1372.7 713520765 713357985 712988317 712426364 711592317 710647345 710305214 710823357 711311281 711268067 711141407
1393.1 711141407 710969090 710405111 709433317 708181322 706897736 705666125 704359531 703051805 701813579
1411.4 701813579 700673580 699816227 699381351 698980749 698303342 697881579 697846234 698038161 698534071 699170232
1431.8 699170232 699951172 701281130 702601671 703347147 704200685 705191791 706045449 706769884 707303345
1450.2 707303345 707709551 708335578 709904611 711768270 712505996 713265121 714946449 716919363 718681574
1468.5 718681574 721022725 724361956 727468193 729880214 732080162 734292388 736629903 739129007
1484.9 739129007 741968215 744946301 747261286 748765707 750557065 752885699 754523277 755388618
1501.2 755388618 756337345 758354247 760972679 761619031 761524081 761868596 762512624 763234913 764097631
1519.5 764097631 765265644 765685081 765516341 765627146 765779793 766095519 766457260 766296864 766592741
1537.9 766592741 768140912 768684149 767895818 767156899 766635060 766199112 765804648 765684783 765939236
1556.2 765939236 766637385 765864253 763615072 761688232 759963214 758005559 755449057 752426863 749254048
1574.6 749254048 745074272 739980876 734953463 729758918 724158466 718352377 712671161 707162380
1590.9 707162380 701764166 696557105 691849351 687800050 684223473 680988073 678296328 676289141
1607.2 676289141 674685597 673161447 671892583 671347558 671168149 670579135 670175850 670335472 670429647
1625.6 670429647 670252562 669963360 669930339 671031892 673364937 674857020 675513327 676639915 678488195
1643.9 678488195 681387603 684116542 685531616 688351393 692771196 694404185 695346832 697394431
1660.3 697394431 700285494 702818811 704719841 707468987 710768700 712988317 715295196 718018234
1676.6 718018234 720065415 721925259 724824309 728918433 731393218 732801259 734505117 736247182
1692.9 736247182 738919020 742094338 744839191 747605741 749173105 750450969 751971006 752980411
1709.2 752980411 753924727 755201519 756957352 759049475 760113895 760274112 760706007 761377871 762078583
1727.6 762078583 763003588 764207184 766106308 767327845 767528355 768362701 769460917 770124018 770844042
1745.9 770844042 771977365 773373961 774235964 774468243 775024712 775841475 776533008 777324140 777785003
1764.3 777785003 778131664 778764188 779584467 780627310 781143010 781027555 781096756 781496227 781914294 782311916
1784.7 782311916 782508671 782529712 783131182 784174562 784411252 784175515 784373641 784905374 785133779 785030484
1805.1 785030484 785049856 785403609 785848022 785978496 785966814 786156595 786405742 786497712 786682248 787067413
1825.5 787067413 787417233 787850380 788011849 787766814 787741363 787918687 787871301 787905276 788579583 789124370
1845.9 789124370 788935959 788680792 788662076 788774848 788872659 788920581 788992345 789082587 789132237 789291739 789745808
1868.3 789745808 790018857 789804101 789537966 789435089 789446890 789540827 789642811 789667070 789656460 789831936
1888.7 789831936 789998412 789904773 789843321 789859295 789842546 789851964 789850354 789823771 789860129 789949298 789926231 789734006
1913.2 789734006 789635420 789865136 790030718 789910376 789824843 789722025 789548755 789416611 789342940 789327681
1933.6 789327681 789279997 789125979 788978577 789052010 789159358 789009809 788769960 788629889 788580656 788520277
1954 788520277 788375676 788204610 788103163 788006485 787864327 787799180 787787795 787696481 787537098 787346721 787188709
1976.4 787188709 787121296 787047744 786886990 786724687 786675811 786668777 786616743 786519587 786366463 786232054 786103308
1998.8 786103308 785916328 785772800 785726130 785646200 785461366 785289466 785228133 785206318 785091877 784875989
2019.2 784875989 784714878 784647763 784490168 784220755 784049749 784027219 783960819 783742964 783525705 783464432
2039.6 783464432 783411086 783175349 782931268 782866597 782836318 782663405 782445014 782384753 782395959 782224357
2060 782224357 781946242 781845152 781891108 781846821 781673789 781526804 781490207 781433403 781234562 781024456 780986071
2082.5 780986071 781025410 780912399 780696511 780618012 780655801 780573606 780338824 780168891 780155122 780123472 779956162
2104.9 779956162 779799461 779794276 779808700 779686093 779519677 779475629 779503644 779420018 779258072 779215634 779278457
2127.3 779278457 779237270 779058993 778954387 779012859 779037714 778896809 778771996 778832555 778909028 778802097
2147.7 778802097 778632700 778612792 778696835 778688371 778590858 778585911 778682053 778687596 778551161 778459370 778530538 778627932
2172.2 778627932 778605521 778553843 778608263 778689325 778655827 778578758 778610528 778704643 778730273 778711796 778748930
2194.6 778748930 778827488 778838933 778772116 778758347 778851390 778925419 778889537 778834999 778870344 778931141 778903604
2217.1 778903604 778833628 778836071 778887749 778883874 778833270 778834522 778892517 778901398 778842330 778823495 778870702 778896093
2241.6 778896093 778852642 778801441 778806627 778821886 778785825 778732300 778716087 778725326 778700709 778625429 778575540 778586924
2266 778586924 778576970 778508186 778462291 778483093 778505564 778473318 778395116 778281748 778149664 778038025 777956367
2288.5 777956367 777892411 777826011 777715802 777557194 777406514 777280152 777107716 776866972 776635230 776455939
2308.9 776455939 776295841 776116788 775862932 775527239 775246620 775104225 775005758 774822474 774549067 774374545
2329.3 774374545 774390519 774335504 774111211 773909330 773850024 774049699 774717927 775391996 774781942 773099720
2349.7 773099720 771713674 771303177 771409154 771579683 771821022 772160232 772543848 772957861 773376644
2368 773376644 773785412 774139583 774370253 774481177 774496734 774401844 774206042 773960590 773712635 773498118
2388.4 773498118 773318708 773162782 773019969 772876799 772712886 772524834 772339761 772167921 772007227 771852851
2408.8 771852851 771685660 771492422 771281719 771073282 770881712 770688474 770470083 770254910 770058513 769857883
2429.2 769857883 769659340 769467294 769252717 769019663 768791318 768561482 768330514 768121064 767908990 767665923
2449.6 767665923 767420948 767188966 766965568 766752839 766535163 766306162 766072690 765821040 765542388 765272379
2470 765272379 765045464 764832973 764602423 764371097 764141858 763904929 763657391 763396382 763136804 762903452
2490.4 762903452 762691498 762461424 762212753 761973619 761736929 761481404 761199176 760926902 760703206 760503531
2510.8 760503531 760299027 760094941 759882450 759637296 759369075 759105861 758861959 758641779 758428812 758216441
2531.2 758216441 758023798 757834792 757619858 757372200 757106066 756871760 756685078 756502450 756312370 756124020
2551.6 756124020 755908549 755648375 755381048 755147696 754949570 754759431 754559398 754349709 754121244 753861427
2572 753861427 753557801 753239810 752982199 752782285 752580583 752345383 752066851 751752734 751412570 751076281
2592.4 751076281 750781178 750507236 750213742 749899089 749569595 749222755 748861313 748492062 748132646 747793138
2612.8 747793138 747445762 747059882 746661603 746275365 745871365 745440602 745005488 744579017 744169176 743740082
2633.2 743740082 743260026 742784441 742338061 741875112 741382122 740883887 740406156 739946008 739476681 738999784
2653.5 738999784 738532662 738077581 737619698 737140775 736668050 736236572 735819340 735394180 734982967 734585047
2673.9 734585047 734170794 733735204 733298659 732863307 732427776 732016504 731631756 731252909 730868876 730480075
2694.3 730480075 730103254 729740083 729377329 729014277 728654921 728300750 727959394 727603197 727208614 726824224
2714.7 726824224 726483881 726173043 725861788 725527763 725185454 724826276 724428952 724037588 723705590 723425031
2735.1 723425031 723128915 722769916 722397089 722083211 721828103 721565306 721217394 720778048 720345616 719985187
2755.5 719985187 719634473 719240725 718840122 718454003 718057573 717630506 717191577 716790199 716404736 715933621
2775.9 715933621 715384245 714852035 714335501 713806450 713305950 712851226 712369561 711799026 711188078 710606813
2796.3 710606813 710018516 709360898 708676636 708020866 707391918 706772327 706103206 705339849 704537868 703755081
2816.7 703755081 702975810 702169120 701341450 700514138 699665129 698774517 697881997 697002470 696084142 695101082
2837.1 695101082 694012523 692786992 691525578 690296590 689062774 687817991 686593235 685381770
2853.4 685381770 684138656 682883084 681619823 680266976 678835869 677395284 675944865 674545407
2869.7 674545407 673251927 671950698 670577347 669288218 668192506 667227983 666357517 665555179 664784193
2888.1 664784193 664065957 663429618 662853777 662254572 661600709 660981417 660449505 659936726 659382224 658826947
2908.5 658826947 658340514 657872736 657281339 656538486 655756056 655041575 654463530 654049993 653822124 653756618
2928.9 653756618 653728127 653744876 653956890 654412270 655099273 656035900 657189608 658421695 659608960
2947.2 659608960 660804391 662109137 663413942 664609492 665791631 667007625 668170333 669198096
2963.6 669198096 670101643 670914590 671640992 672356725 673098207 673802853 674531937 675356030 676143050 676816523
2984 676816523 677476346 678187788 678964972 679697156 680175841 680439889 680586457 680590808 680539548 680459976 680300534
3006.4 680300534 680157959 680085123 679895461 679403245 678685546 677908301 677119434 676354408 675602674 674786925
3026.8 674786925 673985958 673286259 672586858 671739578 670751035 669853270 669125259 668327153 667297781
3045.1 667297781 666161001 665113926 664115310 663065493 662044108 661018252 659911335 658847749
3061.5 658847749 657926738 657076299 656093717 654899776 653687477 652624547 651744962 650952935 650016248
3079.8 650016248 648888171 647707701 646510363 645339012 644206226 642989397 641749799 640651524
3096.1 640651524 639650822 638596535 637392461 636159480 635104775 634141445 633049846 631962657
3112.4 631962657 631086588 630225241 629137456 627817214 626372933 624990165 623789132 622692883 621570468
3130.8 621570468 620414674 619286835 618250191 617236376 616053522 614738703 613487482 612363160
3147.1 612363160 611377716 610444069 609308958 607937515 606596351 605391026 604237437 603103042 601968169
3165.5 601968169 600803733 599619865 598440230 597284555 596182227 595104575 593966961 592784047
3181.8 592784047 591637254 590500236 589320183 588145316 586999714 585836172 584675312 583544850
3198.1 583544850 582393289 581220090 580063760 578918338 577801466 576722562 575651944 574574172
3214.4 574574172 573485911 572414458 571344376 570224643 569098711 568054259 567118347 566262305 565396667
3232.8 565396667 564364195 563191652 562085569 561093450 560205638 559419513 558564067 557539403 556523085
3251.1 556523085 555698752 554967523 554137290 553262353 552451193 551675141 550931156 550277233 549728572 549121857
3271.5 549121857 548310697 547374249 546434045 545558035 544745088 543966055 543212831 542488754 541840017 541198373
3291.9 541198373 540397346 539429009 538391411 537392557 536572397 535927594 535196185 534157634 532863140
3310.3 532863140 531509221 530254960 529118001 528029859 526944458 525888324 524838567 523618817
3326.6 523618817 522205412 520801961 519497991 518287599 517170370 515979886 514582276 513083875
3342.9 513083875 511569142 510134459 508880615 507563829 505942941 504258037 502796888 501491308
3359.2 501491308 500115871 498685986 497452289 496350020 495003015 493333012 491681665 490276664
3375.5 490276664 489006907 487754107 486506283 485317528 484234482 483309060 482620090 481935591 480911881
3393.9 480911881 479805022 479070276 478519261 477628320 476385653 475298285 474567741 473952234 473305345
3412.3 473305345 472581476 471784979 471106321 470603794 470131278 469694972 469410688 469262630 469117135 469022661
3432.7 469022661 469050765 468941242 468564481 468221635 468101889 468189061 468437880 468636960 468745381 468931735
3453.1 468931735 469230086 469649613 470188051 470719904 471239030 471943706 472799897 473415017 473660022 473913252
3473.4 473913252 474418312 475115627 475907892 476596534 477140874 477790862 478566200 479290158 480005294 480872840
3493.8 480872840 481862724 482712477 483477712 484495491 485444456 485983372 486656725 487743586 488901615
3512.2 488901615 489887625 490707844 491536111 492608249 494004220 495324105 496361762 497457772 498620719
3530.6 498620719 499742597 501071930 502531648 503732860 504843771 506316602 508195281 509885788
3546.9 509885788 510999620 512206495 513777256 515169322 516498864 518119633 519655645 520828784
3563.2 520828784 522741139 525995553 528488934 529568672 530808806 532670319 534741580 536869824
3579.5 536869824 538816810 540499330 542933583 546519220 549070358 550309777 552227855 554876864
3595.8 554876864 557361424 559840381 562114954 563679457 565493405 568527281 571630895 574160755
3612.1 574160755 576337576 578136086 581173956 584917486 586475611 586330652 587433279 592515767
3628.5 592515767 597411156 598623931 599647224 601326823 603021145 604735434 605848968 606374323
3644.8 606374323 608502924 614069879 618494809 618387163 618544519 621078074 622756839 623313189 623896360
3663.1 623896360 623939991 624333858 627162993 629563272 630126119 633488238 636511564 636075377 635284066
3681.5 635284066 634469509 633919358 636062026 640385747 642171979 641492605 640850842 640712023 641462505
3699.8 641462505 643349886 644195557 643310666 642944932 644982934 648346484 648950040 647314966 646263182
3718.2 646263182 646406949 647071421 647782981 648150682 647151589 645889461 646682680 649718404 652464688
3736.5 652464688 651725769 648450077 647995651 651966035 652946830 652315676 655494034 657621503 656005085
3754.9 656005085 654729366 655581474 656082571 655295253 655177772 655792117 657006919 658079445 657519519
3773.3 657519519 656419516 656531453 657884777 658457637 658213496 658418059 658489108 658246577 657848001
3791.6 657848001 657503307 657815754 657716393 658239007 660601258 660748005 660437107 661688745 660774171
3810 660774171 658266246 657726228 659514904 660005510 661029756 663205624 662485301 661096573 660374105
3828.3 660374105 659862041 659821570 659702659 660706639 662980318 663736939 663362384 662810743 661020815
3846.7 661020815 658020973 656625807 661520898 667259455 665588081 662064254 660617232 661338091
3863 661338091 662099838 661445022 662094414 663727403 663792431 662895560 661385119 661268890 662157655 662243068
3883.4 662243068 663227916 663214445 662184179 663054824 663264632 661349952 660257876 661125183 662821949
3901.8 662821949 664556921 664963484 663665116 662363470 661596060 661089957 661472321 662470222 662691355
3920.1 662691355 662273347 662299335 662300885 661764264 661811769 662624776 662797272 662142336 661489725 661376953
3940.5 661376953 661865175 662009835 661749601 661960423 662219167 662003160 661714017 661602914 661540031 661554337
3960.9 661554337 661589980 661453128 661266804 661203146 661237359 661301732 661323071 661232710 661140203 661185086 661243260
3983.3 661243260 661122620 660914660 660830796 660862207 660892844 660887897 660824120
3997.6 660824120
##END=$$ End of the data block
