##TITLE=Goma Arabica Padrao $$ Begin of the data block
##JCAMP-DX=5.00 $$ ACD/SpecManager v 10.08
##SPECTROMETER/DATA SYSTEM=Alpha
##DATE=21 Oct 2014 10:25:42
##DATA TYPE=INFRARED SPECTRUM
##DATA CLASS=XYDATA
##ORIGIN=
##OWNER=
##NPOINTS=1765
##FIRSTX=399.76428223
##LASTX=3997.64306641
##MAXX=3997.64306641
##MINX=399.76428223
##MAXY=0.84943879
##MINY=0.47023642
##XFACTOR=1.0000000000
##YFACTOR=1.000000000000000e-9
##FIRSTY=0.66787988
##DELTAX=2.03961372
##XUNITS=1/CM
##YUNITS=ARBITRARY UNITS
##XYDATA=(X++(Y..Y))
399.8F67879879q5532R05514n22018k030492j599490J57535J063883J93000j792550
$$ 667879879 667794347 668699861 668177843 666147351 664547861 664705396 665769279 665962279 664169729
418.1F64169729k376080j48415Q85546m56572j808882j453816l5584N60522n70178
$$ 664169729 661793649 661645234 662530780 662074208 660265326 658811510 658775926 659336448 658766270
436.5F58766270j771510j301169K32339J032948K6226j510203j418829L49105J559138
$$ 658766270 656994760 655693591 655925930 656958878 656985104 655474901 654056072 654405177 655964315
454.8F55964315P54774r00448j073718J48237R50336K61784j024485j202047L159J159847
$$ 655964315 656719089 655818641 654744923 654893160 655843496 656105280 655080795 653878748 653881907 655041754
475.2F55041754Q82685l71396r71317j96219Q51870P03931n94140j565814r04262N20826
$$ 655041754 655924439 655553043 654581726 654385507 655237377 655941308 655347168 653781354 652877092 653397918
495.6F53397918O21319p90418j919746j315236K20895O11722o53326j885057j515388
$$ 653397918 654019237 653228819 651309073 649993837 650214732 650826454 650173128 648288071 646772683
514F46772683n7578N54442n89848k054870j949191l00467P18057k52008j741111j737297
$$ 646772683 646715105 647269547 646679699 644624829 642675638 642375171 643093228 642841220 641100109 639362812
534.4F39362812k37048Q96871L02971j112640j422167j82986J101076Q65400m51684
$$ 639362812 639125764 640022635 640325606 639212966 637790799 637607813 638708889 639574289 639122605
552.7F39122605r45091K38121J564562J262724k33173j067102j87814J250267J244962
$$ 639122605 638177514 638415635 639980197 641242921 641009748 639942646 639754832 641005099 642250061
571.1F42250061j18852j012265l61264R83119J293719O2942j284659j050889K81691
$$ 642250061 642131209 641118944 640757680 641740799 643034518 643097460 641812801 640761912 641043603
589.4F41043603Q32439j13666j398385j405000n1618R82046L16143j081586j299917
$$ 641043603 641876042 641762376 640363991 638958991 638907373 639889419 640205562 639123976 637824059
607.8F37824059j23978R88960P88212l75688o43194Q16107K374172K483189J340926
$$ 637824059 637700081 638689041 639477253 639101565 638458371 639274478 641648650 644131839 645472765
626.2F45472765N37813J138270K388954K685249J527547L01719N65827J944840K560377
$$ 645472765 646010578 647148848 649537802 652223051 653750598 654052317 654618144 656562984 659123361
644.5F59123361J482964o3300j80781J202404K233029J509785q5592m45843R22322
$$ 659123361 660606325 660543025 660362244 661564648 663797677 665307462 665221870 664776027 665698349
662.9F65698349K008856J372814m5896K59638J525760K712607K622128J044273n6624
$$ 665698349 667707205 669080019 669034123 669293761 670819521 673532128 676154256 677198529 677141905
681.2F77141905O59823K074003K084375L98457j097441p99775O44803J158357j37627
$$ 677141905 677801728 679875731 681960106 682358563 681261122 680461347 681106150 682264507 682126880
699.6F82126880j712680j555801J27912J231968N77927p08759o31630J194358K913951
$$ 682126880 680414200 678858399 678986311 680218279 680796206 680087447 679455817 680650175 683564126
717.9F83564126K973497J990080J783550L079653M449785M084229K150059O32286J005173
$$ 683564126 686537623 688527703 690311253 693390906 697840691 701924920 704074979 704707265 705712438
736.3G05712438K295911K327979O59823p82788m00603R97186J420260J31368j549005
$$ 705712438 708008349 710336328 710996151 710213363 709812760 710809946 712230206 712361574 710812569
754.7G10812569j814127o46055J01745r11355k668619l036559j529574K39313O56604
$$ 710812569 708998442 708352387 708454132 707542777 704874158 701837599 700308025 700547338 701203942
773G01203942K6524L7671J551270L385484L729165K480686J385509J881600L312409
$$ 701203942 701230466 701268137 702819407 706204891 709934056 712414742 713800251 715681851 718994260
791.4G18994260L763258K340734L92855j25707P51078J280010L87967q71718n84245
$$ 718994260 722757518 725098252 725491107 725365400 726116478 727396488 727784455 726912737 726328492
809.7G26328492J506865L579319L898501K810061K198339K970457L677547K353668
$$ 726328492 727835357 731414676 735313177 738123238 740321577 743292034 746969581 749323249
826G49323249p24912l219843l494084k321124j644551j894534j562715M54724L182709
$$ 749323249 748598337 745378494 741884410 739563286 737918735 736024201 734461486 734916210 738098919
844.4G38098919M518450L435433J235544K09213Q02934J233220P0214j901030k716303
$$ 738098919 742617369 746052802 747288346 747497559 748300493 749533713 749603927 747702897 744986594
862.8G44986594j828194q86738j476050l136217m045010l227949j756668j398325k362251
$$ 744986594 743158400 742271662 740795612 737659395 733614385 730386436 728629768 727231443 724869192
881.1G24869192k964139j891733p5817N56350n41985k026498k217591j082182k90334
$$ 724869192 721905053 720013320 719937503 720493853 719951868 717925370 715707779 714625597 714335263
899.5G14335263r67920k158582k093256n04851J007736R52482k42293r26256m63844
$$ 714335263 713367343 711208761 709115505 708610654 709618390 710570872 710328579 709402323 708938479
917.8G08938479N484q93176k945780m494012m406631l488421l491104m835307o151855
$$ 708938479 708943963 708050787 705105007 700610995 696204364 692715943 689224839 684389532 678237677
936.2F78237677o159008n202234m723787n425692o346166o166637m992842m240632
$$ 678237677 672078669 666876435 662152648 656726956 650380790 644214153 639221311 634980679
952.5F34980679m842043o076813o530106n765796m737258m538417m978835m999876
$$ 634980679 630138636 624061823 617531717 611765921 607028663 602490246 597511411 592511535
968.8E92511535m141629l060579k779723l455340m110992l842771k932013k414941
$$ 592511535 588369906 585309327 582529604 579074264 574963272 571120501 568188488 565773547
985.1E65773547k778828l414870l408134k712190k172530k403378l053367l300905
$$ 565773547 562994719 559579849 556171715 553459525 551286995 548883617 545830250 542529345
1001.4E42529345k828300k192319k138495k612532k832531k291620j362503q56817
$$ 542529345 539701045 537508726 535370231 532757699 529925168 527633548 526271045 525414228
1017.8E25414228j070201j421154j258373o66857k86936n15342j007140j095116o02960
$$ 525414228 524344027 522922873 521664500 520997643 520710707 520195365 519188225 518093109 517490149
1036.1E17490149j09017k42949r18925j380682j115381n25296l62456p67708j136601
$$ 517490149 517381132 517138183 516219258 514838576 513723195 513197899 512835443 512067735 510931134
1054.5E10931134r14812k49684J79231n543m25815m09663J69933P18355P40468M55082
$$ 510931134 510016322 509766638 509945869 509940326 509514511 509104848 509274781 509993136 510733604 511188686
1074.9E11188686N35548J285314K210260K581298K321720K111375K548993L367543
$$ 511188686 511724234 513009548 515219808 517801106 520122826 522234201 524783194 528150737
1091.2E28150737L751457L407478K937317L024519L544569L726125L082036K026499
$$ 528150737 531902194 535309672 538246989 541271508 544816077 548542202 551624238 553650737
1107.5E53650737J425206J576186J831770J478314O99043L62218R00268J680255J791239
$$ 553650737 555075943 556652129 558483899 559962213 560661256 561023474 561923742 563603997 565395236
1125.9E65395236J132905N14925N40376P95126N38766l29554j092076r43542J7941
$$ 565395236 566528141 567043066 567583442 568378568 568917334 568587780 567495704 566552162 566570103
1144.2E66570103Q85964J080095R55880J299799K320349L308713L510952L126204L057480
$$ 566570103 567456067 568536162 569492042 570791841 573112190 576420903 579931855 583058059 586115539
1162.6E86115539L741026M651606M965067M589379M319548M821122N798876O389201
$$ 586115539 589856565 594508171 599473238 604062617 608382165 613203287 619002163 625391364
1178.9F25391364O195188N757332N862772O477118O735622O007791M685879L725588
$$ 625391364 631586552 637343884 643206656 649683774 656419396 662427187 667113066 670838654
1195.2F70838654L524959L463328K697289J340330L99708M79460J028538J015603J91689
$$ 670838654 674363613 677826941 680524230 681864560 682264268 682743728 683772266 684787869 684979558
1213.6F84979558n83172m79519K56479O28769J05739p05362q33869k00748L19183J19
$$ 684979558 684396386 683916867 684173346 684802115 684907854 684202492 683368623 683167875 683487058 683487177
1234F83487177q30889j146912n20945K92838L31699l46422p89523l58701M93586P59721
$$ 683487177 682656288 681509376 680988431 681281269 681612968 681266546 680477023 680118322 680611908 681371629
1254.4F81371629J79649l56377K5154J055777J684189J352965O27399M94957J101315
$$ 681371629 681551278 681194901 681220055 682275832 683960021 685312986 685940385 686435342 687536657
1272.7F87536657J506507R46701j06752n64814j20938M02272J27256p95007j381099
$$ 687536657 689043164 689989865 689883113 689318299 689197361 689599633 689726889 688931882 687550783
1291.1F87550783j036048k55167P212m60863r07421o38068J19030M63725k6465p10547
$$ 687550783 686514735 686259568 686266780 685805917 684898496 684260428 684379458 684843183 684816718 684106171
1311.5F84106171p05480N066N73873L66807k99453n93186k21252K28584J3888p72059
$$ 684106171 683400691 683405757 683979630 684346437 684046984 683453798 683232546 683461130 683475018 682702959
1331.9F82702959j316131j128375n67317l25382o14166r49383p22170L8684N29050
$$ 682702959 681386828 680258453 679691136 679365754 678751588 677802205 677080035 677118719 677647769
1350.2F77647769J81616n94795q95441n11646k28941o81758j381755j562238j157164
$$ 677647769 677829385 677234590 676339149 675827503 675598562 674916804 673535049 671972811 670815647
1368.6F70815647m67837k88666p06076q13604k88009L81470O73770M78447J23143J34945
$$ 670815647 670347810 670059144 669353068 668539464 668251455 668632925 669306695 669785142 669908285 670043230
1389F70043230M77552L66211m49121j360476j704812j219093p86067j226067j888633
$$ 670043230 670520782 670886993 670437872 669077396 667372584 666153491 665367424 664141357 662252724
1407.3F62252724k065003j641094r15945o55651j281202j858652r45925K16305O13093
$$ 662252724 660187721 658546627 657630682 656975031 655693829 653835177 652889252 653105557 653718650
1425.7F53718650L67821L0040M54963J300275J760423J675904J259267J191795J555622
$$ 653718650 654086471 654116511 654571474 655871749 657632172 659308076 660567343 661759138 663314760
1444.1F63314760J804709J478613R05096P27892J042783J633883K192795K093852J887202
$$ 663314760 665119469 666598082 667503178 668231070 669273853 670907736 673100531 675194383 677081585
1462.4F77081585K358079L342032L710747L452838L400027L801883M413187M687190
$$ 677081585 679439664 682781696 686492443 689945281 693345308 697147191 701560378 706247568
1478.7G06247568M363895L810227L491342L750264M271388M259169L378332K705753
$$ 706247568 710611463 714421690 717913032 721663296 725934684 730193853 733572185 736277938
1495G36277938K853930L314018L204405K475560J549959J339376K229035K434492J875758
$$ 736277938 739131868 742445886 745650291 748125851 749675810 751015186 753244221 755678713 757554471
1513.4G57554471J124144J010716J476824J774729J457810P57575M99547R27806J152753
$$ 757554471 758678615 759689331 761166155 762940884 764398694 765156269 765655816 766583622 767736375
1531.8G67736375P74086L91900o7174p38382m15266q821n27323j081228j240730r04501
$$ 767736375 768510461 768902361 768835187 768096805 767681539 767672718 767145395 766064167 764823437 763918936
1552.2G63918936o81221j079798k927124l748119j488328j193524k140283l535033
$$ 763918936 763237715 762157917 759230793 755482674 753994346 752800822 750660539 747125506
1568.5G47125506m579961l746927l890216o070554o474078o071150o519497o620884
$$ 747125506 742545545 738798618 734908402 728837848 722363770 716292620 709773123 703152239
1584.8G03152239o725967p145941p342517o882847o093561n407214n057395m860520
$$ 703152239 696426272 689280331 681937814 675054967 668961406 663554192 658496797 653636277
1601.1F53636277m297316l292263k461672k157509j962483j553833j287044q39412
$$ 653636277 649338961 646046698 643585026 641427517 639465034 637911201 636624157 635784745
1617.4F35784745J18673L25918J20163M23610Q58903J127601J375079J530826J986206
$$ 635784745 635903418 636229336 636349499 636773109 637632012 638759613 640134692 641665518 643651724
1635.8F43651724K796352L097653L036201K790392K940178L725349L722966L615856
$$ 643651724 646448076 649545729 652581930 655372322 658312500 662037849 665760815 669376671
1652.1F69376671M190684L812372L592074L894210M110396L888249L315390L313124
$$ 669376671 673567355 677379727 680971801 684866011 688976407 692864656 696180046 699493170
1668.4F99493170L981888M020035L625989L424526L334820L421306L536284L756524
$$ 699493170 703475058 707495093 711121082 714545608 717880428 721301734 724838018 728594542
1684.7G28594542L372013K897322L106356L149211K870798K462864J886189J929880
$$ 728594542 731966555 734863877 737970233 741119444 743990242 746453106 748339295 750269175
1701.1G50269175K317249K017439J408219R51886Q87573J061320R54807M19796L47495
$$ 750269175 752586424 754603863 756012082 756963968 757851541 758912861 759867668 760287464 760634959
1719.4G60634959Q16047J181066J526415J528263J267612J091361J247049J965046
$$ 760634959 761451006 762632072 764158487 765686750 766954362 768045723 769292772 771257818
1735.7G71257818K086401J601696J354635J667380K155006K293348J926124J690388
$$ 771257818 773344219 774945915 776300550 777967930 780122936 782416284 784342408 786032796
1752G86032796J875341K153635K268553J811087J198113J182735J516998J692593J353025
$$ 786032796 787908137 790061772 792330325 794141412 795339525 796522260 798039258 799731851 801084876
1770.4H01084876O69777O72102J201451J460791J277685P70450M33564P08103J172304
$$ 801084876 801754653 802426755 803628206 805088997 806366682 807137132 807570696 808278799 809451103
1788.8H09451103J059115N70417M36127O56307R14156J017690P86662M25398L68178
$$ 809451103 810510218 811080635 811516762 812173069 813087225 814104915 814891577 815316975 815685153
1807.1H15685153O82294R48370P80225L66926K08139N35786Q87514P18593K67804Q5890
$$ 815685153 816367447 817315817 818096042 818462968 818671107 819206893 820094407 820813000 821080804 821166694
1827.5H21166694K38478O66321Q35001M28319Q0705K65300N51283N04196L36707J92880
$$ 821166694 821405172 822071493 822906494 823334813 823415518 823680818 824232101 824736297 825073004 825265884
1847.9H25265884J75238M55439O74069N07236J43408L0876L08036O30856N33223M5717
$$ 825265884 825441122 825896561 826570630 827077866 827221274 827252150 827560186 828191042 828724265 828769982
1868.3H28769982r5606L02434O08742N78642K97785J2696N4657L87132N46813K47598
$$ 828769982 828674376 828976810 829585552 830164194 830461979 830474675 830529332 830916464 831463277 831710875
1888.7H31710875q2016k801K78294M81426L80815P1704o1035J49309M02987L56615
$$ 831710875 831628859 831626058 831904352 832385778 832766593 832838297 832777262 832926571 833329558 833686173
1909.1H33686173R3520m8101M9531K30253L47912J95444q0407k1934K56180L51489
$$ 833686173 833779693 833731592 833781123 834011376 834359288 834554732 834474325 834452391 834708571 835060060
1929.5H35060060J81198o7115j15454R9540K82109J58846q6665j25289N5313K79129
$$ 835060060 835241258 835174143 835058689 835158229 835440338 835599184 835512519 835387230 835442543 835721672
1949.9H35721672K87056K0325k06650j28746J35482K74360J25945j54675j94966O5326
$$ 835721672 836008728 836029053 835822403 835693657 835829139 836103499 836229444 836074769 835879803 835945129
1970.3H35945129K67208J67549j05143k08676k2650K13981K12014k4498k13921j51515
$$ 835945129 836212337 836379886 836274743 836066067 836043417 836257398 836469412 836444914 836230993 836079478
1990.7H36079478R7394K36929P4744j62125j69515K7418J78397Q4638j53601k46584
$$ 836079478 836176872 836413801 836488545 836326420 836156905 836184323 836362720 836447358 836293757 836047173
2011.1H36047173q4103J09792R1255j09792k72512j86861O5804J50799n3882k73228
$$ 836047173 835963070 836072862 836164117 836054325 835781813 835594952 835660756 835811555 835757673 835484445
2031.5H35484445k39313m530J47164J1862k37048k69473m2378J91211J64151j08122
$$ 835484445 835245132 835240602 835387766 835399628 835162580 834893107 834850729 835041940 835206091 835097969
2051.9H35097969k79844j15812J85668K28644l6299k43247j30057J74701L06785J07050
$$ 835097969 834818125 834702313 834887981 835116625 835080326 834837079 834707022 834881723 835188508 835295558
2072.3H35295558j60038j46568J36435L46482K07424r9778j79887M9352L12507K67029
$$ 835295558 835135520 834988952 835125387 835471869 835679293 835579515 835399628 835448980 835761487 836028516
2092.7H36028516n3286k37763m8638K74420L12448J3232k40505j32441J93894L18348
$$ 836028516 835975230 835737467 835688829 835963249 836275697 836288929 836048424 835915983 836109877 836428225
2113.1H36428225Q1539k05040j66178J41263L20852J70708j25051k15530L4750L30567
$$ 836428225 836509764 836304724 836138546 836279809 836600661 836771369 836646318 836430788 836465538 836796105
2133.5H36796105K99156l2902k28524k9505K86758L23654O2763j44541l1769K68995
$$ 836796105 837095261 837062359 836833835 836804330 837091088 837414742 837477505 837332964 837301195 837570190
2153.9H37570190M00246J96337j00553r6202K18809M33028K97725J2279o6758J56939
$$ 837570190 837970436 838166773 838066220 837970018 838188827 838621855 838919580 838931859 838865101 839022040
2174.3H39022040M13835L86477J17481m2141J14441L92735M28021J59025p9214J5557
$$ 839022040 839435875 839822352 839939833 839897692 840012133 840404868 840832889 840991914 840912700 840928257
2194.6H40928257L21924M58658K74122L457j9670K45214M55916L31401K5034p6055
$$ 840928257 841250181 841708839 841982961 841986418 841966748 842211962 842667878 842999279 843024313 842948258
2215H42948258J56641M20928L95834J28985m5479R4653L81052M37379J83284n3763
$$ 842948258 843104899 843525827 843921661 844050646 844005167 844099820 844480872 844918251 845101535 845047772
2235.4H45047772n245K61843M13775K50996Q523j4007J74880L50296K90156L9935p7784
$$ 845047772 845042527 845304370 845718145 845969141 845977664 845963657 846138537 846488833 846778989 846818924 846741140
2257.9H46741140R0241L28422L27051O3240j18971L0101L08811L72947J60276o6936
$$ 846741140 846831381 847159803 847486854 847550094 847431123 847461224 847770035 848142982 848303258 848236322
2278.3H48236322k6166K00808L07977J64509q5652j57535N0664K59519J79350p3254
$$ 848236322 848210156 848410964 848718941 848883450 848797798 848640263 848690927 848950446 849129796 849056542
2298.7H49056542k22743j45316N7817J16229p9692l09944k79248J2458J63257r7990
$$ 849056542 848833799 848688483 848746300 848862529 848782837 848472893 848193645 848206103 848369360 848271370
2319.1H48271370m76062m99726j42634J37985L7134k59459l76642k01166L1889J9669
$$ 848271370 847795308 847295582 847152948 847290933 847328067 847068608 846691966 846490800 846522689 846542358
2339.5H46542358k47895l70980J44720Q19743O59764j70410q97705r19044m41611j4782
$$ 846542358 846294463 845923483 846068203 846887946 847547710 847377300 846479595 845560551 845118940 845104158
2359.9H45104158O9976p7844l9458L52681P01665O15359K98142K47598N26965P70926
$$ 845104158 845174134 845096290 845056832 845409513 846111178 846726537 847024679 847272277 847799242 848570168
2380.2H48570168O23763J51217j70410p3969J64091J73927q7619l39568k92063k1040
$$ 848570168 849193931 849345148 849174738 849100769 849264860 849438787 849351168 849011600 848719537 848698497
2400.6H48698497J38283j7047l06547l68416j32203Q9168J490k80976m09484k52545
$$ 848698497 848836780 848819733 848513186 848144770 848012567 848101735 848103225 847822249 847412765 847160220
2421H47160220j1265K3901k12967m39882l67165r5546L3796j55390m29213m24027j67370
$$ 847160220 847148955 847172856 846959889 846520007 846152842 846057296 846091092 845935702 845506489 845082462 844915092
2443.5H44915092J550j43707m62711n48243k74718l457o5565l61026n25832l57628
$$ 844915092 844916642 844772935 844310224 843761981 843487263 843483806 843418241 843057215 842531383 842173755
2463.9H42173755o5446m0889l37541n68330m37915j15872j013k38597n19753m76658
$$ 842173755 842108309 842067420 841729879 841161549 840723634 840607762 840606749 840368152 839848399 839371741
2484.3H39371741j76668r418j81913m92215n65947l00169l3378r8586l76284m88639
$$ 839371741 839195073 839185655 839003742 838511527 837945580 837645411 837612033 837513447 837137163 836648524
2504.7H36648524l10719q2791p4267k96653m91440m11987j36376j9133k12192m29869
$$ 836648524 836337805 836255014 836180747 835884094 835392654 834980667 834844291 834825158 834612966 834183097
2525.1H34183097l91364j86622q8752k11358l93748m02689k33829q8096j43289l44217
$$ 834183097 833791733 833605111 833516359 833305001 832911253 832508564 832274735 832186639 832043350 831699133
2545.5H31699133m24087k70963r2029j09137k80678m10676l57985j84357j08302k16842
$$ 831699133 831275046 831004083 830912054 830802917 830522239 830111563 829753578 829569221 829460919 829244077
2565.8H29244077l70085l92675k53737j28031j99378l82006m59373l65853k16961j99437
$$ 829244077 828873992 828481317 828227580 828099549 827900171 827518165 827058792 826692939 826475978 826276541
2586.2H26276541l49760m75169m18424k71201k38538l80993n25773n17308l92616l08275
$$ 826276541 825926781 825451612 825033188 824761987 824523449 824142456 823616683 823099375 822706759 822398484
2606.6H22398484l78788n31614n82575m70281l45290l91483n85914p01606o14047m75884
$$ 822398484 822019696 821488082 820905507 820435226 820089936 819698453 819112539 818410933 817796886 817321002
2627H17321002m85122o21557p12931o67274n37515m89592o28174p95901p98165o76811
$$ 817321002 816835880 816214323 815501392 814834118 814296603 813807011 813178837 812382936 811584771 810907960
2647.4H10907960n64098n71013p15494q14676p12455n39183n20051o50465p60854p39216
$$ 810907960 810343862 809772849 809057355 808242679 807530224 806991041 806470990 805820525 805059671 804320455
2667.8H04320455n99027m76360n17011o46949o68466n54323m47929m95076o36339o61076
$$ 804320455 803721428 803245068 802728057 802081108 801412642 800858319 800410390 799915314 799278975 798617899
2688.2G98617899n15461l61800l63409n12958o33061n63502l82304l12627m48048o17146
$$ 798617899 798102438 797740638 797377229 796864271 796231210 795667708 795285404 794972777 794524729 793907583
2708.6G93907583n98312m05252k75254l74555n49973n59985m12345k85208l40820n53250
$$ 793907583 793309271 792904019 792628765 792254210 791704237 791144252 790731907 790446699 790105879 789552629
2729G89552629o40392m68076k60114k59340m48823n79298m61757k44438k28286m32849
$$ 789552629 788912237 788444161 788184047 787924707 787475884 786896586 786434829 786190391 785962105 785529256
2749.4G85529256o21021o09696m32610l12627m13954o16670o66618n35607m18365m77851
$$ 785529256 784908235 784298539 783865929 783553302 783139348 782522678 781856060 781320453 780902088 780424237
2769.8G80424237o67512p70688p02262n85556n86450p57873q97885p93338n99324o06954
$$ 780424237 779756725 778986037 778283775 777698219 777111769 776353896 775456011 774662673 774063349 773456395
2790.2G73456395q27611j023888r98021q41498q09312r52065j128375j186669j066029
$$ 773456395 772628784 771604896 770606875 769765377 768956065 768004000 766875625 765688956 764622927
2808.6G64622927r65059j102805j358450j481235j392185j244247j274526j509488
$$ 764622927 763657868 762555063 761196613 759715378 758323193 757078946 755804420 754294932
2824.9G54294932j725555j721441j573444j528203j669586j833320j845002j712501
$$ 754294932 752569377 750847936 749274492 747746289 746076703 744243383 742398381 740685880
2841.2G40685880j587689j644253j829863j909256j810253j720667j848220k103687
$$ 740685880 739098191 737453938 735624075 733714819 731904566 730183899 728335679 726231992
2857.5G26231992k240777k195656k107740k142250k292395k319872k093732j865566
$$ 726231992 723991215 721795559 719687819 717545569 715253174 712933302 710839570 708974004
2873.8G08974004j820088j819491j739800j550734j279473j092255j097203j150548
$$ 708974004 707153916 705334425 703594625 702043891 700764418 699672163 698574960 697424412
2890.1F97424412j053989q03471o54638p74979r64940r88304q64387p51316p34509
$$ 697424412 696370423 695566952 694912314 694137335 693172395 692184091 691319704 690568388 689833879
2908.5F89833879q03351r07183r66429r40323q98659r04024q59320o56069k95758K6882
$$ 689833879 689030528 688123345 687156916 686216593 685317934 684413910 683554590 682898521 682602763 682629645
2928.9F82629645Q5235O9201L18467Q00967J267553J605391J821816J958966K147317
$$ 682629645 682714880 682784081 683102548 683903515 685171068 686776459 688598275 690557241 692704558
2947.2F92704558K456129K706051K690673K583921K677798K878070K892077K635598
$$ 692704558 695160687 697866738 700557411 703141332 705819130 708697200 711589277 714224875
2963.6G14224875K333105K222895K243459K226472K105713J915872J836896J868725
$$ 714224875 716557980 718780875 721024334 723250806 725356519 727272391 729109287 730978012
2979.9G30978012J759887J510560J305461J234651J302779J283168J010895P21455
$$ 730978012 732737899 734248459 735553920 736788571 738091350 739374518 740385413 741106868
2996.2G41106868N10871L26693K72036K35259N3764j06096j00077j31905l79503o87897
$$ 741106868 741617739 741944432 742216468 742451727 742505491 742399395 742299318 742167413 741787910 741100013
3016.6G41100013q75473r19163q50737q29399r54151j057446j051664r85861j002193
$$ 741100013 740224540 739305377 738454640 737625241 736671090 735613644 734561980 733576119 732573926
3034.9G32573926j138448j158536j107633j175463j289487j358628j361191j405478
$$ 732573926 731435478 730276942 729169309 727993846 726704359 725345731 723984540 722579062
3051.3G22579062j479626j412928j359880j429021j462639j420140j320541j300811
$$ 722579062 721099436 719686508 718326628 716897607 715434968 714014828 712694287 711393476
3067.6G11393476j455486j584351j533151j319706j155079j302719j565278j664757
$$ 711393476 709937990 708353639 706820488 705500782 704345703 703042984 701477706 699812949
3083.9F99812949j673758j569093j453101j595617j787602j699329j448631j372338
$$ 699812949 698139191 696570098 695116997 693521380 691733778 690034449 688585818 687213480
3100.2F87213480j525819j617491j511335j419664j490056j486421j342952j359761
$$ 687213480 685687661 684070170 682558835 681139171 679649115 678162694 676819742 675459981
3116.5F75459981j506865j648128j802445j828074j680136j512110j474559j546979
$$ 675459981 673953116 672304988 670502543 668674469 666994333 665482223 664007664 662460685
3132.8F62460685j560390j481295j475751j607657j655876j583219j557648j484037
$$ 662460685 660900295 659419000 657943249 656335592 654679716 653096497 651538849 650054812
3149.2F50054812j355886j429260j649260j730323j673937j588464j494765j446188
$$ 650054812 648698926 647269666 645620406 643890083 642216146 640627682 639132917 637686729
3165.5F37686729j501679j588106j574814j480222j432061j490772j571536j592696
$$ 637686729 636185050 634596944 633022130 631541908 630109847 628619075 627047539 625454843
3181.8F25454843j553118j481295j442969j477003j529634j521647j474917j473307
$$ 625454843 623901725 622420430 620977461 619500458 617970824 616449177 614974260 613500953
3198.1F13500953j510561j520991j485586j427949j396298j396835j417160j443088
$$ 613500953 611990392 610469401 608983815 607555866 606159568 604762733 603345573 601902485
3214.4F01902485j422644j374125j356364j379013j406967j381636j296818j180768
$$ 601902485 600479841 599105716 597749352 596370339 594963372 593581736 592284918 591104150
3230.7E91104150j135886j302779j469195j379191j216352j168788j168787j175106
$$ 591104150 589968264 588665485 587196290 585817099 584600747 583431959 582263172 581088066
3247.1E81088066j206636j160682j037895j002372j061976j079022j010001r33588
$$ 581088066 579881430 578720748 577682853 576680481 575618505 574539483 573529482 572595894
3263.4E72595894r07302q67188p82609q38518j022517j101911j063645r94861r42052
$$ 572595894 571688592 570821404 570038795 569200277 568177760 567075849 566012204 565017343 564075291
3281.7E64075291r24885r36389r47476r04500q75413r50516j064121j177133j200556
$$ 564075291 563150406 562214017 561266541 560362041 559486628 558536112 557471991 556294858 555094302
3300.1E55094302j035095q36491r10401j263440j523435j535118j432955j347304j341044
$$ 555094302 554059207 553222716 552312315 551048875 549525440 547990322 546557367 545210063 543869019
3318.4E43869019j383126j391053j369536j465679j619517j654923j643777j585961
$$ 543869019 542485893 541094840 539725304 538259625 536640108 534985185 533341408 531755447
3334.8E31755447j441896j472175j702130j836419j871168j809895j648784j729131
$$ 531755447 530313551 528841376 527139246 525302827 523431659 521621764 519972980 518243849
3351.1E18243849k054095k157509j958073j787722j816988j859784j713335j570642
$$ 518243849 516189754 514032245 512074172 510286450 508469462 506609678 504896343 503325701
3367.4E03325701j728356k083153k180576j916677j654565j550078j555711j552761
$$ 503325701 501597345 499514192 497333616 495416939 493762374 492212296 490656585 489103824
3383.7D89103824j434535j168638q55148q70973j244158j395166j041203p12663r47088
$$ 489103824 487669289 486500651 485645503 484774530 483530372 482135206 481094003 480381340 479434252
3402.1D79434252j315534j198352q70228p17818p12037q10951q68023p48008o16730
$$ 479434252 478118718 476920366 476050138 475332320 474620283 473809332 472941309 472193301 471576571
3420.4D71576571n31673l51965j34051j7792m3452k950J54048O3479k35290k40504
$$ 471576571 471044898 470692933 470558882 470541090 470497638 470494688 470648736 470712215 470476925 470236421
3440.8D70236421J00195L99232M74483M51207M97550N68479O46889P97212Q97527P90447
$$ 470236421 470336616 470735848 471210331 471661538 472159088 472727567 473374456 474171668 475069195 475859642
3461.2D75859642P80016J128137J341880J018941N65320N49317Q75741J191050J219481
$$ 475859642 476639658 477767795 479109675 480128616 480693936 481243253 482118994 483310044 484529525
3479.6D84529525R47148Q55744J046091J112580J086623J170605J253098J312316J327961
$$ 484529525 485476673 486332417 487378508 488491088 489577711 490748316 492001414 493313730 494641691
3497.9D94641691J320661J311272J155972J033992J200408J497268J679302J564622
$$ 494641691 495962352 497273624 498429596 499463588 500663996 502161264 503840566 505405188
3514.2E05405188J338362J405716J666665J836837J705169J419127J450301J772403
$$ 505405188 506743550 508149266 509815931 511652768 513357937 514777064 516227365 517999768
3530.6E17999768K011895K082587J988589J888752K080024K296388K170324J871765
$$ 517999768 520011663 522094250 524082839 525971591 528051615 530348003 532518327 534390092
3546.9E34390092J863718K094328K255679K324461K375186K464592K563715K515972
$$ 534390092 536253810 538348138 540603817 542928278 545303464 547768056 550331771 552847743
3563.2E52847743K335429K508402K937019K966285K861857K964854L086567L211558
$$ 552847743 555183172 557691574 560628593 563594878 566456735 569421589 572508156 575719714
3579.5E75719714L385127L391325L145635L004551L278971L411591L385842L551483
$$ 575719714 579104841 582496166 585641801 588646352 591925323 595336914 598722756 602274239
3595.8F02274239L696144L623783L619671L676474L465593L349066L499985L553688
$$ 602274239 605970383 609594166 613213837 616890311 620355904 623704970 627204955 630758643
3612.1F30758643L622770L568769L405571L611922L746629L537893L078103K813042
$$ 630758643 634381413 637950182 641355753 644967675 648714304 652252197 655330300 658143342
3628.5F58143342L395915L637969L411114L298343L215253L134549L098189K964616
$$ 658143342 661539257 665177226 668588340 671886683 675101936 678236485 681334674 684299290
3644.8F84299290K615631K496719L001452L082752K589285K660632L020049K690494
$$ 684299290 686914921 689411640 692413092 695495844 698085129 700745761 703765810 706456304
3661.1G06456304K259612K246201K062261J742780K068043J947999J238286J604617
$$ 706456304 708715916 710962117 713024378 714767158 716835201 718783200 720021486 721626103
3677.4G21626103K170026K116621K033651J867652J447081J097083J336873J642823
$$ 721626103 723796129 725912750 727946401 729814053 731261134 732358217 733695090 735337913
3693.7G35337913J538932J248896R85742R76205J300037J367450R88543N26607O03378
$$ 735337913 736876845 738125741 739111483 740087688 741387725 742755175 743743718 744270325 744873703
3712.1G44873703J280307J373887R16243O07908O29663P21395Q02517R67622Q72850
$$ 744873703 746154010 747527897 748444140 749052048 749681711 750403106 751205623 752173245 753046095
3730.4G53046095N56350L63529O06358J126945J049459J44720k27332P58111O85513
$$ 753046095 753602445 753965974 754572332 755699277 756748736 756893456 756666124 757424235 758109748
3748.8G58109748l4392N73278J246154R11296M23491N31494O87778N26071M29749L37124
$$ 758109748 758075356 758648634 759894788 760806084 761229575 761761069 762448847 762974918 763404667 763741791
3769.2G63741791M12345O73533O88195M88400L04759L55899L96490L20673M14253N68509
$$ 763741791 764154136 764827669 765515864 766004264 766309023 766664922 767061412 767382085 767796338 768364847
3789.6G68364847N75483L73244J94490L08931J20103o5744M36246L72470K09987O96361
$$ 768364847 768940330 769313574 769508064 769816995 769937098 769871354 770307600 770680070 770890057 771586418
3810G71586418Q10146K70248p9274J98841J1802O9439O39915N25237L20255K97249
$$ 771586418 772396564 772666812 772587538 772786379 772798181 772867620 773507535 774032772 774353027 774650276
3830.4G74650276L55959M76062J04546l15666N1081M75169O18338P01547N91814q9108
$$ 774650276 775006235 775482297 775586843 775271177 775322258 775797427 776415765 777117312 777709126 777620018
3850.8G77620018j171530m68433J025200R53913M18365L7014J09852K82705p7963j09375
$$ 777620018 776448488 775980055 777005255 777959168 778377533 778414547 778524399 778807104 778729141 778619766
3871.2G78619766L05951N35428M92812M1961M7088L32892J24097K00867J84596j27316
$$ 778619766 778925717 779461145 779953957 779995918 780043006 780375898 780499995 780700862 780885458 780758142
3891.6G80758142J82331N28991K45869j64687l00288j40012L06845N80668M20869K09868
$$ 780758142 780940473 781469464 781715333 781550646 781250358 781110346 781417191 781997859 782418728 782628596
3912G82628596P2837j09852q2373J77264J77920o974J01805K66611R8586n3167P0095
$$ 782628596 782701433 782591581 782509208 782686472 782864392 782857418 782959223 783225834 783324420 783271253 783341348
3934.4G83341348J81198J54436N4121Q166R4056Q2374J1503R0361J35243O4790N8591
$$ 783341348 783522546 783676982 783731103 783739269 783833325 783915699 783927202 784017563 784152806 784217596 784276187
3956.8G84276187J03891O8784M9472P3552L6657N1439J30534J18554N5074K3782K9982
$$ 784276187 784380078 784448862 784498334 784571886 784608543 784659982 784790516 784909070 784964144 784987926 785017908
3979.3G85017908J18553J86026P0036o8903l9816O1274J20580J22249P1049
$$ 785017908 785136461 785322487 785392523 785323620 785283804 785345078 785465658 785587907 785658956
3997.6G85658956
$$ 785658956
##END=$$ End of the data block
