##TITLE=Goma A $$ Begin of the data block
##JCAMP-DX=5.00 $$ ACD/SpecManager v 10.08
##SPECTROMETER/DATA SYSTEM=Alpha
##DATE=21 Oct 2014 10:25:42
##DATA TYPE=INFRARED SPECTRUM
##DATA CLASS=XYDATA
##ORIGIN=
##OWNER=
##NPOINTS=1765
##FIRSTX=399.76428223
##LASTX=3997.64306641
##MAXX=3997.64306641
##MINX=399.76428223
##MAXY=1.00000000
##MINY=0.41722518
##XFACTOR=1.0000000000
##YFACTOR=0.000000010000000
##FIRSTY=1.00000000
##DELTAX=2.03961372
##XUNITS=1/CM
##YUNITS=ARBITRARY UNITS
##XYDATA=(X++(Y..Y))
399.8 100000000 99710864 99395943 99063462 98775697 98602641 98499906 98357040 98137361 97875822 97640091
420.2 97640091 97388542 97118562 96923083 96736860 96465755 96175164 95925355 95689744 95433927 95159650
440.6 95159650 94917130 94735330 94576055 94410026 94233507 94048536 93855804 93652707 93458319 93261248
461 93261248 93028235 92785513 92557615 92333877 92115730 91911173 91718382 91547799 91405463 91279525
481.3 91279525 91190988 91147363 91094279 90984368 90828395 90674585 90535271 90385222 90215147 90024740
501.7 90024740 89815992 89595652 89371794 89161611 88956094 88718057 88438630 88149315 87874174 87598228
522.1 87598228 87316239 87055856 86822426 86599809 86390764 86195588 85999191 85791558 85570931 85332757
542.5 85332757 85090536 84874094 84691101 84547728 84470260 84460020 84468699 84455347 84418315 84365541 84322357
565 84322357 84305948 84291458 84246862 84166688 84076190 84000915 83939880 83878034 83790314 83665037 83538091 83429009
589.4 83429009 83312464 83178955 83030236 82854211 82665229 82524705 82465380 82473427 82535040 82624376 82710820
611.9 82710820 82781059 82839209 82916850 83025932 83142030 83257866 83380324 83501786 83618444 83741564
632.3 83741564 83867526 83993524 84124404 84257454 84394628 84542227 84686798 84816337 84927613 85000455
652.7 85000455 85033005 85041100 85039294 85048270 85087919 85142416 85228640 85418630 85610670 85787165 86004722 86226362
677.2 86226362 86403382 86516714 86570489 86583251 86567962 86543322 86526215 86509162 86487794 86476499 86492097
699.6 86492097 86534494 86587340 86623794 86636358 86652482 86700177 86801338 86976522 87232292 87566966 87968010
722 87968010 88407439 88871360 89351690 89833713 90300512 90731072 91110301 91436839 91730744 92014802
742.4 92014802 92302948 92583394 92828643 93024409 93160856 93242353 93294996 93324298 93299276 93179983 92942649
764.9 92942649 92611802 92257065 91963899 91778260 91697276 91708517 91795897 91943556 92131096 92324340
785.3 92324340 92483139 92572570 92578584 92506683 92369270 92198861 92034113 91899681 91820180 91828102 91967183
807.7 91967183 92285085 92813611 93560773 94507980 95592582 96716368 97765511 98622549 99199873
826 99199873 99463916 99431700 99172264 98810273 98493135 98340464 98401350 98648131 98995292 99353075 99665689
848.5 99665689 99890345 100000000 99992824 99866682 99619085 99271983 98864073 98434621 98002297 97561884
868.9 97561884 97108048 96643478 96185869 95769727 95436931 95216769 95111573 95100045 95148504 95229322
889.3 95229322 95316148 95368928 95352554 95245391 95031250 94699800 94251275 93707550 93112123 92536658
909.7 92536658 92064643 91737175 91540456 91403180 91213822 90884483 90365142 89627260 88663244 87487662
930.1 87487662 86136633 84655172 83094603 81505960 79924875 78372198 76853061 75360322 73881453
948.4 73881453 72397393 70894974 69382024 67891175 66472405 65175545 64028519 63029397 62161088
966.8 62161088 61399984 60725522 60139078 59662664 59317327 59098107 58965957 58851105 58667815 58342421
987.2 58342421 57834834 57144147 56299770 55351400 54354978 53358680 52399045 51499659 50658709 49855831
1007.6 49855831 49076697 48319775 47601902 46953323 46393180 45912093 45489082 45098266 44721416 44373858
1028 44373858 44088784 43890685 43786815 43771213 43818244 43890521 43955055 43991578 43995556 43970180 43915746 43832681
1052.4 43832681 43732572 43627742 43524671 43424469 43327767 43233004 43139169 43056136 43001446 42992425 43044940
1074.9 43044940 43174088 43385041 43676808 44044676 44481480 44979534 45529664 46122646 46749923 47397721
1095.3 47397721 48051164 48706791 49363354 50019455 50672263 51313132 51929235 52514285 53071088 53603441
1115.7 53603441 54111010 54586840 55019391 55397034 55724096 56021303 56312537 56603736 56874013 57101321
1136.1 57101321 57278192 57409775 57518923 57646263 57829219 58088136 58433068 58868772 59391290 59994549
1156.5 59994549 60669452 61396044 62151313 62924087 63720113 64554083 65447587 66418505 67471611 68603086
1176.9 68603086 69810259 71094680 72447228 73836458 75207132 76485747 77605283 78530675 79257512
1195.2 79257512 79802406 80195212 80469358 80645472 80733687 80749542 80709487 80621558 80488241 80312622
1215.6 80312622 80102599 79873353 79643196 79433870 79270774 79168761 79121786 79118508 79156387 79234171 79348511
1238.1 79348511 79494667 79656684 79804200 79907739 79951280 79941070 79900742 79849541 79796988 79749537 79711694
1260.5 79711694 79684919 79664063 79635096 79579484 79476374 79311395 79089117 78832114 78573644 78345329
1280.9 78345329 78164488 78035688 77956235 77916056 77901322 77899504 77904451 77912790 77915925 77907020 77887118 77862763
1305.4 77862763 77841794 77835929 77859002 77914727 77990443 78069997 78140670 78183413 78179580 78121030 78011441 77863383
1329.8 77863383 77690613 77503479 77313101 77131760 76969481 76820284 76657593 76472139 76281095 76098287
1350.2 76098287 75925124 75759363 75596285 75428909 75257909 75103486 74991661 74907231 74826264 74742717
1370.6 74742717 74651206 74563819 74489188 74402636 74279153 74127585 73986703 73887086 73817140 73738176 73615491
1393.1 73615491 73429298 73184037 72881645 72545934 72190332 71808279 71434808 71083689 70749205 70449615
1413.5 70449615 70196944 69990295 69860780 69823056 69850534 69932193 70059961 70248896 70494097 70758539
1433.9 70758539 71099281 71531081 71917260 72262609 72577333 72840393 73070109 73275572 73453605 73627925
1454.3 73627925 73910958 74377578 74831253 75263107 75823694 76487070 77103341 77738625 78576159 79518998
1474.7 79518998 80403227 81245798 82079667 82905424 83664793 84387296 85163248 85959411 86595207 87119776
1495 87119776 87674391 88205338 88624787 88928086 89209992 89610153 89966863 90194106 90367836 90522546
1515.4 90522546 90690076 90855187 91038358 91217113 91357934 91497284 91614503 91704363 91793114 91843760
1535.8 91843760 91835535 91850954 91923022 91989672 92022538 92002958 91940886 91855484 91735959 91562760 91327620
1558.3 91327620 91066414 90797472 90422058 89923483 89277804 88457900 87601137 86579531 85161138
1576.6 85161138 83710581 82323736 80775565 79109365 77408814 75718969 74082673 72543931
1593 72543931 71126169 69864267 68777329 67857057 67108750 66546011 66156119 65917403 65809494 65791684
1613.4 65791684 65868783 66077834 66327584 66581506 66897666 67211270 67483497 67746162 67994028 68282652
1633.7 68282652 68723893 69195998 69574147 69930345 70291907 70752472 71300781 71715617 72190076 72957361
1654.1 72957361 73559022 74010867 74499100 75075853 75677717 76186484 76725179 77377784 77978814 78592241
1674.5 78592241 79275572 79879737 80406934 81003052 81842333 82620537 83243144 83876503 84448683 85050064
1694.9 85050064 85714453 86365503 87106270 87714547 88214409 88741386 89198703 89571744 89886588 90184754
1715.3 90184754 90556556 90939605 91224283 91463262 91696310 91904175 92093843 92274439 92528236 92824370
1735.7 92824370 93038726 93255961 93508500 93753487 93987906 94221413 94489014 94786280 95037836 95264643
1756.1 95264643 95493460 95701265 95915842 96110731 96262002 96400279 96544540 96725756 96911216 97041136
1776.5 97041136 97141600 97248977 97370124 97496122 97603935 97668183 97718209 97816062 97932088 98021454
1796.9 98021454 98098040 98181230 98266524 98339933 98402423 98464608 98539948 98615843 98675430 98725200 98775649 98820770
1821.4 98820770 98864836 98920149 98970532 99022776 99088615 99144262 99190420 99241769 99282151 99299544 99328005 99381644
1845.9 99381644 99429631 99472946 99517173 99557364 99589938 99612719 99631727 99650282 99663126 99670434 99696463 99744087
1870.3 99744087 99776816 99791074 99804533 99824733 99849540 99872917 99885541 99880219 99874169 99890661 99920636 99948198
1894.8 99948198 99964714 99964678 99957550 99955398 99962735 99977416 99993187 100000000 99988401 99965501 99957776 99972308 99984801
1921.3 99984801 99991399 99993598 99986535 99979097 99981040 99991518 100000000 99993074 99965453 99935526 99925071 99931055 99939758
1947.9 99939758 99939489 99923944 99898750 99877286 99867654 99868125 99866301 99850917 99825454 99802923 99789202 99782228 99779838
1974.4 99779838 99775201 99762607 99742770 99722070 99707568 99702919 99701995 99695039 99680817 99660945 99641311 99631143 99629021
2000.9 99629021 99623716 99609137 99585974 99558520 99534494 99518013 99507362 99498665 99481398 99451071 99421018 99399489
2025.4 99399489 99381799 99361682 99335742 99304259 99270731 99238580 99211764 99190867 99169868 99144983 99117762 99094200
2049.8 99094200 99076408 99061066 99045366 99030364 99016547 98998743 98977655 98960024 98945063 98928809 98914617 98903823
2074.3 98903823 98891038 98872697 98852783 98837775 98829383 98824221 98814118 98793674 98768455 98748350 98736465 98731363
2098.8 98731363 98727793 98717797 98699248 98678243 98664820 98663050 98667037 98667991 98661017 98648334 98639196 98639005 98645425 98653001
2127.3 98653001 98653251 98644781 98637509 98638898 98646522 98657012 98667818 98672706 98670799 98671919 98682976 98700529 98717827
2153.9 98717827 98729891 98737633 98746765 98763257 98788017 98813748 98833555 98849261 98866838 98887497 98911047 98939109
2178.3 98939109 98967606 98990679 99011058 99031860 99052131 99075937 99106717 99139559 99169123 99193335 99210954 99228334
2202.8 99228334 99253953 99286413 99319458 99346524 99364167 99377322 99393964 99416548 99444842 99476486 99502975 99520594
2227.3 99520594 99536180 99554992 99578321 99604034 99627358 99645281 99660242 99678439 99699873 99721807 99744141 99765456
2251.8 99765456 99783224 99796951 99809974 99829066 99856126 99880517 99894750 99903923 99914330 99925208 99935567 99949837
2276.2 99949837 99967873 99981898 99986428 99984550 99981201 99981683 99989283 99998111 100000000 99995750 99991506 99987870 99987513 99993277
2304.8 99993277 99999231 99998021 99987030 99972254 99961692 99955922 99954677 99955523 99944967 99919492 99899185 99902999 99923348
2331.3 99923348 99933839 99926305 99911529 99897921 99894416 99924499 99973130 99967062 99907249 99854052 99832082 99828643
2355.8 99828643 99841273 99855942 99859756 99867052 99884897 99906576 99936593 99971658 99993575 99995607 99989241 99988174 99994284
2382.3 99994284 100000000 100000000 99994832 99981189 99963248 99948347 99939913 99935555 99927825 99910301 99882990 99852729 99828827
2408.8 99828827 99813288 99799460 99781120 99755216 99722707 99691534 99666113 99642348 99617332 99588740 99553901 99516267
2433.3 99516267 99480981 99451452 99426019 99397063 99360579 99318045 99274164 99233735 99198508 99166352 99132138 99094176
2457.8 99094176 99055892 99018013 98979300 98940855 98902667 98866302 98831171 98792380 98748171 98702520 98662627 98629087
2482.2 98629087 98595995 98559153 98518187 98476923 98437363 98397708 98358589 98320913 98284388 98245573 98200059 98154783
2506.7 98154783 98118842 98089510 98059160 98023725 97983611 97942191 97903085 97869325 97840589 97810221 97774154 97736382
2531.2 97736382 97700965 97669756 97643763 97618788 97588754 97553259 97518420 97489363 97464442 97439283 97409773 97373444
2555.6 97373444 97334570 97298551 97264993 97234106 97206032 97175109 97136551 97090262 97042572 97000647 96961945 96920234
2580.1 96920234 96872300 96818632 96763229 96706945 96649325 96592408 96534437 96472281 96405393 96334112 96262199 96193832
2604.6 96193832 96126121 96053261 95972818 95883805 95789891 95699096 95611703 95521325 95427328 95329523 95223379
2627 95223379 95112604 95007950 94910491 94810218 94698334 94576430 94452918 94335157 94225937 94118845
2647.4 94118845 94006819 93889230 93766475 93644166 93531173 93426943 93323469 93215996 93103242 92987585
2667.8 92987585 92875266 92771643 92676854 92586672 92495054 92397493 92297018 92199624 92108673 92024088 91941971
2690.3 91941971 91858315 91771990 91686994 91607618 91532052 91454625 91375589 91298592 91220838 91141427 91066408 90996528
2714.7 90996528 90927154 90855020 90776110 90692919 90614104 90541685 90474480 90409803 90339780 90262377 90184927 90114284
2739.2 90114284 90049624 89984244 89914840 89840895 89760619 89675552 89591759 89513206 89435339 89349961 89254898 89153284
2763.7 89153284 89049637 88950807 88857031 88757902 88646364 88524419 88397580 88270682 88145912 88021922
2784.1 88021922 87896138 87765044 87623930 87472010 87317258 87167853 87019038 86859822 86687112 86505699
2804.5 86505699 86321032 86135942 85948074 85749656 85537332 85316527 85091746 84862328 84628236 84388900
2824.9 84388900 84139043 83872032 83589250 83301789 83015555 82728505 82434654 82125682 81800389 81461477
2845.3 81461477 81110746 80754393 80395788 80028236 79644608 79245073 78833097 78409708 77974069 77528501
2865.7 77528501 77076048 76622820 76182556 75763428 75370657 75015759 74703425 74424577 74167979 73932952
2886.1 73932952 73724395 73541397 73377717 73227859 73086494 72949213 72820586 72700906 72579622 72451836
2906.5 72451836 72318375 72177404 72028244 71875310 71725845 71588725 71469569 71371251 71299028 71256202
2926.8 71256202 71242255 71256334 71307564 71418494 71604711 71866053 72200429 72600794 73048043 73523086
2947.2 73523086 74022621 74548125 75084937 75616044 76134324 76634073 77106935 77541816 77929735 78268170
2967.6 78268170 78566897 78849202 79133940 79423803 79722112 80028617 80325556 80607259 80887622 81167358
2988 81167358 81436729 81681359 81883568 82048231 82182860 82279176 82340896 82375419 82382822 82368124 82335198
3010.5 82335198 82273841 82171041 82033259 81875908 81704104 81521744 81331336 81129181 80921823 80718267
3030.9 80718267 80513263 80290085 80045229 79803067 79573494 79336935 79079199 78805810 78533179 78264165
3051.3 78264165 77990472 77714956 77436042 77150178 76869035 76598859 76331973 76053649 75756371 75452757
3071.7 75452757 75159395 74886650 74627846 74356198 74063402 73763281 73459595 73155999 72856230 72548175
3092.1 72548175 72233796 71933395 71650094 71364504 71061987 70756894 70469046 70187765 69892550 69600594
3112.4 69600594 69333667 69067925 68780196 68469262 68140185 67815530 67513061 67225593 66936851 66639656
3132.8 66639656 66347086 66073245 65803695 65512258 65206230 64911628 64632124 64365351 64107239 63834763
3153.2 63834763 63539565 63245970 62965953 62690526 62416434 62146086 61881447 61620218 61357290 61092031
3173.6 61092031 60829663 60573518 60321099 60068166 59813964 59560353 59310520 59065515 58821130 58575857
3194 58575857 58331519 58089012 57848805 57613796 57384795 57158101 56933916 56713080 56494111 56278378
3214.4 56278378 56065345 55852282 55640787 55430871 55220926 55015212 54817605 54630053 54449427 54260445
3234.8 54260445 54061377 53867650 53682047 53503036 53335357 53172719 53004521 52838933 52687407 52541870
3255.2 52541870 52392030 52241445 52094775 51952219 51816672 51693994 51580149 51454717 51311666 51165700
3275.6 51165700 51026636 50897413 50773501 50647789 50523001 50405741 50295973 50184679 50062490 49929062
3296 49929062 49788174 49650905 49530441 49423748 49310905 49170816 49003014 48829517 48668167 48516178
3316.4 48516178 48368031 48224199 48083076 47938418 47776005 47598571 47427869 47267047 47113645 46970513
3336.8 46970513 46818081 46642816 46459493 46274278 46097562 45943180 45782149 45586982 45381713 45198265
3357.2 45198265 45036170 44872653 44702491 44547084 44402909 44237319 44042248 43850535 43689385 43546796
3377.6 43546796 43404350 43256891 43116254 43000734 42915714 42852181 42772892 42651349 42530137 42460921
3398 42460921 42421618 42345738 42222306 42114934 42053932 42011285 41963357 41901216 41832691 41779432 41746879 41727597
3422.5 41727597 41722518 41733506 41755053 41774690 41801322 41847461 41880664 41877139 41872260 41899884 41956210 42025077
3446.9 42025077 42092478 42163399 42244989 42334530 42437005 42553109 42660588 42768013 42917863 43092126
3467.3 43092126 43220547 43288395 43359089 43473068 43623915 43783677 43915993 44037619 44186756 44343549
3487.7 44343549 44486961 44639331 44811654 44994357 45168033 45338029 45524451 45699489 45847577 46011111
3508.1 46011111 46216050 46449202 46671095 46861780 47054088 47278214 47538531 47796348 48021334 48248628
3528.5 48248628 48504710 48781124 49079695 49386600 49673167 49962616 50283355 50621152 50940180 51242548
3548.9 51242548 51571798 51927131 52273965 52625108 53009588 53402376 53765941 54148519 54626262 55125713
3569.3 55125713 55568480 56001872 56465077 56955206 57468486 57985258 58482939 58999288 59572351 60138887
3589.7 60138887 60665739 61217904 61811280 62412763 63017058 63613153 64174712 64730191 65339148 65970308
3610.1 65970308 66590416 67202055 67790145 68436104 69141668 69743758 70224547 70720667 71412522 72166640
3630.5 72166640 72766936 73332429 73900694 74458957 75024360 75549179 76003242 76495391 77173597 77869779
3650.9 77869779 78366393 78848422 79434961 79973739 80423594 80839789 81217843 81586021 82037169 82478070
3671.3 82478070 82840216 83317053 83804721 84162736 84487677 84782672 85057104 85407686 85816950 86138105
3691.7 86138105 86395437 86647093 86880165 87122458 87409699 87658256 87831461 87999642 88236910 88541257
3712.1 88541257 88779420 88936639 89083898 89244813 89414304 89598066 89781278 89906168 89999682 90143728
3732.5 90143728 90375555 90642214 90789467 90806681 90895510 91131675 91275847 91380250 91626769 91863221
3752.9 91863221 91981161 92089820 92257988 92410636 92513281 92628694 92761523 92922121 93085313 93190122
3773.3 93190122 93263036 93370301 93522525 93644518 93735933 93844789 93959635 94066656 94143140 94198591
3793.7 94198591 94276255 94339186 94423884 94575429 94672072 94782645 94940203 95009071 95019180 95081609 95195383
3816.1 95195383 95253074 95356250 95522344 95605195 95661926 95716023 95766211 95825350 95881003 95981699 96121818
3838.5 96121818 96224767 96319383 96414161 96441680 96379852 96336538 96523577 96797454 96861953 96854615 96880478
3861 96880478 96957827 97030747 97062272 97147584 97261584 97344178 97411352 97436148 97486490 97554743 97615469 97725302
3885.4 97725302 97779739 97803599 97898370 97954524 97935313 97937316 97985619 98066628 98183900 98284966 98334086
3907.9 98334086 98366654 98391265 98408771 98450547 98514676 98562068 98595202 98648340 98697001 98714578 98752075 98830354
3932.3 98830354 98889458 98910272 98921102 98945391 98992503 99030167 99059618 99111676 99169791 99214882 99253488 99290484
3956.8 99290484 99323058 99355561 99388826 99418414 99453080 99495035 99531484 99563181 99600619 99639374 99675703 99718863
3981.3 99718863 99764740 99794608 99814248 99841630 99876618 99916941 99960184 100000000
3997.6 100000000
##END=$$ End of the data block
