##TITLE=$$ Begin of the data block
##JCAMP-DX=5.00 $$ ACD/SpecManager v 10.08
##SPECTROMETER/DATA SYSTEM=Alpha
##DATE=10 Nov 2014 10:35:34
##DATA TYPE=INFRARED SPECTRUM
##DATA CLASS=XYDATA
##ORIGIN=
##OWNER=
##NPOINTS=1765
##FIRSTX=399.76428223
##LASTX=3997.64306641
##MAXX=3997.64306641
##MINX=399.76428223
##MAXY=0.85147190
##MINY=0.51981890
##XFACTOR=1.0000000000
##YFACTOR=1.000000000000000e-9
##FIRSTY=0.80441117
##DELTAX=2.03961372
##XUNITS=1/CM
##YUNITS=ARBITRARY UNITS
##XYDATA=(X++(Y..Y))
399.8H04411173j495421J347840j93596k616763o48856J138806j182318k674103p09474
$$ 804411173 802915752 804263592 804069996 801453233 800804377 801943183 800760865 798086762 797377288
418.1G97377288j42514k109707j001775O90579j193285k487838L7670J113177j325131
$$ 797377288 797234774 795125067 794123292 794813871 793620586 791132748 791170418 792283595 790958464
436.5G90958464j434624J026988K91526j959324k83837J545429p76767k357603j06394
$$ 790958464 789523840 790550828 790842354 788883030 788599193 790144622 789367855 787010252 786903858
454.8G86903858L24667k258838j391470J295269Q7380k403617r63628Q57889r35316
$$ 786903858 787228525 784969687 783578217 784873486 784960866 782557249 781593621 782451510 781516194
473.2G81516194j510977O67810M31120j863360j169383J148343j6511k062559m45485
$$ 781516194 780005217 780673027 781104147 779240787 778071404 779219747 779203236 777140677 776695192
491.5G76695192J137256j008987k135396j19K90930j958072j436353O49035n39124
$$ 776695192 777832448 776823461 774688065 774687946 774978876 773020804 771584451 772233486 771694362
509.9G71694362k649247j524508o9619j458466k113819j52886K56181j613736j408935
$$ 771694362 769045115 767520607 767450988 765992522 763878703 763725817 763981998 762368262 760959327
528.3G60959327L17574m96924k066910q02637P79510k97248p49648J358509K022207
$$ 760959327 761276901 760779977 758713067 757910430 758689940 758392692 757643044 759001553 761023760
546.6G61023760J4782n84424O51837J67429j327932n36442R26137j6212j044393K86103
$$ 761023760 761038542 760454118 761105955 761273384 759945452 759409010 760335147 760318935 759274542 759560645
567G59560645J054167n29527j191438L43204P54416o03795n31316O18458R5069r08255
$$ 759560645 760614812 760085285 758893847 759237051 759991467 759387672 758856356 759474814 759569883 758661628
587.4G58661628k33531M98652l88384r07778J61886N58197o34908j161039l47078k82526
$$ 758661628 758428097 758926749 758538365 757630587 757792473 758350670 757715762 756554723 756207645 755925119
607.8G55925119j214206j168013m01676p25805j108528K36214J571297J200855P23600
$$ 755925119 754710913 753542900 753141224 752415419 751306891 751543105 753114402 754315257 755038857
626.2G55038857J408279J629115N65171N2988Q25703J045049K61187L31283J333356
$$ 755038857 756447136 758076251 758641422 758694410 759520113 760565162 760826349 761157632 762490988
644.5G62490988J278519L40283O43552J547098R17733j87099J77800P64191J0848q03053
$$ 762490988 763769507 764109790 764753342 766300440 767218173 767031074 767208874 767973065 767983913 767180860
664.9G67180860l79026J005471J019478P82191J657427J740217N66840O41287J650810
$$ 767180860 766801834 767807305 768826783 769608974 771266401 773006618 773573458 774214745 775865555
683.3G75865555J114666m1485M69745J303851M81904l55065L42071Q79645J59026J63674
$$ 775865555 776980221 776938736 777408481 778712332 779194236 778839171 779181242 780060887 780219913 780383587
703.7G80383587J446009J558363M21822O00755J733959J288056J76430R79364K277136
$$ 780383587 781829596 783387959 783809781 784410536 786144495 787432551 787608981 788588345 790865481
722G90865481J581848P07507J560628K078474R12964L87311J347721J336217J34646
$$ 790865481 792447329 793154836 794715464 796793938 797706902 798094213 799441934 800778151 800912797
740.4H00912797K01762J233876Q43406j54853M82261J316369L24428n29647M65631
$$ 800912797 801114559 802348435 803191841 803036988 803519249 804835618 805160046 804630399 805096030
758.7H05096030J042545m6313k74241J066268J173973q3804J80781J500725J111806
$$ 805096030 806138575 806092262 805818021 806884289 808058262 807974458 808155239 809655964 810767770
777.1H10767770O1869Q87931J989186J132249L73126J453876J972735P62641L87848
$$ 810767770 810829639 811717570 813706756 814839005 815212131 816666007 818638742 819401383 819789231
795.4H19789231J523852J520574K26081L39448J376689Q11815k47359M21702J287461
$$ 819789231 821313083 822833657 823059738 823399186 824775875 825587690 825340331 825762033 827049494
813.8H27049494M12285m12643L29971M00365j103103j388610N305K03788o52551L49343
$$ 827049494 827461779 827049136 827379107 827779472 826676369 825287759 825293064 825496852 824844301 825193644
834.2H25193644K298832K245485J301527J610577J865983P60138o7472M40598O75797
$$ 825193644 827492476 829737961 831039488 832650065 834516048 835276186 835208714 835649312 836325109
852.6H36325109L2425J78814J216054J217425K17318J38939P31408K51353o43551l69489
$$ 836325109 836357534 836536348 837752402 838969827 839187145 839326084 840057492 840308845 839665294 839295805
873H39295805J09314m88162j016199n67794m04894j178086j507819q94308o94394j061559
$$ 839295805 839405119 838916957 837900758 837332964 836928070 835749984 834242165 833347857 832653463 831591904
893.4H31591904o32107L54528M58658P1287M06265P75278J28746n91338l90768j45495
$$ 831591904 830959797 831314325 831772983 831844270 832250535 833025813 833154559 832563221 832172453 832026958
913.7H32026958n57959p49051k36213M4047l10838m03642k0862j18792q01504j107692
$$ 832026958 831468999 830719948 830483735 830527782 830216944 829813302 829792440 829673648 828872144 827764452
934.1H27764452j109601j768946k726078k994359l042698l588855l941119l386616
$$ 827764452 826654851 824885905 822159827 819165468 816122770 812533915 808592796 805206180
950.5H05206180k606154k284825j894235j188457r09925j224279j357854j156032j390934
$$ 805206180 802600026 800315201 798420966 797232509 796322584 795098305 793740451 792584419 791193485
968.8G91193485k155244k718389l069878l823817m781663n203724n196452n288362
$$ 791193485 789038241 786319852 783249974 779426157 774644494 769440770 764244318 758955956
985.1G58955956n201340m542411l839552l684759l768861l782273m164397m948795
$$ 758955956 753754616 749212205 745372653 741687894 737919033 734136760 729972363 725023568
1001.4G25023568n288244m901647m481018m259288l744841l010928k640725k506434
$$ 725023568 719735324 714833677 710352659 706093371 702348530 699337602 696696877 694190443
1017.8F94190443k065480j488924j277030j178205p51316l51191k80499q1957M72486
$$ 694190443 692124963 690636039 689359009 688180804 687429488 687078297 686797798 686715841 687188327
1036.1F87188327O99580J90318m19021o90043r34064j169861j008868o33299n99623
$$ 687188327 687887907 688078225 687659204 686969161 686035097 684865236 683856368 683223069 682623446
1054.5F82623446p59482n36383j11103p1168k46107j62661j02937l77596l43501M07874
$$ 682623446 681863964 681327581 681216478 681145310 680899203 680736542 680633605 680256009 679912508 680320382
1074.9F80320382J211584J645386K047121K358854K039433J244962O84261L22700l20315
$$ 680320382 681531966 683177352 685224473 687583327 689622760 690867722 691551983 691874683 691554368
1093.2F91554368r25899r46701p63774p93635m93110M79997J446902J939416K449870
$$ 691554368 690628469 689681768 688917994 688124359 687631249 688111246 689558148 691497564 693947434
1111.6F93947434L171206L475904L195107K922476K839684K541483K137959K193272
$$ 693947434 697118640 700594544 703789651 706712127 709551811 712093294 714231253 716424525
1127.9G16424525K500832K324700J789928J413524R51946K37822r1195K38359O42240
$$ 716424525 718925357 721250057 723039985 724453509 725405455 725643277 725552082 725790441 726432681
1146.3G26432681Q93176J388251K026380K260267K286733K666950L270149L777921
$$ 726432681 727325857 728714108 730740488 733000755 735287488 737954438 741224587 745002508
1162.6G45002508M371464N204320N842567N912244N763114N695402N359948M645407
$$ 745002508 749373972 754578292 760420859 766333103 772096217 777791619 783151567 787796974
1178.9G87796974M006624L552318K886534K061009J482248J017452L19302m01855p71999
$$ 787796974 791803598 795355916 798242450 800303459 801785707 802803159 803122461 802720606 801948607
1197.3H01948607r28402j078784j022101o73652m24325m79817o18279p57158j080871
$$ 801948607 801020205 799941421 798919320 798245668 797821343 797341526 796723247 795966089 794885218
1215.6G94885218j509428j718819j774967j898765k006650j940549j768768j639664
$$ 794885218 793375790 791656971 789882004 787983239 785976589 784036040 782267272 780627608
1231.9G80627608j489877j199961r13859p34508n44011k91109m5240J01030K00152
$$ 780627608 779137731 777937770 777023911 776289403 775745392 775454283 775409043 775510073 775710225
1250.3G75710225K82943L02017K86520L32713M45962N16712N40078N82039O11663N67556
$$ 775710225 775993168 776295185 776581705 776914418 777360380 777877092 778417170 778999209 779610872 780178428
1270.7G80178428N11467M49836L22700J17361m1842m0591j132q6189k70664m11391
$$ 780178428 780689895 781139731 781462431 781579792 781537950 781497359 781496227 781410038 781139374 780727983
1291.1G80727983n80252q69989j180649j406133j581431j763105j917779j999855k080918
$$ 780727983 780147731 779277742 778097093 776690960 775109529 773346424 771428645 769428790 767347872
1309.4G67347872k257287k309680k096832j830339j613915j364351j220345j355410
$$ 767347872 765090585 762780905 760684073 758853734 757239819 755875468 754655123 753299713
1325.8G53299713j630187j739621j661122j619816j614451j531840j331090j164854
$$ 753299713 751669526 749929905 748268783 746648967 745034516 743502676 742171586 741006732
1342.1G41006732j155972j198829j193642j155019j016617q27372q28147j060843j365841
$$ 741006732 739850760 738651931 737458289 736303270 735286653 734459281 733631134 732570291 731204450
1360.4G31204450j536906j647353j955807k374649k653122l273249m144191m930914
$$ 731204450 729667544 728020191 726064384 723689735 721036613 717763364 713619173 708688259
1376.7G08688259q671284j7740964k1532119o454408J5851319K0142019R921133L219068
$$ 708688259 700016975 682276011 660743892 654289484 670140803 690282822 700203955 703423023
1393.1G03423023P39455k36988l51488Q583K95937N47051Q44181R90212R69827Q82864
$$ 703423023 704162478 703925490 703574002 703582585 703878522 704425573 705269754 706259966 707229793 708112657
1413.5G08112657Q32141R67264J466274J718819J907647K148747K032757J994789K014994
$$ 708112657 708944798 709912062 711378336 713097155 715004802 717153549 719186306 721181095 723196089
1431.8G23196089J615823J518964K061248K053857J654565J308143J201153J310468
$$ 723196089 724811912 726330876 728392124 730445981 732100546 733408689 734609842 735920310
1448.1G35920310J231372R65000Q69572J387238K626598K715290K244830K363264K737403
$$ 735920310 737151682 738116682 738986254 740373492 743000090 745715380 747960210 750323474 753060877
1466.5G53060877K893567L335238M569828N155445M661679L947019L094614K434909
$$ 753060877 755954444 759289682 763859510 769014955 773676634 777623653 780718267 783153176
1482.8G83153176J850427J142263M61042L30806J82449o98626j763880j835823j507640
$$ 783153176 785003603 786145866 786606908 786937714 787120163 786421537 784657657 782821834 781314194
1501.2G81314194j804530k981842l875017k273619j741112k209246k263129j814126
$$ 781314194 779509664 776527822 772652805 770379186 768638074 766428828 764165699 762351573
1517.5G62351573j434267j399517j158595j330614j812637j727581j832009k251446
$$ 762351573 760917306 759517789 758359194 757028580 755215943 753488362 751656353 749404907
1533.8G49404907j993596j962602k625108k116621j030326n55396m62830n62787l81172
$$ 749404907 747411311 745448709 742823601 740706980 739676654 739121258 738658428 738095641 737714469
1552.2G37714469j41263l51786q34346J0669N09799k87473j036108j451552j520276
$$ 737714469 737573206 737221420 736387074 736397743 736907542 736620069 735583961 734132409 732612133
1570.5G32612133j517892k201378k923846k472043k461553l006518l163695l307462
$$ 732612133 731094241 728892863 725969017 723496974 721035421 718028903 714865208 711557746
1586.8G11557746l620327l673493l396690l240109l132164k828718k561986k571940
$$ 711557746 707937419 704263926 700867236 697627127 694494963 691666245 689104259 686532319
1603.2F86532319k654612k603114k542079k514302k544344k865076l093004k474129
$$ 686532319 683877707 681274593 678732514 676218212 673673868 670808792 667715788 665241659
1619.5F65241659k389908k718687k548635k478123k280772j738608j673102j719654
$$ 665241659 662851751 660133064 657584429 655106306 652825534 651086926 649413824 647694170
1635.8F47694170o27458J26243J13428j7465K50459R98020R01163Q04722K364338K799988
$$ 647694170 647066712 647192955 647306383 647288918 647539377 648537397 649438560 650243282 652607620 655407608
1656.2F55407608K278626K523839L468990M076541L526032L782987M993797M734218
$$ 655407608 657686234 660210073 663679063 667755604 671281636 675064623 680058420 684792638
1672.5F84792638M646718N301535M861296M086435M342734O512761O484211N146801
$$ 684792638 689439356 694740891 699602187 703688622 708031356 714544117 721028328 726175129
1688.8G26175129N158663M774392M914641N256891N040288N886257M847467L554642
$$ 726175129 731333792 736108184 741022825 746279716 751320004 757206261 762053728 765608370
1705.1G65608370L498018L008366K190590J426160J031458J401008J718401J312912
$$ 765608370 769106388 772114754 774305344 775731504 776762962 778163970 779882371 781195283
1721.5G81195283J015544R80317P21515N43654O24299J052797J559317J451492J641393
$$ 781195283 782210827 783191144 783912659 784456313 785080612 786133409 787692726 789144218 790785611
1739.8G90785611K014160K072036K193034K464354K846718L135323K881825K705395
$$ 790785611 792799771 794871807 797064841 799529195 802375913 805511236 808393061 811098456
1756.1H11098456K599180K222419K262056K145111J504660J256883J543224J875818
$$ 811098456 813697636 815920055 818182111 820327222 821831882 823088765 824631989 826507807
1772.4H26507807J810729J443804J248061J097322Q76903Q48770R17793O12497K29359
$$ 826507807 828318536 829762340 831010401 832107723 832984626 833833396 834751189 835363686 835593045
1790.8H35593045O05821J056493P39753L66569N34057P97987O13809L90470M35114
$$ 835593045 836198866 837255359 837995112 838361681 838895738 839693725 840307534 840698004 841133118
1809.2H41133118N40197M80473M14490M52519M09066J75655P7784K76685K89917J74344
$$ 841133118 841673315 842153788 842568278 843020797 843429863 843605518 843683302 843959987 844249904 844424248
1829.6H44424248M49359N76019K92302J66058K62499J59621m1663K02179N14328M36366
$$ 844424248 844873607 845449626 845741928 845907986 846170485 846330106 846288443 846490622 847004950 847441316
1850H47441316K01642J37270K56836K36332R6620Q7380J22488o1572j26302L08931
$$ 847441316 847642958 847780228 848037064 848273396 848370016 848457396 848579884 848518312 848392010 848700941
1870.3H48700941N25593K35200J9133J09673J65224M7028K5690J31666R5070J5974
$$ 848700941 849226534 849461734 849480867 849590540 849755764 849802792 849828482 849960148 850055218 850071192
1890.7H50071192P5877J59680J32203K9743R8050K31027J04487j09136l6001J49369
$$ 850071192 850147069 850306749 850438952 850468695 850566745 850797772 850902259 850793123 850757122 850906491
1911.1H50906491Q2493q9824j0669J82986N6088m3035J50204J71602l8982p9453Q4103
$$ 850906491 850988984 850899160 850888491 851071477 851127565 851084530 851234734 851406336 851367354 851287901 851372004
1933.6H51372004R9897n1558j16289p0154l2247k7418O8069J64211K6941j37389m9531
$$ 851372004 851471901 851420343 851304054 851233900 851201653 851174235 851242304 851406515 851433456 851296067 851246536
1956H51246536K6226p6473o8307N3108J3590j00851n2452N7399j5855j62721o8128
$$ 851246536 851272762 851196289 851127982 851181090 851194680 851093829 851041377 851098776 851082921 850920200 850852072
1978.5H50852072J10030K9743j45972j05917k3186j23382j49727N0664J36793m8340
$$ 850852072 850962102 850991845 850845873 850739956 850716770 850593388 850443661 850494325 850631118 850582778
1998.8H50582778j73628o8486k4497j33276j02699M6313l219k01046j97768l3677n7101
$$ 850582778 850409150 850340664 850316167 850182891 850080192 850126505 850123286 849922240 849724472 849690795 849633694
2021.3H49633694j67489q9407K6464q0526k09570r9301M172j31488k13265m2558M2379
$$ 849633694 849466205 849376798 849403262 849322736 849113166 849013865 849018037 848886549 848673284 848630726 848673105
2043.7H48673105r5904j35839j1682l4094j82927j32441L7968m470j68503j16408K9207
$$ 848673105 848577201 848441362 848429680 848395586 848212659 848080218 848118186 848113716 847945213 847828805 847858012
2066.2H47858012m0353j26004Q762P4029r2089j43051L9398P2122j16527j35362L0577
$$ 847858012 847817659 847691655 847700417 847774446 847682357 847539306 847578704 847650826 847534299 847398937 847429514
2088.6H47429514L6955r4831o6102N0605n186q0049N0426J40964j7404j27912P809
$$ 847429514 847466469 847371638 847305536 847356141 847350955 847270906 847321332 847462296 847444892 847316980 847324789
2111H47324789J01208k5689q4460N7459Q9466o8068p9870O6220L8982j12653n7340
$$ 847324789 847425997 847400308 847315848 847373307 847462773 847394705 847314835 847381055 847420037 847307384 847250044
2133.5H47250044J21236O7115o5505K3007J11580O55o7293N3346J09673j5080n4300
$$ 847250044 847371280 847438395 847372890 847395897 847507477 847508132 847440839 847494185 847603858 847588778 847534478
2155.9H47534478O8426P7963m2320j4901J05977P1764j4007M1068J26183M5955o2466
$$ 847534478 847602904 847680867 847638547 847623646 847729623 847801387 847787380 847828448 847954631 848000586 847938120
2178.3H47938120M3750J64867M1127p9632K9326R3579o616J6689J66416J26243n0009
$$ 847938120 847981870 848146737 848187864 848108232 848137558 848231137 848224521 848241210 848407626 848533869 848483860
2200.8H48483860m0531R9838Q6010l9101j8954O8187m530p3671K7180P3075m8041q7142
$$ 848483860 848443329 848543167 848629177 848590076 848571122 848639309 848634779 848561108 848588288 848661363 848613322 848526180
2225.2H48526180O0499J22725k1994q2671K6822J7941p8857j788J18673N3882p8797
$$ 848526180 848586679 848709404 848687410 848604739 848631561 848649502 848570645 848568857 848687530 848741412 848662615
2247.7H48662615o4910K6942m530q3983l4154L7372k2471p9572q046N4717j1862p6532
$$ 848662615 848597705 848624647 848620117 848536134 848501980 848539352 848516881 848437309 848429263 848483980 848472118 848395586
2272.2H48395586k2411J0490m9531m0830L7730k1338j82629j82927p7605r8526j58906
$$ 848395586 848373175 848383665 848334134 848293304 848331034 848309696 848127067 847944140 847866535 847768009 847609103
2294.6H47609103j11223q1419j91451k76982k05756j92880l44038l85404k53260k33233
$$ 847609103 847497880 847416461 847225010 846948028 846742272 846549392 846205354 845819950 845566690 845333457
2315H45333457m07338n39601m74811l59535l61204m11093m13776l85582l44694k42114
$$ 845333457 844926119 844386518 843911707 843552172 843190968 842779875 842366099 841980517 841635823 841393709
2335.4H41393709j41620k26617k81811M2260N43713N20051r4474o79671r54628j034499
$$ 841393709 841252089 841025472 840743661 840785921 841329634 841849685 841755211 841075540 840120912 839086413
2355.8H39086413q37504l87431j21116L6835M01080O53505N69225N17428O48260O81102
$$ 839086413 838248909 837861478 837740362 837777197 838178277 838831782 839401007 839918435 840566695 841247797
2376.2H41247797N31137M42386M41253K71797m5359j98662j61469j85073l05593k95698
$$ 841247797 841778934 842221320 842662573 842934370 842889011 842690349 842528880 842343807 842038214 841742516
2396.6H41742516j51277j09375j59144j21593n9843j48774k42650j57237r4056k09570
$$ 841742516 841591239 841481864 841322720 841201127 841141284 840992510 840749860 840592623 840498567 840288997
2417H40288997k99335k80857l73185m92990k72333J32859K13086J1504p2360m4048
$$ 840288997 839989662 839708805 839335620 838842630 838570297 838703156 838916242 838927746 838855386 838811338
2437.4H38811338j24157k09450j26720l8266j23918k21789j66058j16289k01464k43902
$$ 838811338 838687181 838477731 838351011 838312745 838188827 837967038 837800980 837684691 837483227 837239325
2457.8H37239325j50800j30355k34604k41578j59263j77086k37643j91927j30236k02597
$$ 837239325 837088525 836958170 836723566 836481988 836322725 836145639 835907996 835716069 835585833 835383236
2478.1H35383236k90155k41041j93179k55763k79069j93596j68801k42292k30730j68979
$$ 835383236 835093081 834852040 834658861 834403098 834124029 833930433 833761632 833519340 833288610 833119631
2498.5H33119631k30670l03090k22444j46389k17915k75314k27272k15292k61128k28763
$$ 833119631 832888961 832585871 832363427 832217038 831999123 831723809 831496537 831281245 831020117 830791354
2518.9H30791354j58310j73628k34723k36571k03550k34544k64943j99556j43528k06411
$$ 830791354 830633044 830459416 830224693 829988122 829784572 829550028 829285085 829085529 828942001 828735590
2539.3H28735590k67983k13265j90496k80023l21031k34902j53720j99377k71202k51114
$$ 828735590 828467607 828254342 828063846 827783823 827462792 827227890 827074170 826874793 826603591 826352477
2559.7H26352477k37703k84314k72215k00152j80066k16365k55704k97904l32355k93672
$$ 826352477 826114774 825830460 825558245 825358093 825178027 824961662 824705958 824408054 824075699 823782027
2580.1H23782027k22445k36392k88248k85387k48492k65836l28243l11673k74181l03447
$$ 823782027 823559582 823323190 823034942 822749555 822501063 822235227 821906984 821595311 821321130 821017683
2600.5H21017683l18289k94268l06785l31223l05772k80083k85387k97010k96771l22282
$$ 821017683 820699394 820405126 820098341 819767118 819461346 819181263 818895876 818598866 818302095 817979813
2620.9H17979813l53218l34322l24309l51429l53396l09646k91049l25024l66271l93689
$$ 817979813 817626595 817292273 816967964 816616535 816263139 815953493 815662444 815337420 814971149 814577460
2641.3H14577460l88622l56138l41058l52501l74079l88503l69668l53396l68238l66032
$$ 814577460 814188838 813832700 813491642 813139141 812765062 812376559 812006891 811653495 811285257 810919225
2661.7H10919225l43561l61919m32372m32194l30507l11912l96490m20391l83973m10080
$$ 810919225 810575664 810213745 809781373 809349179 809018672 808706760 808310270 807889879 807505906 807095826
2682.1H07095826m76420m54903l83079l68357l87311l93271m10974m46677m60327m51803
$$ 807095826 806619406 806164503 805781424 805413067 805025756 804632485 804221511 803774834 803314507 802862704
2702.5H02862704m51982m59612m28140l81827m12822m78685m85003m70519m78685m61340
$$ 802862704 802410722 801951110 801522970 801141143 800728321 800249636 799764633 799294114 798815429 798354089
2722.9G98354089m13835m26650n07235n09322m21643l82006l94762m16815m26352m23611
$$ 798354089 797940254 797513604 797006369 796497047 796075404 795693398 795298636 794881821 794455469 794031858
2743.3G94031858m18126l85285m03761m99487n21422m29034l90708m83215n23269m25578
$$ 794031858 793613732 793228447 792824686 792325199 791803777 791374743 790984035 790500820 789977551 789551973
2763.7G89551973l43918l80397m41850m23312m61757o00755o22749n39005n37396n60403
$$ 789551973 789208055 788827658 788385808 787962496 787500739 786899984 786277235 785738230 785200834 784640431
2784.1G84640431m75525m05848n14687o54459o42478n86569o34492p07388o71625o40333
$$ 784640431 784164906 783759058 783244371 782589912 781947434 781360865 780726373 780018985 779347360 778707027
2804.5G78707027p02381p20322p07149p52569p80284p58827p70688q45611r00626r05454
$$ 778707027 778004646 777284324 776577175 775824606 775044322 774285495 773514807 772669196 771768570 770863116
2824.9G70863116r60887j062870j078486j075864j216769j436591j690627k060651
$$ 770863116 769902229 768839359 767760873 766685009 765468240 764031649 762341022 760280371
2841.2G60280371k550066l070235l314793k943814k022862j011670k92301O8784O7234
$$ 760280371 757730305 754660070 751345277 748401463 746378601 745366931 745074630 745143414 745210648
2859.5G45210648j89543m93646p87377j051486j089215q52525o98686o99162n75364
$$ 745210648 745021105 744527459 743740082 742688596 741599381 740746856 740048170 739349008 738773644
2877.9G38773644m28498m75168o20782p42913q48114r71616j076817j101732j159609
$$ 738773644 738345146 737869978 737249196 736506283 735658169 734686553 733609736 732508004 731348395
2896.3G31348395j313388j372695j323879j394272j607239j802981k041638k480864
$$ 731348395 730035007 728662312 727338433 725944161 724336922 722533941 720492303 718011439
2912.6G18011439k923250k956212k501070j843751j159370n05805L9518M06861N42045
$$ 718011439 715088189 712131977 709630907 707787156 706627786 706121981 706161499 706568360 707110405
2930.9G07110405O51121Q89123J098394J238585J372754J394272J159966O95586K65956
$$ 707110405 707761526 708650649 709749043 710987628 712360382 713754654 714914620 715610206 715876162
2949.3G15876162M9055j43946k82168j09732K20299M96328P60316J034081J271964
$$ 715876162 715925217 715781271 715499103 715389371 715609670 716105998 716866314 717900395 719172359
2967.6G19172359J471459J641512J633644J406968J257062J198411R39727O26266N75781
$$ 719172359 720643818 722285330 723918974 725325942 726583004 727781415 728721142 729347408 729923189
2986G29923189O67631O53148M41730J29998l7551j81079l94821m27604m08113m89414
$$ 729923189 730590820 731243968 731685698 731815696 731778145 731597066 731202245 730774641 730366528 729877114
3006.4G29877114m47631l16917l97206o40690p52032p51078q31246q75175q45373q76963
$$ 729877114 729429483 729112566 728715360 728074670 727322638 726571560 725740314 724865139 724019766 723142803
3026.8G23142803q56281p62164o84262p23600q81135q81553p54476q08537j023292
$$ 723142803 722286522 721524358 720840096 720116496 719235361 718353808 717599332 716790795 715767503
3045.1G15767503j095414r62139r15169j013994j036227j015842j017451r38297q03649
$$ 715767503 714672089 713709950 712794781 711780787 710744560 709728718 708711267 707772970 706969321
3063.5G06969321p05898p69198r38058r54866q14021o45161n50627o54459q62241r56953
$$ 706969321 706263423 705494225 704556167 703601301 702787280 702142119 701591492 700937033 700074792 699117839
3083.9F99117839r20891q26836q23259r57013r60826p94948p26699q35717r63986r55343
$$ 699117839 698196948 697370112 696546853 695589840 694629014 693834066 693107367 692271650 691307664 690352321
3104.3F90352321q51333q02815q86858r40680q44181p90238q90255j112521j320303
$$ 690352321 689500988 688698173 687811315 686870635 686026454 685236216 684345961 683233440 681913137
3122.6F81913137j307308j153112j071095j125217j197457j129389j003682j023770
$$ 681913137 680605829 679452717 678381622 677256405 676058948 674929559 673925877 672902107
3139F72902107j225590j395584j401722j321673j138747j000166j203239j502931j525462
$$ 672902107 671676517 670280933 668879211 667557538 666418791 665418625 664215386 662712455 661186993
3157.3F61186993j452327j429021j381874j378894j422346j412034j384675j412332
$$ 661186993 659734666 658305645 656923771 655544877 654122531 652710497 651325822 649913490
3173.6F49913490j441181j413703j347005j338601j407624j413703j344800j347243
$$ 649913490 648472309 647058606 645711601 644373000 642965376 641551673 640206873 638859630
3189.9F38859630j393855j383662j392961j421511j374543j289546j238227j255751
$$ 638859630 637465775 636082113 634689152 633267641 631893098 630603552 629365325 628109574
3206.3F28109574j300633j276970j220166j218736j219035j168251j176357j280427
$$ 628109574 626808941 625531971 624311805 623093069 621874034 620705783 619529426 618248999
3222.6F18248999j296162j180053j115859j104176j082659j210153j400649j358152
$$ 618248999 616952837 615772784 614656925 613552749 612470090 611259937 609859288 608501136
3238.9F08501136j194358j126825j108706j151383j267970j301765j262784j258672
$$ 608501136 607306778 606179953 605071247 603919864 602651894 601350129 600087345 598828673
3255.2E98828673j277923j302421j304925j249134j178503j107276j012564j066267
$$ 598828673 597550750 596248329 594943404 593694270 592515767 591408491 590395927 589329660
3271.5E89329660j239181j255929j156390j084447j068711j054347r82284q75712p50601
$$ 589329660 588090479 586834550 585678160 584593713 583525002 582470655 581488371 580612659 579862058
3289.9E79862058o99639p65979q56996r50515r80199p89940n50449o34968r31025j109838
$$ 579862058 579162419 578396440 577539444 576588929 575608730 574818790 574268341 573633373 572702348 571592510
3310.3E71592510j134515j065195j014650j071095j138866j112342j061141j137555
$$ 571592510 570457995 569392800 568378150 567307055 566168189 565055847 563994706 562857151
3326.6E62857151j274049j293361j248301j190185j091063j111090j259029j319707
$$ 562857151 561583102 560289741 559041440 557851255 556760192 555649102 554390073 553070366
3342.9E53070366j302600j209795j032829j099170j405477j446307j178026j049995
$$ 553070366 551767766 550557971 549525142 548425972 547020495 545574188 544396162 543346167
3359.2E43346167j157046j136064q78454p59303r78172j314342j390398j134455r27984
$$ 543346167 542189121 541053057 540174603 539415300 538437128 537122786 535732388 534597933 533669949
3377.6E33669949r37939j032293j043498q83043o19173l96431m82142q47935r71497
$$ 533669949 532732010 531699717 530656219 529773176 529154003 528757572 528275430 527427495 526455998
3395.9E26455998o04987k89023n68151r61721q41141n48363m52518m47929n15997n30243
$$ 526455998 525851011 525561988 524993837 524032116 523190975 522642612 522190094 521742165 521226168 520695925
3416.3E20695925l62754k41637k01106p1526J11997K26677J87933K02715L30508K10226
$$ 520695925 520333171 520091534 519890428 519818902 519930899 520157576 520345509 520548224 520878732 521088958
3436.7E21088958r5844j07706J58131L92318N31077N43058N11229N66900P06494Q82208
$$ 521088958 520993114 520885408 521043539 521435857 521966934 522509992 523021221 523588121 524294615 525176823
3457.1E25176823R64999Q38578Q16703J149714J384795J077473O20961O83844J069963
$$ 525176823 526141822 526980400 527797103 528946817 530331612 531409085 532030046 532713890 533783853
3475.5E33783853J310945J247823R93728R90689J228214J286983J237094J312495J431703
$$ 533783853 535094798 536342621 537336349 538327038 539555252 540842235 542079329 543391824 544823527
3493.8E44823527J495004J406670J333952J461207J464367J256049J268983J552582
$$ 544823527 546318531 547725201 549059153 550520360 551984727 553240776 554509759 556062341
3510.2E56062341J781225J705766J493394J473248J614928J834631J811505J542627
$$ 556062341 557843566 559549332 561042726 562515974 564130902 565965533 567777038 569319665
3526.5E69319665J564920J807928J948894K045273K021313J869321J959443K172410
$$ 569319665 570884585 572692513 574641407 576686680 578707993 580577314 582536757 584709167
3542.8E84709167K184928K025664J873731J907885K078236K164960K213478K321720
$$ 584709167 586894095 588919759 590793490 592701375 594779611 596944571 599158049 601479769
3559.1F01479769K257824J885831J771689K559423L143370K693534K311230K417028
$$ 601479769 603737593 605623424 607395113 609954536 613097906 615791440 618102670 620519698
3575.4F20519698K614259K747536K773762K532661K326309K640367K954066K661884
$$ 620519698 623133957 625881493 628655255 631187916 633514225 636154592 639108658 641770542
3591.7F41770542K478957K708793K944409L005445K949298K659976K349437K566814
$$ 641770542 644249499 646958292 649902701 652908146 655857444 658517420 660866857 663433671
3608.1F63433671K890706K876103K859950K660155K801299L405869L061295K105176
$$ 663433671 666324377 669200480 672060430 674720585 677521884 680927753 683989048 686094224
3624.4F86094224J627684K526045L728032L185511K661824K525270K328694K265155
$$ 686094224 687721908 690247953 693975985 697161496 699823320 702348590 704677284 706942439
3640.7G06942439K099633J614988J431167K518654L469050K483487J824379K351701
$$ 706942439 709042072 710657060 712088227 714606881 718075931 720559418 722383797 724735498
3657G24735498K395571J730799J319707J055598P34687R99272J503944J027703J152456
$$ 724735498 727131069 728861868 730181575 731237173 731971860 732971132 734475076 735502779 736655235
3675.4G36655235J876891J580238J245678J054346P33674O98328J043320J128852R44555
$$ 736655235 738532126 740112364 741358042 742412388 743146062 743844390 744887710 746016562 746961117
3693.7G46961117P59721M86373K81692N05984P80702M83751j013N1379Q75830J141429
$$ 746961117 747720838 748207211 748488903 748994887 749775589 750259340 750258327 750309706 751185536 752326965
3714.1G52326965N36859J19210L4034M1902J32561L74913L62813o4075l05414J93238
$$ 752326965 752863824 752983034 753017068 753058970 753191531 753566444 753929257 753865182 753559768 753753006
3734.5G53753006J076460Q99077k50340q38339r596N04672p8440K80321J058102P02440
$$ 753753006 754829466 755728543 755478203 754639864 754630268 755134940 755056500 755336821 756394923 757097363
3754.9G57097363J88530K58505M14670J42813j610Q0228J98126M10736L59237R9778
$$ 757097363 757285893 757544398 757959068 758101881 758100271 758180499 758378625 758789361 759148598 759248376
3775.3G59248376K682J41561J31786m1783P9215K43008J90258J3947k29478k35736
$$ 759248376 759251058 759392619 759524405 759482622 759561837 759804845 759995103 760009050 759779572 759543836
3795.7G59543836j84238l00526O4790K82526P5996L77118M23313j32680n33045k99752
$$ 759543836 759359598 759059072 759123862 759406388 759482384 759859502 760282815 760150135 759617090 759317338
3816.1G59317338p0452o9857L89874M26054J45614J9908j65760k17438j78397j85907
$$ 759317338 759246886 759177029 759566903 759992957 760138571 760158479 759992719 759775281 759596884 759410977
3836.5G59410977J4007K58327L56913M34279J25766n77927j193046o68347J042187
$$ 759410977 759424984 759683311 760040224 760474503 760600269 760022342 758829296 758160949 759203136
3854.8G59203136J006484J33455l41773l93450r9063j57357k43723J59383L21507K30074
$$ 759203136 760209620 760343075 760001302 759607852 759508789 759351432 759107709 759267092 759588599 759818673
3875.2G59818673r1731l29197l5047J14739J92165J64449j94073q9228J94311j09374
$$ 759818673 759726942 759397745 759362698 759477437 759669602 759834051 759639978 759550750 759745061 759635687
3895.6G59635687n09858n37753k16186L22043O13928L04818m9233j26421j99259k22981
$$ 759635687 759125829 758588076 758371890 758693933 759307861 759612679 759563446 759437025 759237766 759014785
3916G59014785j9848P0274q4937q4042K6703r3401j82271J4782J64688K1815j78456
$$ 759014785 758994937 759065211 758980274 758896232 758922935 758829534 758647263 758662045 758826733 758848548 758670092
3938.5G58670092k44618j50859n4658p0929j5676N7041k0861j00672p3910p4506j00434
$$ 758670092 758425474 758274615 758219957 758149028 758133352 758190393 758169532 758068860 757994950 757920444 757820010
3960.9G57820010l3855K5868j1384q0109p0274l4213n5015m8041k5154l8504m4823
$$ 757820010 757786155 757812023 757800639 757720530 757650256 757616043 757561028 757512987 757487833 757449329 757404506
3983.3G57404506r1612j99378j81317j6630N5492n424q4460
$$ 757404506 757312894 757113516 756932199 756915569 756971061 756965637 756881177
3997.6G56881177
$$ 756881177
##END=$$ End of the data block
