##TITLE=$$ Begin of the data block
##JCAMP-DX=5.00 $$ ACD/SpecManager v 10.08
##SPECTROMETER/DATA SYSTEM=Alpha
##DATE=10 Nov 2014 10:35:34
##DATA TYPE=INFRARED SPECTRUM
##DATA CLASS=XYDATA
##ORIGIN=
##OWNER=
##NPOINTS=1765
##FIRSTX=399.76428223
##LASTX=3997.64306641
##MAXX=3997.64306641
##MINX=399.76428223
##MAXY=0.85312444
##MINY=0.51819026
##XFACTOR=1.0000000000
##YFACTOR=1.000000000000000e-9
##FIRSTY=0.80097073
##DELTAX=2.03961372
##XUNITS=1/CM
##YUNITS=ARBITRARY UNITS
##XYDATA=(X++(Y..Y))
$$ plain form
399.8 800970733 800291896 802172899 802550435 800687611 800393164 801130354 799261153 796438813 796154559
418.1 796154559 796123624 793716192 792509615 793253958 792331040 789966941 789959788 791151285 789902031
436.5 789902031 788410366 789151728 789007425 786684930 786051035 787456453 786852419 784698725 784723222
454.8 784723222 785347104 783538997 782293081 783494055 783555627 781225502 780250251 780932128 779886663
473.2 779886663 778489411 779439747 780004680 777901530 776454270 777561307 777684033 775764823 775372922
491.5 775372922 776526034 775513649 773391962 773401678 773703218 771731734 770134449 770587265 769920886
509.9 769920886 767221212 765872240 766125917 764777541 762634039 762559652 762780547 761052608 759720504
528.3 759720504 760169387 759756267 757611811 756532729 757145584 756916463 756314218 757723331 759649038
$$ packed form
399.8H00970733o78837J881003L77536j862824k94447P37190j869201k822340k84254
418.1G96154559l0935k407432j206577P44343r22918k364099p153J191497j249254
436.5G89902031j491665P41362j44303k322495o33895J405418o04034k153694K4497
454.8G84723222O23882j808107j245916J200974O1572k330125r75251O81877j045465
473.2G79886663j397252R50336N64933k103150j447260J107037J22726j919210l91901
491.5G75372922J153112j012385k121687R716L01540j971484j597285M52816o66379
509.9G69920886k699674j348972K53677j348376k143502p4387K20895j727939j332104
528.3G59720504M48883m13120k144456j079082O12855k29121o02245J409113J925707
$$ plain form
546.6 759649038 759493828 758783519 759505212 759842873 758541882 757997692 759076357 759278655 758348107
565 758348107 758540034 759419501 758883357 757815838 758172810 758770406 758050323 757532120 758174360 758192897
585.4 758192897 757162571 756925583 757541478 757278383 756373763 756375551 756788790 756204247 755255878 755145431
605.8 755145431 754909873 753482699 752134323 751789331 751253068 750274003 750547051 752150953 753360331
624.1 753360331 754066408 755473197 757055998 757472694 757419288 758298814 759457886 759836614 760289013
642.5 760289013 761678576 762941062 763263106 763891459 765381575 766228616 766083181 766392112 767243564
660.8 767243564 767336071 766638398 766234100 766975164 767834008 768638849 770333886 772102237 772803247 773606241
681.2 773606241 775262058 776302695 776275516 776768267 778025448 778460026 778101623 778546154 779564738
$$ packed form
546.6G59649038j55210p10309P21693L37661j300991n44190J078665K02298r30548
565G58348107J91927Q79467n36144j067519L56972N97596p20083n18203O42240J8537
585.4G58192897j030326k36988O15895k63095r04620J788M13239n84543r48369j10447
605.8G55145431k35558j427174j348376l44992n36263r79065K73048J603902J209378
624.1G53360331P06077J406789J582801M16696n3406Q79526J159072L78728M52399
642.5G60289013J389563J262486L22044O28353J490116Q47041j45435L08931Q51452
660.8G67243564R2507o97673m04298P41064Q58844Q04841J695037J768351P01010Q02994
681.2G73606241J655817J040637k7179M92751J257181M34578l58403M44531J018584
$$ plain form
699.6 779564738 779764354 779861748 781231284 782823443 783296525 783821344 785451591 786781788 787077427
717.9 787077427 788065553 790288150 791842103 792506397 794057190 796135545 796998978 797413945 798869610
736.3 798869610 800246596 800334394 800526500 801831722 802732706 802596986 803113282 804436147 804696560
754.7 804696560 804162323 804711223 805790842 805735826 805450976 806452394 807588637 807577550 807811677 809316397
775.1 809316397 810446024 810531557 811419368 813414216 814611197 815026343 816459835 818396747 819110513
793.4 819110513 819492340 821060121 822581530 822802365 823193014 824639022 825501919 825239599 825621188
811.8 825621188 826916695 827331901 826906323 827229977 827600598 826467693 825102448 825172484 825441599
830.1 825441599 824865103 825249374 827501774 829693437 830949426 832527459 834372878 835098386 835055411
$$ packed form
699.6G79564738J99616R7394J369536J592159M73082N24819J630247J330197K95639
717.9G87077427R88126K222597J553953O64294J550793K078355Q63433M14967J455665
736.3G98869610J376986Q7798J92106J305222R00984j35720N16296J322865K60413
754.7H04696560n34237N48900J079619n5016k84850J001418J136243j1087K34127J504720
775.1H09316397J129627Q5533Q87811J994848J196981M15146J433492J936912P13766
793.4H19110513L81827J567781J521409K20835L90649J446008Q62897k62320L81589
811.8H25621188J295507M15206m25578L23654L70621j132905j365245P0036K69115
830.1H25441599n76496L84271K252400K191663J255989J578033J845419P25508m2975
$$ plain form
848.5 835055411 835582018 836268663 836213708 836341977 837629020 838947475 839152277 839197636 839889407 840173960
868.9 840173960 839556932 839171469 839272022 838804066 837811768 837220907 836726844 835482001 833982468
887.2 833982468 833149135 832519174 831481576 830860078 831247628 831779778 831904113 832254767 832940638 833051801
907.6 833051801 832468867 832077742 831972003 831433415 830618978 830326080 830365956 830065191 829686761 829683959
928 829683959 829546869 828723311 827589452 826432288 824650288 821954846 818983316 815947771 812376797
946.4 812376797 808462560 805085897 802496314 800264835 798420966 797239184 796315908 795088530 793720484
964.7 793720484 792511046 791056991 788897514 786202550 783119142 779260337 774479926 769330144
981.1 769330144 764203906 758952498 753728330 749118268 745247424 741616428 737885237 734089255
$$ packed form
848.5H35055411N26607O86645n4955J28269J287043J318455K04802M5359O91771K84553
868.9H40173960o17028l85463J00553m67956r92298n90861m94063j244843j499533
887.2H33982468q33333o29961j037598o21498L87550N32150J24335L50654O85871J11163
907.6H33051801n82934l91125j05739n38588q14437k92898L9876l00765l78430k802
928H29683959j37090q23558j133859j157164j782000k695442k971530l035545l570974
946.4H12376797l914237l376663k589583k231479j843869j181782r23276j227378j368046
964.7G93720484j209438j454055k159477k694964l083408l858805m780411n149782
981.1G69330144n126238n251408n224168m610062l870844l630996l731191l795982
$$ plain form
997.4 734089255 729957640 725077391 719808161 714878619 710359335 706076741 702342451 699367642
1013.7 699367642 696763575 694271624 692189515 690665901 689376593 688192964 687437057 687126458 686858237
1032 686858237 686712921 687137604 687836468 688002646 687529743 686847448 685970724 684822261 683820724 683214903
1052.4 683214903 682646573 681910694 681369066 681234658 681174159 680979550 680835009 680694699 680328667 680052221
1072.8 680052221 680455029 681595027 683212101 685268581 687606335 689608037 690850973 691569149 691929519
1091.2 691929519 691635013 690729558 689802110 689056158 688308537 687888205 688401699 689840198 691787124
1109.6 691787124 694236636 697380185 700868487 704121828 707088590 709933281 712444425 714547813
1125.9 714547813 716718256 719219565 721582949 723409355 724839568 725792348 726011097 725911677 726154506
$$ packed form
997.4G34089255m131615m880249n269230m929542m519284m282594l734290k974809
1013.7F99367642k604067k491951k082109j523614j289308j183629p55907l10599k68221
1032F86858237j45316M24683O98864J66178m72903o82295q76724j148463j001537o05821
1052.4F83214903n68330p35879n41628j34408o0499j94609j44541j40310l66032k76446
1072.8F80052221M02808J139998J617074K056480K337754K001702J242936P18176L60370
1091.2F91929519k94506r05455r27448p45952p47621m20332N13494J438499J946926
1109.6F91787124K449512L143549L488302L253341K966762K844691K511144K103388
1125.9G14547813K170443K501309K363384J826406J430213R52780K18749r9420K42829
$$ plain form
1144.2 726154506 726793528 727692425 729085863 731078923 733304441 735606670 738329530 741654873 745444179
1162.6 745444179 749805391 755012453 760833025 766683638 772397518 778077602 783448815 788118482
1178.9 788118482 792135477 795690298 798578322 800623715 802085876 803089261 803398848 803000331 802246571
1197.3 802246571 801343560 800284863 799269319 798587263 798134267 797600269 796938896 796196759 795149803
1215.6 795149803 793619812 791835487 790039480 788178325 786193550 784253597 782493651 780868948
1231.9 780868948 779399216 778227925 777344286 776615739 776081145 775834382 775812626 775906682 776114643 776416481
1252.3 776416481 776715517 776969373 777266860 777704954 778233707 778765619 779323995 779939473 780535817 781053722
1272.7 781053722 781468749 781738937 781823039 781790972 781771302 781765997 781679153 781434536 781033635 780427456 779524446
$$ packed form
1144.2G26154506O39022Q98897J393438J993060K225518K302229K722860L325343L789306
1162.6G45444179M361212N207062N820572N850613N713880N680084N371213M669667
1178.9G88118482M016995L554821K888024K045393J462161J003385L09587l98517p53760
1197.3H02246571r03011j058697j015544o82056m52996n33998o61373p42137j046956
1215.6G95149803j529991j784325j796007j861155j984775j939953j759946j624703
1231.9G80868948j469732j171291q83639p28547n34594k46763k1756R4056K07961L01838
1252.3G76416481K99036K53856K97487M38094N28753N31912N58376O15478N96344N17905
1272.7G81053722M15027K70188Q4102l2067j9670n305q6844k44617m00901o06179r03010
$$ plain form
1295.2 779524446 778307915 776866078 775263906 773495138 771591723 769603491 767506719 765231490
1311.5 765231490 762908936 760790110 758928061 757282138 755893946 754645944 753277421 751669288
1327.8 751669288 749946296 748279035 746650457 745016098 743453026 742111564 740937710 739741147
1344.1 739741147 738516927 737353683 736253500 735278130 734493077 733735025 732738256 731401622 729887903
1362.5 729887903 728322208 726492047 724224031 721683979 718616247 714788496 710256338 702279985
1378.8 702279985 685928881 666033149 659971416 674441338 692894816 701965213 704851389 705427945
1395.1 705427945 705138326 704823017 704845607 705053389 705497563 706309080 707260132 708131671 708904028 709644318
1415.5 709644318 710519314 711932480 713666141 715572357 717688620 719680488 721631110 723608553
$$ packed form
1295.2G79524446j216531j441837j602172j768768j903415j988232k096772k275229
1311.5G65231490k322554k118826j862049j645923j388192j248002j368523j608133
1327.8G51669288j722992j667261j628578j634359j563072j341462j173854j196563
1344.1G39741147j224220j163244j100183r75370p85053p58052r96769j336634j513719
1362.5G29887903j565695j830161k268016k540052l067732l827751m532158p976353
1378.8G02279985j6351104j9895732o061733J4469922J8453478R070397K886176N76556
1395.1G05427945k89619l15309K2590K07782M44174Q11517R51052Q71539P72357P40290
1415.5G09644318Q74996J413166J733661J906216K116263J991868J950622J977443
$$ plain form
1431.8 723608553 725181818 726651669 728693068 730750203 732396841 733696699 734894037 736189365
1448.1 736189365 737404466 738358438 739207268 740562916 743189514 745936036 748203158 750584960 753341973
1466.5 753341973 756223679 759511232 764059484 769263804 773993254 777981877 781080484 783503532
1482.8 783503532 785352767 786495864 786941588 787279010 787477493 786758542 784988940 783195555 781717896
1501.2 781717896 779891431 776826203 772922277 770757973 769092560 766881704 764582634 762744963
1517.5 762744963 761315584 759947300 758833349 757536411 755741715 754005909 752154410 749926329
1533.8 749926329 747973561 745982945 743297815 741217315 740255833 739759326 739338338 738758862 738314986
1552.2 738314986 738130808 737749457 736849189 736848116 737400353 737126231 736073494 734593987 733054519
$$ packed form
1431.8G23608553J573265J469851K041399K057135J646638J299858J197338J295328
1448.1G36189365J215101R53972Q48830J355648K626598K746522K267122K381802K757013
1466.5G53341973K881706L287553M548252N204320M729450L988623L098607K423048
1482.8G83503532J849235J143097M45724L37422J98483p18951j769602j793385j477659
1501.2G81717896j826465l065228l903926k164304j665413k210856k299070j837671
1517.5G62744963j429379j368284j113951j296938j794696j735806j851499k228081
1533.8G49926329j952768j990616k685130k080500r61482m96507m20988n79476m43876
1552.2G38314986j84178l81351r00268j073N52237k74122j052737j479507j539468
$$ plain form
1570.5 733054519 731507897 729244232 726282716 723837852 721390843 718365610 715166211 711828530
1586.8 711828530 708194435 704488635 701048255 697786152 694618702 691707432 689047575 686412573
1603.2 686412573 683737397 681129217 678555489 675974905 673355818 670386374 667176366 664644718
1619.5 664644718 662201881 659420907 656877995 654435575 652160287 650414944 648720562 646987498
1635.8 646987498 646410465 646614432 646819949 646890700 647206664 648282707 649251521 650122404 652627230
1654.1 652627230 655559719 657944739 660554409 664072156 668194532 671761274 675568938 680600047
1670.5 680600047 685387969 690105975 695457578 700308144 704369843 708694935 715228796 721787095
1686.8 721787095 727005959 732200384 736953914 741835833 747085154 752133250 758087277 763020337
$$ packed form
1570.5G33054519j546622k263665k961516k444864k447009l025233l199399l337681
1586.8G11828530l634095l705800l440380l262103l167450k911270k659857k635002
1603.2F86412573k675176k608180k573728k580584k619087k969444l210008k531648
1619.5F64644718k442837k780974k542912k442420k275288j745343j694382j733064
1635.8F46987498n77033K03967K05517P0751L15964J076043R68814Q70883K504826
1654.1F52627230K932489K385020K609670L517747M122376L566742L807664N031109
1670.5F80600047M787922M718006N351603M850566M061699M325092O533861O558299
1686.8G21787095N218864N194425M753530M881919N249321N048096N954027M933060
$$ plain form
1703.1 763020337 766629338 770166814 773194730 775394022 776819885 777840555 779253006 781006932
1719.4 781006932 782356322 783404052 784416795 785181463 785744667 786319077 787325501 788927317 790410101
1737.8 790410101 792051256 794072747 796139419 798304975 800754309 803630948 806820631 809731066
1754.1 809731066 812427580 815011561 817234516 819508433 821655810 823140562 824391723 825956404
1770.4 825956404 827852845 829683423 831141114 832401395 833529830 834437370 835292816 836197317 836786687
1788.8 836786687 836993098 837598503 838691890 839465678 839837193 840375602 841193855 841824353 842213571
1807.1 842213571 842626572 843142867 843610466 844016373 844470143 844887137 845076799 845189691 845504165 845776677
1827.5 845776677 845892787 846348405 846991420 847306430 847446561 847704828 847869337 847806752 848003566 848545313
$$ packed form
1703.1G63020337L609001L537476L027916K199292J425863J020670J412451J753926
1719.4G81006932J349390J047730J012743P64668N63204N74410J006424J601816J482784
1737.8G90410101J641155K021491K066672K165556K449334K876639L189683K910435
1754.1H09731066K696514K583981K222955K273917K147377J484752J251161J564681
1770.4H25956404J896441J830578J457691J260281J128435R07540Q55446R04501N89370
1788.8H36786687K06411O05405J093387P73788L71515N38409Q18253O30498L89218
1807.1H42213571M13001N16295M67599M05907M53770M16994J89662J12892L14474K72512
1827.5H45776677J16110M55618O43015L15010J40131K58267J64509o2585J96814N41747
$$ plain form
1847.9 848545313 848998129 849188566 849324048 849597156 849835873 849921584 850014031 850144923 850047886 849866271
1868.3 849866271 850171685 850721717 850970387 851012468 851161897 851349115 851377666 851368010 851480484 851585269
1888.7 851585269 851642311 851755679 851916492 852035642 852052927 852139652 852373183 852491736 852395535 852374554
1909.1 852374554 852552354 852639675 852507710 852460980 852638364 852682292 852636218 852819681 853010237 852963209
1929.5 852963209 852897704 853012741 853124440 853050292 852882862 852765381 852726221 852732301 852829874 852999330 853027165
1951.9 853027165 852877021 852805138 852852702 852819502 852747977 852787018 852817595 852726042 852651954 852696717 852713525
1974.4 852713525 852588296 852516055 852604568 852634192 852503777 852393270 852346241 852216899 852071404 852099717
1994.8 852099717 852209449 852172136 852032900 851992965 851998746 851899326 851802647 851812780 851773500 851575613 851415157
$$ packed form
1847.9H48545313M52816J90437J35482K73108K38717Q5711R2447J30892r7037j81615
1868.3H49866271L05414N50032K48670M2081J49429J87218K8551r656J12474J04785
1888.7H51585269N7042J13368J60813J19150J7285Q6725K33531J18553r6201k0981
1909.1H52374554J77800Q7321j31965m6730J77384M3928m6074J83463J90556m7028
1929.5H52963209o5505J15037J11699p4148j67430j17481l9160O080R7573J69456K7835
1951.9H53027165j50144p1883M7564l3200p1525L9041L0577r1553p4088M4763J6808
1974.4H52713525j25229p2241Q8513K9624j30415j10507m7029j29342j45495K8313
1994.8H52099717J09732l7313j39236l9935N781r9420r6679J0133l9280j97887j60456
$$ plain form
2017.2 851415157 851421833 851366878 851183832 851090968 851105392 851024449 850826442 850708544 850680828 850555301 850398660
2039.6 850398660 850407183 850442767 850313365 850168169 850165009 850130081 849948704 849836290 849892676 849886298 849707603
2062.1 849707603 849580288 849591970 849548280 849448144 849489093 849579036 849479973 849318326 849349737 849427283 849320829
2084.5 849320829 849211633 849279463 849320650 849197268 849110484 849159598 849180818 849139094 849186659 849290431 849266708
2106.9 849266708 849161744 849173009 849277556 849287629 849251211 849327147 849383175 849271119 849189043 849274755 849311829
2129.4 849311829 849201024 849175811 849320769 849391997 849328041 849349260 849468946 849496007 849447131 849505424 849635422
2151.8 849635422 849641740 849568009 849577427 849611998 849593043 849635601 849773109 849841893 849812210 849849045 849973261
2174.3 849973261 850023806 850007176 850101709 850273013 850315630 850267172 850320458 850403726 850375116 850365877 850497901
$$ packed form
2017.2H51415157O676n4955j83046r2864J4424q0943j98007j17898k7716j25527j56641
2039.6H50398660Q523L5584j29402j45196l160l4928j81377j12414N6386o378j78695
2062.1H49707603j27315J1682m3690j00136M0949Q9943r9063j61647L1411P7546j06454
2084.5H49320829j09196O7830M1187j23382q6784M9114K1220m1724M7565J03772k3723
2106.9H49266708j04964J1265J04547J0073l6418P5936N6028j12056q2076Q5712L7074
2129.4H49311829j10805k5213J44958P1228o3956K1219J19686K7061m8876N8293J29998
2151.8H49635422O318p3731R418L4571j8955M2558J37508O8784k9683L6835J24216
2174.3H49973261N0545j6630R4533J71304M2617m8458N3286Q3268k8610r239J32024
$$ plain form
2196.7 850497901 850613773 850581527 850556135 850650847 850714743 850674212 850671530 850742221 850757420 850721180 850769579
2219.1 850769579 850868821 850866497 850822806 850898027 851005673 850964606 850856960 850859165 850901723 850864291 850845575
2241.6 850845575 850937963 851010144 850945354 850855350 850849867 850836992 850772858 850778878 850842476 850812256 850719929 850693882
2266 850693882 850709140 850699902 850683093 850701153 850718021 850678265 850648522 850668371 850624621 850442052 850272059 850229204
2290.5 850229204 850171864 850022376 849888265 849791229 849604964 849319875 849093437 848922431 848626554 848247468
2310.9 848247468 847995818 847799361 847411036 846871436 846430242 846123636 845783710 845349669 844941497 844621420
2331.3 844621420 844319344 844077110 843923688 843701661 843462706 843542099 844040036 844495773 844399571 843724847
2351.7 843724847 842736423 841660321 840735793 840260208 840208232 840415359 840911984 841563404 842128038 842622995
$$ packed form
2196.7H50497901J15872l2246k5392R4712O3896m0531k682P0691J5199l6240M8399
2219.1H50769579R9242k324m3691P5221J07646m1067j07646K205M2558l7432j8716
2241.6H50845575R2388P2181o4790r0004n483j2875o4134O020O3598l0220r2327k6047
2266H50693882J5258r238j6809J8060J6868l9756k9743J9849m3750j82569j69993m2855
2290.5H50229204n7340j49488j34111r7036j86265k85089k26438j71006k95877l79086
2310.9H48247468k51650j96457l88325n39600m41194l06606l39926m34041m08172l20077
2331.3H44621420l02076k42234j53422k22027k38955P9393M97937M55737r6202o74724
2351.7H43724847r88424j076102r24528m75585n1976K07127M96625O51420N64634M94957
$$ plain form
2372.1 842622995 843191504 843816817 844336212 844745398 845133960 845395982 845364034 845153749 844980717 844797015
2392.5 844797015 844502568 844228148 844086647 843962610 843786538 843669593 843621075 843464375 843194366 843028724
2412.9 843028724 842986166 842849076 842572331 842270315 841886342 841412902 841174304 841325819 841525257 841509461
2433.3 841509461 841425061 841393352 841281712 841071069 840939820 840872645 840708137 840486050 840340257 840220928
2453.7 840220928 840002835 839761317 839632869 839517951 839278579 839026988 838890493 838739574 838469684 838238418
2474.1 838238418 838114202 837934673 837657392 837408006 837224782 837026238 836792946 836578727 836359859 836104989
2494.5 836104989 835889578 835740805 835535169 835238874 835010290 834876657 834677935 834392250 834151506 833962977
2514.9 833962977 833732307 833502114 833336353 833159149 832908392 832638621 832409978 832177937 831915915 831726134
$$ packed form
2372.1H42622995N68509O25313N19395M09186L88562K62022l1948k10285j73032j83702
2392.5H44797015k94447k74420j41501j24037j76072j16945m8518j56700k70009j65642
2412.9H43028724m2558j37090k76745l02016l83973m73440k38598J51515J99438j5796
2433.3H41509461q4400l1709j11640k10643j31249o7175j64508k22087j45793j19329
2453.7H40220928k18093k41518j28448j14918k39372k51591j36495j50919k69890k31266
2474.1H38238418j24216j79529k77281k49386j83224j98544k33292k14219k18868k54870
2494.5H36104989k15411j48773k05636k96295k28584j33633j98722k85685k40744j88529
2514.9H33962977k30670k30193j65761j77204k50757k69771k28643k32041k62022j89781
$$ plain form
2535.3 831726134 831616223 831415951 831115484 830889285 830718994 830454230 830129266 829888999 829737842 829547584
2555.6 829547584 829285562 829028904 828781366 828515470 828269541 828058541 827867329 827678740 827440798 827133536
2576 827133536 826800644 826500237 826260030 826039433 825805247 825555027 825272977 824962258 824650645 824355662
2596.4 824355662 824054658 823754191 823496342 823236406 822894812 822515905 822200894 821936727 821649373 821345389
2616.8 821345389 821058393 820743680 820380330 820038974 819752634 819461644 819119871 818758488 818414688 818082094
2637.2 818082094 817733884 817367971 817009330 816659093 816305280 815955937 815602124 815220833 814835489 814470172
2657.6 814470172 814109683 813754022 813406110 813037038 812621713 812217295 811873376 811502635 811074615 810691893
2678 810691893 810363650 809986055 809519887 809053838 808655798 808286607 807905376 807512045 807103872 806660295
$$ packed form
2535.3H31726134j09911k00272l00467k26199j70291k64764l24964k40267j51157j90258
2555.6H29547584k62022k56658k47538k65896k45929k11000j91212j88589k37942l07262
2576H27133536l32892l00407k40207k20597k34186k50220k82050l10719l11613k94983
2596.4H24355662l01004l00467k57849k59936l41594l78907l15011k64167k87354l03984
2616.8H21345389k86996l14713l63350l41356k86340k90990l41773l61383l43800l32594
2637.2H18082094l48210l65913l58641l50237l53813l49343l53813l81291l85344l65317
2657.6H14470172l60489l55661l47912l69072m15325m04418l43919l70741m28020l82722
2678H10691893l28243l77595m66168m66049l98040l69191l81231l93331m08173m43577
$$ plain form
2698.4 806660295 806177497 805710673 805284798 804855645 804422140 804002881 803568244 803105652 802646875 802196324
2718.8 802196324 801730692 801262081 800810874 800351024 799854517 799372911 798964560 798589766 798196316 797788739
2739.2 797788739 797382891 796945810 796484113 796088159 795729816 795292079 794785082 794307232 793851972 793334544
2759.6 793334544 792819917 792413533 792068422 791693449 791269541 790844560 790395558 789839625 789232135 788682997
2780 788682997 788152039 787592232 787098467 786682725 786168993 785508156 784859061 784296095 783713102 783040404
2800.4 783040404 782361329 781685770 780962169 780242085 779519618 778737843 777933180 777162015 776409388 775592327
2820.8 775592327 774695218 773788512 772844374 771795452 770714045 769650042 768476844 767061830 765358925
2839.1 765358925 763284922 760704875 757605612 754302323 751357019 749268830 748216271 747975826
$$ packed form
2698.4H06660295m82798m66824m25875m29153m33505m19259m34637m62592m58777m50551
2718.8H02196324m65632m68611m51207m59850m96507m81606m08351l74794l93450m07577
2739.2G97788739m05848m37081m61697l95954l58343m37737n06997m77850m55260n17428
2759.6G93334544n14627m06384l45111l74973m23908m24981m49002n55933o07490n49138
2780G88682997n30958n59807m93765m15742n13732o60837o49095n62966n82993o72698
2800.4G83040404o79075o75559p23601p20084p22467p81775q04663p71165p52627q17061
2820.8G75592327q97109r06706r44138j048922j081407j064003j173198j415014j702905
2839.1G65358925k074003k580047l099263l303289k945304k088189j052559k40445
$$ plain form
2855.5 747975826 748106718 748182595 747997642 747537732 746749103 745659113 744563520 743728757 743017554
2873.8 743017554 742274046 741685510 741283655 740820646 740187943 739449859 738630533 737680614 736616969
2892.2 736616969 735539138 734390974 733049035 731645465 730310500 728908479 727318048 725554585
2908.5 725554585 723532200 721045911 718116879 715142429 712597728 710746288 709650874 709197342
2924.8 709197342 709217548 709585071 710135162 710823119 711717308 712795675 714032114 715443194 716881573
2943.2 716881573 718031943 718706489 719001114 719086289 718942761 718647897 718534648 718775153 719316304 720086634
2963.6 720086634 721088111 722348511 723828614 725477755 727126300 728555262 729830444 731037438
2979.9 731037438 731992126 732654512 733281374 733984470 734630167 735057533 735198498 735173821 735004544 734613359
$$ packed form
2855.5G47975826J30892P5877j84953m59910p88629j089990j095593q34763p11203
2873.8G43017554p43508n88536m01855m63009o32703p38084q19326r49919j063645
2892.2G36616969j077831j148164j341939j403570j334965j402021j590431j763463
2908.5G25554585k022385k486289k929032k974450k544701j851440j095414m53532
2924.8G09197342K0206L67523N50091O87957Q94189J078367J236439J411080J438379
2943.2G16881573J150370O74546K94625Q5175j43528k94864j13249K40505N41151P70330
2963.6G20086634J001477J260400J480103J649141J648545J428962J275182J206994
2979.9G31037438R54688O62386O26862P03096O45697M27366J40965k4677j69277l91185
$$ plain form
3000.3 734613359 734165490 733738840 733241856 732798159 732518435 732196271 731626332 730860293 730022967 729149103
3020.7 729149103 728284478 727450192 726600111 725778580 725019991 724311650 723559380 722641706 721723199 720973372
3041.1 720973372 720201135 719205260 718111575 717141569 716241300 715230405 714182496 713209033 712262690
3059.4 712262690 711343765 710513055 709801912 709046364 708087444 707107127 706297040 705660701 705120444 704479992
3079.8 704479992 703631520 702691138 701796055 700989246 700175405 699250221 698317766 697513163 696760356 695907831
3100.2 695907831 694944918 693999648 693173230 692371964 691470385 690590918 689828932 689026415 688053489 686878920
3120.6 686878920 685574055 684329987 683226049 682156980 680986702 679756999 678631365 677613378
3136.9 677613378 676540732 675278962 673881292 672488093 671181858 670042813 669009387 667782485
$$ packed form
3000.3G34613359m47869m26650m96984m43697k79724l22164n69939p66039q37326q73864
3020.7G29149103q64625q34286q50081q21531p58589p08341p52270r17674r18507p49827
3041.1G20973372p72237r95875j093685r70006r00269j010895j047909r73463r46343
3059.4G12262690r18925q30710p11143p55548r58920r80317q10087o36339n40257o40452
3079.8G04479992q48472r40382q95083q06809q13841r25184r32455q04603p52807q52525
3100.2F95907831r62913r45270q26418q01266r01579q79467p61986q02517r72926j174569
3120.6F86878920j304865j244068j103938j069069j170278j229703j125634j017987
3136.9F77613378j072646j261770j397670j393199j306235j139045j033426j226902
$$ plain form
3153.2 667782485 666266859 664697170 663175166 661694825 660314143 658979952 657580674 656143785
3169.6 656143785 654742301 653329074 651852727 650357902 648902774 647493422 646072507 644622386
3185.9 644622386 643219054 641854405 640450001 639013588 637585938 636195838 634850681 633534133
3202.2 633534133 632228076 630909562 629569948 628259718 627026081 625808418 624555707 623331845
3218.5 623331845 622125804 620820105 619465947 618216097 617057860 615945399 614858925 613620162
3234.8 613620162 612179101 610753000 609474838 608330786 607223451 605993330 604618847 603276789
3251.1 603276789 602069736 600880742 599570394 598195732 596887410 595661342 594482183 593359470
3267.5 593359470 592309594 591228008 590019584 588735282 587468982 586318254 585279644 584246457
$$ packed form
3153.2F67782485j515626j569689j522004j480341j380682j334191j399278j436889
3169.6F56143785j401484j413227j476347j494825j455128j409352j420915j450121
3185.9F44622386j403332j364649j404404j436413j427650j390100j345157j316548
3202.2F33534133j306057j318514j339614j310230j233637j217663j252711j223862
3218.5F23331845j206041j305699j354158j249850j158237j112461j086474j238763
3234.8F13620162j441061j426101j278162j144052j107335j230121j374483j342058
3251.1F03276789j207053j188994j310348j374662j308322j226068j179159j122713
3267.5E93359470j049876j081586j208424j284302j266300j150728j038610j033187
$$ plain form
3283.8 584246457 583229899 582340181 581584156 580832839 580002427 579112709 578153789 577188849 576388776
3302.1 576388776 575774789 575094819 574140906 573017836 571848750 570685685 569582760 568485320 567341685
3320.5 567341685 566212475 565117717 563917816 562548101 561149120 559809446 558552384 557397962
3336.8 557397962 556203365 554877698 553517103 552150846 550847352 549724281 548542380 547058463
3353.1 547058463 545577347 544367015 543241024 542025864 540853381 539925218 539107800 538037360 536604345
3371.5 536604345 535143256 533953369 532927155 531912088 530862510 529805362 528864026 528177440 527734697
3389.8 527734697 527206063 526321948 525366545 524784684 524422884 523723781 522695601 521862447 521338522
3408.2 521338522 520899713 520457923 519927442 519290984 518777251 518485665 518286109 518190265 518320680 518594563
$$ packed form
3283.8E84246457j016558q89718p56025p51317q30412q89718r58920r64940q00073
3302.1E76388776o13987o79970r53913j123070j169086j163065j102925j097440j143635
3320.5E67341685j129210j094758j199901j369715j398981j339674j257062j154422
3336.8E57397962j194597j325667j360595j366257j303494j123071j181901j483917
3353.1E47058463j481116j210332j125991j215160j172483r28163q17418j070440j433015
3371.5E36604345j461089j189887j026214j015067j049578j057148r41336o86586m42743
3389.8E27734697n28634q84115r55403n81861l61800o99103j028180q33154n23925
3408.2E21338522m38809m41790n30481o36458n13733k91586j99556r5844J30415K73883
$$ plain form
3428.6 518594563 518778145 518944263 519250751 519448102 519339740 519218743 519381285 519815743 520407319 521007836
3449 521007836 521570146 522158444 522875130 523797810 524792075 525632918 526494026 527709544 529108882 530192375
3469.4 530192375 530849397 531536520 532570422 533877730 535201728 536334634 537442982 538736820 540051997
3487.7 540051997 541283190 542617261 544123292 545697451 547175288 548583448 550091028 551573992
3504 551573992 552846491 554123223 555713475 557595730 559411585 560949266 562428474 564106464 566065550
3522.4 566065550 568002522 569629729 571264267 573152840 575145483 577233136 579379141 581421375
3538.7 581421375 583507895 585728467 587933898 589998245 591941178 593943596 596126556 598397732
3555 598397732 600648642 602955043 605291903 607331514 609244943 611933291 615130007 617872417 620345652
$$ packed form
3428.6E18594563J83582J66118L06488J97351j08362j20997J62542M34458N91576O00517
3449E21007836N62310N88298P16686R22680R94265Q40843Q61108J215518J399338J083493
3469.4E30192375O57022O87123J033902J307308J323998J132906J108348J293838J315177
3487.7E40051997J231193J334071J506031J574159J477837J408160J507580J482964
3504E51573992J272499J276732J590252J882255J815855J537681J479208J677990J959086
3522.4E66065550J936972J627207J634538J888573J992643K087653K146005K042234
3538.7E81421375K086520K220572K205431K064347J942933K002418K182960K271176
3555E98397732K250910K306401K336860K039611J913429K688348L196716K742410K473235
$$ plain form
3573.4 620345652 622933328 625649989 628504336 631388903 634019077 636438489 639176726 642223418
3589.7 642223418 644952118 647567332 650504529 653628588 656752408 659804881 662548900 664955556
3606 664955556 667534053 670452237 673420072 676396668 679153621 682045937 685619414 688892961 691160202
3624.4 691160202 692879379 695509255 699344397 702520430 705162585 707782686 710259974 712612927
3640.7 712612927 714767575 716440856 717894554 720452428 724030495 726629555 728561103 730985701
3657 730985701 733386338 735085130 736398816 737501025 738263249 739189327 740616560 741725743 742964506
3675.4 742964506 744803011 746437907 747811139 748874724 749509871 750168264 751303315 752551496 753582120
3693.7 753582120 754378557 754859686 755136967 755650103 756402612 756801784 756760538 756887317 757837176 758999348
$$ packed form
3573.4F20345652K587676K716661K854347K884567K630174K419412K738237L046692
3589.7F42223418K728700K615214K937197L124059L123820L052473K744019K406656
3606F64955556K578497K918184K967835K976596K756953K892316L573477L273547K267241
3624.4F91160202J719177K629876L835142L176033K642155K620101K477288K352953
3640.7G12612927K154648J673281J453698K557874L578067K599060J931548K424598
3657G30985701K400637J698792J313686J102209P62224R26078J427233J109183J238763
3675.4G42964506J838505J634896J373232J063585O35147O58393J135051J248181J030624
3693.7G53582120P96437M81129K77281N13136P52509L99172m1246J26779R49859J162172
$$ plain form
3714.1 758999348 759552717 759656727 759640098 759679139 759892881 760310113 760591745 760442615 760206997 760523498
3734.5 760523498 761595011 762452722 762162089 761252344 761169434 761650026 761641264 762088537 763230085 763888121
3754.9 763888121 764033020 764293075 764755189 764935672 764885545 764892697 765096784 765543342 765904784 765990615
3775.3 765990615 766003311 766189575 766380966 766366243 766404212 766599536 766800284 766857862 766641557 766351998
3795.7 766351998 766092420 765783727 765885115 766178310 766304135 766770244 767201245 767016888 766472399 766197979
3816.1 766197979 766127169 766110003 766651213 767098188 767127156 767080069 766901195 766662776 766464770 766285658
3836.5 766285658 766325653 766655862 767099023 767513156 767550886 766900539 765671611 765016794 766062140 767036080
3856.9 767036080 767154694 766829729 766491413 766455948 766288102 766009510 766202390 766602755 766909480 766851068
$$ packed form
3714.1G58999348N53369J04010j6629L9041K13742M17232K81632j49130k35618L16501
3734.5G60523498J071513Q57711k90633r09745q2910M80592q762M47273J141548O58036
3754.9G63888121J44899K60055M62114J80483n0127P152K04087M46558L61442Q5831
3775.3G65990615J2696J86264J91391j4723L7969J95324K00748N7578k16305k89559
3795.7G66351998k59578l08693J01388K93195J25825M66109M31001j84357n44489k74420
3816.1G66197979p0810j7166N41210M46975K8968m7087j78874k38419j98006j79112
3836.5G66285658L9995L30209M43161M14133L7730o50347j228928o54817J045346R73940
3856.9G67036080J18614l24965l38316l5465j67846k78592J92880M00365L06725n8412
$$ plain form
3877.3 766851068 766520202 766473770 766582787 766816318 767020702 766835272 766785860 767001688 766813338 766196907
3897.7 766196907 765683949 765599430 765966237 766533375 766814053 766772926 766653061 766452730 766198099 766142190
3918.1 766142190 766224265 766129673 766005516 766067505 766030669 765864015 765918851 766095340 766062200 765846312 765624940
3940.5 765624940 765567482 765621006 765561581 765482068 765505910 765505075 765456557 765437722 765366197 765241146 765221655 765230060
3965 765230060 765126288 764975190 764917254 764949441 764963210 764938116 764896154 764875054 764860868 764780641 764640749
3987.4 764640749 764510751 764428794 764385760 764374316 764363408
3997.6 764363408
$$ packed form
3877.3G66851068l30866m6432J09017K33531K04384j85430m9412K15828j88350o16431
3897.7G66196907n12958q4519L66807N67138K80678m1127j19865k00331k54631n5909
3918.1G66142190Q2075r4592j24157O1989l6836j66654N4836J76489l3140k15888k21372
3940.5G65624940n7458N3524n9425p9513K3842q35m8518j8835p1525j25051j9491Q405
3965G65230060j03772j51098n7936L2187J3769k5094m1962k1100j4186q0227j39892
3987.4G64640749j29998q1957m3034j1444j0908
3997.6G64363408
##END=$$ End of the data block
