##TITLE=$$ Begin of the data block
##JCAMP-DX=5.00 $$ ACD/SpecManager v 10.08
##SPECTROMETER/DATA SYSTEM=Alpha
##DATE=10 Nov 2014 10:35:34
##DATA TYPE=INFRARED SPECTRUM
##DATA CLASS=XYDATA
##ORIGIN=
##OWNER=
##NPOINTS=1765
##FIRSTX=399.76428223
##LASTX=3997.64306641
##MAXX=3997.64306641
##MINX=399.76428223
##MAXY=0.85548025
##MINY=0.51548624
##XFACTOR=1.0000000000
##YFACTOR=1.000000000000000e-9
##FIRSTY=0.79996216
##DELTAX=2.03961372
##XUNITS=1/CM
##YUNITS=ARBITRARY UNITS
##XYDATA=(X++(Y..Y))
399.8 799962163 798991680 800144732 800207257 798164725 797169149 797556162 796293736 794277608 794211686
418.1 794211686 793696225 790759027 789342821 790355086 789833069 787710071 787938297 789321899 788121164
436.5 788121164 786464393 787055850 787017405 784864008 784311295 785724282 785203099 783230186 783265412
454.8 783265412 783568561 781408250 780110478 781292081 781330466 779114246 778195381 778886437 777792215
473.2 777792215 776146352 776938975 777708292 775938630 774648607 775863826 776134253 774139285 773461461
491.5 773461461 774476409 773413956 771116138 771104217 771588326 769658566 768002868 768550456 768176496
509.9 768176496 765701056 764194548 764056504 762499392 760285974 760189176 760643363 759096026 757627189
528.3 757627189 758028686 757717371 755673349 754796684 755562842 755142570 754194975 755586326 757747889
546.6 757747889 757687449 756964445 757662535 757941842 756542206 755814910 756734967 756936610 756104410 756442964
567 756442964 757450938 756905138 755724013 756019473 756701052 756092846 755592406 756241441 756353855 755418777
587.4 755418777 755113006 755535901 755150020 754337490 754579604 755125821 754509628 753463805 753168106 752811968
607.8 752811968 751519740 750388443 750183284 749725878 748791695 749105394 750717878 751868010 752516329
626.2 752516329 753956974 755635440 756190300 756299436 757224798 758307219 758645535 759103775 760482669
644.5 760482669 761750281 762110829 762808263 764429033 765417159 765270233 765412450 766052246 765990794 765285850
664.9 765285850 765100658 766097188 767000139 767872274 769660413 771394908 771978915 772749424 774504364
683.3 774504364 775659502 775668740 776138663 777376354 777827144 777449906 777795374 778781533 779070735 779271364
703.7 779271364 780659914 782162845 782579422 783182740 784923971 786266744 786505163 787453711 789641678
722 789641678 791218340 792032063 793687701 795743883 796598077 796984136 798338532 799687445 799844205
740.4 799844205 800065517 801359713 802293003 802207768 802734494 804047048 804278374 803684711 804213941 805360675
760.8 805360675 805403590 805174530 806237638 807415485 807332993 807501376 809015512 810173452 810296416
779.1 810296416 811211467 813200772 814343929 814717293 816189885 818197787 818983734 819404125 820933759
797.5 820933759 822438657 822696567 823031187 824335039 825171947 825006843 825424969 826701283 827166378
815.8 827166378 826785505 827072918 827437043 826335728 824933827 824955642 825261891 824741185 825191677 827588320
836.2 827588320 829925656 831204295 832687557 834466457 835212052 835140824 835587382 836303949 836375535
854.6 836375535 836557806 837761462 838991344 839236379 839343965 839977443 840141058 839421928 838982403
873 838982403 839127004 838742435 837758601 837145805 836680055 835494459 834041297 833205640 832567751 831560373
893.4 831560373 830931246 831276417 831789732 831884384 832193196 832875133 832989395 832377970 831991315 831928015
913.7 831928015 831414163 830613852 830319524 830318153 829943836 829492152 829458654 829329550 828505933 827365041
934.1 827365041 826215804 824463069 821796060 818811893 815757990 812202632 808333457 805022240
950.5 805022240 802482247 800249934 798349440 797096074 796142280 794920921 793546796 792309284 790824354
968.8 790824354 788632035 785940349 782910824 779077590 774252832 769044876 763900220 758675516
985.1 758675516 753499746 748930991 745053291 741357684 737604737 733864427 729791164 724975705
1001.4 724975705 719775856 714862287 710344970 706116617 702428818 699427724 696764171 694253862
1017.8 694253862 692230105 690762818 689443648 688235819 687538743 687266171 686966836 686800420 687218428
1036.1 687218428 687853038 687926829 687419057 686718345 685794771 684625328 683645785 683080912 682573676 681925297
1056.5 681925297 681478500 681403637 681342781 681120396 680972040 680870831 680540025 680239558 680602968 681721807
1076.9 681721807 683301568 685317874 687663496 689698756 690930128 691609561 691964209 691704810 690878868
1095.3 690878868 690067291 689409494 688675880 688229024 688732028 690199494 692199647 694712222 697912216
1113.6 697912216 701410115 704630375 707576513 710442543 713000476 715107739 717229784 719723403
1129.9 719723403 722128749 723968446 725371420 726304650 726553202 726530969 726821065 727421224 728239954
1148.3 728239954 729586959 731598556 733871102 736194909 738923013 742267072 746059358 750387967
1164.6 750387967 755538523 761296034 767105997 772807419 778508842 783918738 788603187 792600036
1180.9 792600036 796121895 799001932 801072717 802546263 803511918 803772330 803359807 802608132 801700413
1199.3 801700413 800657213 799672008 798984587 798493326 797951698 797307670 796536624 795437813 793904960
1217.7 793904960 792156875 790391743 788546264 786576748 784659088 782915175 781312525 779876471
1234 779876471 778720796 777842760 777134895 776612997 776345909 776316166 776431501 776640058 776918948 777200937
1254.4 777200937 777458370 777779579 778242171 778770804 779284179 779824197 780425906 781010747 781515896 781933963
1274.8 781933963 782223284 782307327 782248259 782209098 782199502 782099187 781812549 781359076 780725837 779810369
1295.2 779810369 778585196 777136326 775519073 773717582 771746099 769679010 767542660 765276790
1311.5 765276790 762988031 760893464 759035707 757377803 755967498 754688442 753273189 751646876
1327.8 751646876 749946713 748273849 746595442 744912744 743314624 741938114 740746498 739549100
1344.1 739549100 738329113 737189114 736145914 735240459 734514594 733830452 732928038 731689513 730298579
1362.5 730298579 728862584 727160394 725092053 722806215 720022440 716568828 712562799 705646336
1378.8 705646336 691509545 674196899 668701947 680988133 696849167 704642296 707075059 707500339
1395.1 707500339 707166016 706814528 706793785 706940651 707296252 707976341 708762884 709498942 710173607 710815847
1415.5 710815847 711596191 712927938 714594424 716449022 718519211 720457971 722351730 724271357
1431.8 724271357 725790858 727227569 729265153 731308341 732922494 734199643 735388994 736678660
1448.1 736678660 737907887 738885105 739722908 741050601 743684113 746454597 748717964 751083791 753862500
1466.5 753862500 756778955 760070741 764576614 769731998 774452746 778467000 781611383 784063995
1482.8 784063995 785899043 787017107 787471592 787839055 788055599 787334085 785542846 783747017 782302201
1501.2 782302201 780501306 777430356 773519337 771376729 769741058 767572403 765318215 763486981
1517.5 763486981 762034714 760679781 759620070 758370817 756618559 754936755 753140032 750935972
1533.8 750935972 748989761 747012973 744319379 742255092 741378188 740938008 740528226 739959002 739500165
1552.2 739500165 739243746 738781095 737841666 737841249 738390028 738098323 737025380 735503316 733900249 732315481
1572.6 732315481 730010986 726991296 724517584 722056329 718983412 715704262 712288201 708580852
1588.9 708580852 704810739 701301932 697967470 694755256 691795766 689054728 686345637 683605611
1605.2 683605611 680890441 678177893 675459206 672710598 669632792 666332245 663735211 661252797
1621.5 661252797 658427775 655834079 653364658 651084602 649347186 647678673 646001577 645516574
1637.8 645516574 645840824 646162748 646314979 646736801 647995532 649115562 650122464 652826130 655892730
1656.2 655892730 658355117 661044061 664682269 668957770 672631443 676483035 681544840 686399162
1672.5 686399162 691190898 696596563 701497495 705596507 709957063 716572702 723183155 728411376
1688.8 728411376 733630717 738407314 743297637 748576283 753676295 759661615 764608860 768255115
1705.1 768255115 771865904 774968922 777193844 778591931 779591560 781054974 782883644 784262538
1721.5 784262538 785329163 786366582 787133813 787691176 788281322 789321542 790946901 792434216 794077218
1739.8 794077218 796101570 798178256 800357580 802802861 805663049 808850229 811770856 814488053
1756.1 814488053 817106545 819358349 821654618 823833287 825344622 826593280 828141093 830043793
1772.4 830043793 831872940 833322942 834603548 835748732 836648762 837509811 838451624 839077950 839277923
1790.8 839277923 839841783 840924382 841724336 842111409 842653513 843488991 844125092 844498992 844906390
1809.2 844906390 845430136 845890164 846283197 846746504 847170532 847339034 847438335 847778618 848081052 848199546
1829.6 848199546 848650932 849295616 849606633 849736750 849972963 850098610 850027204 850272059 850860655 851333499
1850 851333499 851517379 851624012 851883888 852144659 852254152 852354467 852474928 852351785 852173388 852524579
1870.3 852524579 853102982 853346884 853376687 853515506 853692532 853713453 853702843 853820384 853919923 853954613
1890.7 853954613 854057908 854242146 854388714 854427636 854535460 854768455 854866087 854743600 854706943 854879260
1911.1 854879260 854977548 854901791 854913414 855079055 855072498 854991317 855155408 855346978 855318010 855259299 855374217
1933.6 855374217 855480254 855399430 855258048 855192661 855180323 855167806 855237305 855390191 855411708 855285525 855248809
1956 855248809 855284870 855207562 855119944 855161667 855187178 855107546 855066180 855132341 855141938 854994476 854911447 855002880
1980.5 855002880 855032325 854896545 854804814 854781747 854621887 854455709 854545176 854714513 854684412 854539394
2000.9 854539394 854493856 854479492 854342163 854223192 854246736 854226947 854032397 853853941 853845894 853826761 853693664
2023.3 853693664 853605926 853601456 853501797 853303552 853217065 853225410 853109002 852926910 852905989 852939308 852822602
2045.8 852822602 852689028 852706254 852696717 852525115 852417469 852485299 852473557 852275670 852151811 852191091 852160215
2068.2 852160215 852041006 852061331 852157652 852099299 851985335 852022350 852080941 851972997 851868927 851931214 851970196
2090.6 851970196 851871789 851835668 851931095 851969659 851919949 851955712 852049828 852008164 851895809 851928890 852051735
2113.1 852051735 852063060 852024674 852096498 852166951 852099419 852045298 852123559 852172315 852100432 852106690 852254987
2135.5 852254987 852298439 852220356 852259994 852392375 852416158 852383673 852471948 852594972 852566600 852499664 852572501
2157.9 852572501 852655351 852620006 852615833 852742255 852843761 852846205 852915049 853091240 853164017 853102267 853143930
2180.4 853143930 853299916 853355110 853334904 853426993 853557467 853561759 853560328 853690803 853796363 853751183 853731573
2202.8 853731573 853852570 853943586 853917599 853917837 853990495 854014814 853992045 854051590 854146123 854127526 854068339 854132175
2227.3 854132175 854241252 854209065 854114234 854136229 854190290 854138315 854091406 854173601 854261577 854232371 854179442
2249.7 854179442 854194224 854183555 854118705 854140222 854220331 854191482 854088545 854065537 854114652 854120374 854078829
2272.2 854078829 854072630 854075670 854022861 853995323 854043782 854032278 853892207 853771508 853731811 853633583 853451133
2294.6 853451133 853308678 853216350 853059351 852828622 852634311 852455020 852172673 851846039 851601124 851370156
2315 851370156 850963712 850410283 849972904 849687219 849335074 848860621 848424733 848108232 847841263 847643495
2335.4 847643495 847521126 847322881 847100854 847192109 847698331 848158896 848094642 847485602 846555591 845473349
2355.8 845473349 844491303 844008029 844002664 844222128 844705045 845331192 845859826 846384108 846998394 847594261
2376.2 847594261 848055959 848424792 848780572 849017918 848992944 848803163 848628163 848436713 848134518 847852647
2396.6 847852647 847730100 847630918 847445607 847306728 847268641 847152710 846903026 846727252 846658945 846493185
2417 846493185 846225441 845973492 845653296 845227718 844985247 845099568 845283449 845287621 845226347 845182717 845035553
2439.4 845035553 844797790 844653368 844604671 844469965 844254792 844121933 844009280 843764722 843510211 843398809
2459.8 843398809 843301654 843097746 842894137 842746794 842541635 842260182 842044771 841910303 841722488 841473579
2480.2 841473579 841271758 841096818 840863109 840617001 840444684 840281546 840031803 839781880 839598119 839372516
2500.6 839372516 839083016 838860869 838712156 838513970 838276684 838075757 837865531 837595642 837357819 837204099
2521 837204099 837036073 836801171 836549878 836325407 836094320 835851431 835676253 835540295 835311115 835010469
2541.4 835010469 834783912 834614754 834380209 834103048 833893120 833749533 833566368 833307028 833032072 832769513
2561.8 832769513 832500458 832237482 832014263 831842363 831680715 831457317 831152618 830815911 830518723 830263376
2582.2 830263376 830012918 829774737 829534590 829279184 828994930 828673244 828385234 828122258 827801287 827470422
2602.6 827470422 827206910 826937675 826608121 826297164 826025844 825734377 825419545 825118482 824801445 824445367
2623 824445367 824116826 823833168 823535562 823210299 822892845 822580040 822242141 821882963 821513593 821142018
2643.4 821142018 820770800 820408523 820079863 819741189 819335878 818924010 818577230 818267703 817944109 817587614
2663.7 817587614 817184746 816737115 816310227 815966964 815648377 815281034 814904749 814543366 814140856 813683987
2684.1 813683987 813251078 812874496 812480330 812045276 811625779 811221123 810792565 810357690 809944451 809513628
2704.5 809513628 809046447 808599591 808171690 807714760 807236493 806792915 806382716 805924535 805425763 804965019
2724.9 804965019 804521024 804029405 803534269 803113878 802741051 802345037 801925659 801532447 801134944 800710917
2745.3 800710917 800337613 799978554 799513340 798986673 798543990 798148572 797659576 797143638 796718299 796341836
2765.7 796341836 795956373 795560777 795162797 794711530 794140458 793525636 792972088 792437494 791897714 791427553
2786.1 791427553 791004181 790468454 789805233 789186537 788631022 788002014 787303209 786645353 785995007 785282671
2806.5 785282671 784571469 783850133 783051968 782242000 781484187 780738890 779938936 779060841 778125167 777133107
2826.9 777133107 776082039 775017142 773934245 772722423 771295249 769602835 767531276 764952838
2843.2 764952838 761857808 758545876 755619526 753574431 752505064 752209902 752323091 752405584 752223194
2861.6 752223194 751768827 750994921 749934316 748875141 748056829 747359633 746635914 746043324 745636225
2879.9 745636225 745189905 744572759 743828952 742965400 741961956 740910053 739875615 738749325 737411439
2898.3 737411439 735986531 734670520 733338535 731763482 729958713 727912426 725422680 722487330
2914.6 722487330 719532609 717039824 715200543 714037836 713534057 713605464 714045525 714607954 715284109
2933 715284109 716182709 717276454 718545079 720006585 721492350 722672820 723360300 723666370 723773122
2951.3 723773122 723667502 723419964 723313689 723520160 724057794 724871695 725905359 727169335 728679836
2969.7 728679836 730392396 732087791 733526409 734790325 736013412 737027764 737732291 738344789 739031732
2988 739031732 739708006 740184128 740355134 740341604 740187168 739833295 739404202 738954842 738456428 738036275
3008.4 738036275 737754226 737406135 736819088 736073792 735284030 734439492 733590484 732787132 731929660 731045425
3028.8 731045425 730274141 729604840 728846133 727903187 727012634 726304233 725528896 724507689 723425090
3047.2 723425090 722501338 721619308 720610917 719583333 718593836 717581987 716638744 715856135 715202451
3065.5 715202451 714492381 713546872 712539494 711725950 711120784 710612774 710012555 709224164 708337784
3083.9 708337784 707458138 706655741 705857694 704924524 703972697 703189611 702480793 701627254 700644076 699739754
3104.3 699739754 698979676 698195577 697256565 696326673 695546091 694774508 693873644 692754149 691431165
3122.6 691431165 690132320 688998401 687939286 686797559 685552478 684348941 683281720 682231605
3139 682231605 680997550 679591358 678151608 676774263 675585568 674529314 673264205 671706498 670139909
3157.3 670139909 668663561 667192936 665734947 664321482 662913024 661446393 659935176 658439457
3173.6 658439457 656941593 655409336 653903663 652431607 650954723 649506629 648122668 646739125
3189.9 646739125 645270348 643758714 642267048 640791416 639359951 637999058 636668146 635313869
3206.3 635313869 633920610 632555962 631278753 630026758 628742278 627465308 626196146 624850035
3222.6 624850035 623445928 622113407 620909333 619802654 618731558 617500663 616013229 614507198
3238.9 614507198 613166571 611938179 610753834 609558046 608255982 606866241 605504572 604200661
3255.2 604200661 602906108 601572692 600199819 598850667 597601831 596496522 595484138 594364524
3271.5 594364524 593066514 591746211 590501249 589347482 588241756 587123871 586047173 585094571
3287.8 585094571 584278584 583514750 582685053 581739902 580694318 579646945 578758597 578068972 577344835
3306.2 577344835 576334655 575084507 573813319 572653115 571532190 570350051 569131792 567956746
3322.5 567956746 566785574 565442860 563930809 562425613 560979962 559617400 558391035 557151794
3338.8 557151794 555749893 554249704 552720606 551280260 550025940 548711360 547134101 545572162
3355.2 545572162 544243872 542976558 541618586 540285230 539187849 538233221 537069261 535570800
3371.5 535570800 534016609 532707274 531587064 530472934 529298484 528147876 527167082 526430547 525900841
3389.8 525900841 525284886 524302900 523242116 522594213 522215426 521506369 520397902 519439995 518857837
3408.2 518857837 518416226 517942131 517343998 516676247 516160846 515826821 515586436 515486240 515558600 515725851
3428.6 515725851 515863001 516057432 516414523 516651034 516562343 516454160 516637683 517070770 517629921 518231869
3449 518231869 518830121 519447505 520199537 521176875 522228479 523130357 524058878 525336802 526801467
3467.3 526801467 527952254 528663695 529416442 530549705 531947553 533323109 534503400 535693884 537104487
3485.7 537104487 538536370 539841354 541205466 542761028 544409156 545943618 547448039 549115181
3502 549115181 550707281 552039921 553436816 555174291 557147443 559024394 560680449 562312543 564099073
3520.4 564099073 566152990 568232894 570035756 571791112 573766589 575902224 578146100 580408871
3536.7 580408871 582539856 584694803 587003648 589337647 591532648 593608677 595771372 598153472
3553 598153472 600608110 603014708 605496526 607982039 610137224 612187088 615058601 618465602 621357143
3571.3 621357143 623941660 626715899 629615486 632538319 635503054 638329327 641014695 643987000
3587.7 643987000 647213817 650147557 652939022 655969381 659203589 662477851 665696502 668647289
3604 668647289 671315670 674205065 677389383 680553675 683686018 686554313 689586878 693323433 696690142
3622.3 696690142 698990047 700775802 703595579 707660854 711022019 713828743 716573238 719150722
3638.7 719150722 721599698 723802745 725496709 727068543 729835808 733501554 736066520 737979650
3655 737979650 740459800 742947698 744724095 746093154 747196257 747942030 748942137 750436246 751478434
3673.3 751478434 752756476 754769623 756476820 757840037 758855522 759440005 760106444 761293709 762585104
3691.7 762585104 763652265 764484286 765012026 765366733 765987873 766813159 767208278 767094016 767089546 767946362
3712.1 767946362 769134879 769778132 769935131 769909441 769936323 770159066 770620883 770982444 770888925 770606279
3732.5 770606279 770829797 771869481 772738934 772498548 771673560 771657825 772108495 772045553 772539079 773752034
3752.9 773752034 774401963 774532259 774826944 775315642 775475085 775431216 775492728 775677443 776033700 776373684
3773.3 776373684 776481271 776486337 776688278 776929438 776954055 777032912 777258217 777453542 777484834 777240932
3793.7 777240932 776937783 776692212 776411295 776527882 776796103 776905477 777407467 777887523 777734935 777201712
3814.1 777201712 776953101 776894152 776835680 777332008 777743399 777739465 777681828 777526021 777319968 777142823
3834.4 777142823 776981175 777049661 777383208 777817309 778260410 778317630 777620256 776273072 775576591 776796937
3854.8 776796937 777899921 778014123 777660847 777339280 777312756 777122319 776843488 777046144 777455389 777784824
3875.2 777784824 777713478 777321637 777274847 777463317 777706444 777818263 777557135 777540684 777872980 777772009
3895.6 777772009 777171791 776604593 776484907 776911557 777510762 777742565 777684271 777605355 777443051 777228951
3916 777228951 777210236 777294338 777224302 777155519 777201772 777119339 776985049 777099490 777298510 777292430 777144730
3938.5 777144730 776958168 776826143 776790738 776738584 776721418 776785553 776794493 776731074 776660323 776570976 776522756
3960.9 776522756 776559651 776563227 776481032 776364088 776304305 776308358 776269257 776212752 776206493 776221275 776229739 776157737
3985.4 776157737 775974572 775835514 775816977 775800407 775768995 775753260
3997.6 775753260
##END=$$ End of the data block
