##TITLE=$$ Begin of the data block
##JCAMP-DX=5.00 $$ ACD/SpecManager v 10.08
##SPECTROMETER/DATA SYSTEM=Alpha
##DATE=10 Nov 2014 10:35:34
##DATA TYPE=INFRARED SPECTRUM
##DATA CLASS=XYDATA
##ORIGIN=
##OWNER=
##NPOINTS=1765
##FIRSTX=399.76428223
##LASTX=3997.64306641
##MAXX=3997.64306641
##MINX=399.76428223
##MAXY=0.86039150
##MINY=0.50857466
##XFACTOR=1.0000000000
##YFACTOR=1.000000000000000e-9
##FIRSTY=0.79687113
##DELTAX=2.03961372
##XUNITS=1/CM
##YUNITS=ARBITRARY UNITS
##XYDATA=(X++(Y..Y))
$$ plain form
399.8 796871126 794921458 795575380 795501113 793691695 793551922 794512928 792991340 790531278 790659785
418.1 790659785 790866673 788208902 786781192 787604988 786696911 784142435 784060776 785442948 784279108
436.5 784279108 782430172 782794356 782870770 781188607 780968368 782335818 781575620 779378235 779257119
454.8 779257119 779633939 777693093 776427746 777690411 777989388 775857866 774806023 775352418 774133325
473.2 774133325 772467494 773256600 774039030 772395134 771076918 771979034 771899760 769785464 769181788
491.5 769181788 770281255 769423604 767498553 767735541 768220127 766202629 764521182 765048444 764458239
509.9 764458239 761760116 760367990 760501802 759033978 756744385 756492317 756722212 754974306 753445268
528.3 753445268 753916919 753672659 751637220 750708103 751544178 751538754 750950098 752174675 754015028 753975987
$$ packed form
399.8G96871126j949668O53922p4267j809418j39773R61006j521588k460062J28507
418.1G90659785K06888k657771j427710Q23796r08077k554476q1659J382172j163840
436.5G84279108j848936L64184P6414j682163k20239J367450p60198k197385j21116
454.8G79257119L76820j940846j265347J262665K98977k131522j051843N46395j219093
473.2G74133325j665831P89106P82430j643896j318216R02116p9274k114296o03676
491.5G69181788J099467q57651j925051K36988M84586k017498j681447N27262n90205
509.9G64458239k698123j392126J33812j467824k289593k52068K29895j747906j529038
528.3G53445268M71651k44260k035439r29117Q36075n424n88656J224577J840353l9041
$$ plain form
548.7 753975987 753343940 753948152 754087329 752586544 751984477 753149867 753279030 752179623 752423108
567 752423108 753445327 752948225 751930237 752405882 753158152 752536356 751956582 752562821 752766669 751920044
587.4 751920044 751663804 752176166 751846433 750972092 751108050 751650095 751095772 750086308 749876022 749743044
607.8 749743044 748702109 747643828 747341871 746811688 745964944 746427953 748174012 749552071 750439286
626.2 750439286 751950979 753630638 754256129 754412353 755340278 756507397 756948948 757461071 758941352
644.5 758941352 760309756 760707140 761501670 763221145 764186144 764031649 764318883 765206158 765314102
662.9 765314102 764644623 764504135 765602291 766521454 767299712 768991292 770833254 771666646 772518039
681.2 772518039 774172008 775291502 775422990 776039839 777308404 777728140 777402759 777865529 778908372
$$ packed form
548.7G53975987o32047O04212J39177j500785o02067J165390J29163j099407K43485
567G52423108J022219m97102j017988M75645P52270o21796n79774O06239K03848q46625
587.4G51920044k56240N12362l29733q74341J35958N42045n54323j009464k10286j32978
607.8G49743044j040935j058281l01957n30183q46744M63009J746059J378059Q87215
626.2G50439286J511693J679659O25491J56224R27925J167119M41551N12123J480281
644.5G58941352J368404L97384P94530J719475R64999j54495K87234Q87275J07944
662.9G65314102o69479j40488J098156R19163P78258J691580J841962Q33392Q51393
681.2G72518039J653969J119494J31488O16849J268565M19736l25381M62770J042843
$$ plain form
699.6 778908372 779200017 779398501 780818284 782438636 782950997 783509254 785141766 786466300 786795199
717.9 786795199 787863016 790217876 791911662 792644083 794184446 796256900 797110975 797398150 798744678
736.3 798744678 800215185 800443709 800648153 801906884 802788377 802625954 803079009 804431260 804865956
754.7 804865956 804393828 804833055 805928051 806033254 805820525 806846023 808039427 808081388 808364511
773 808364511 809878469 811009049 811103940 811973512 813965201 815186679 815640807 817131937 819116175
791.4 819116175 819863439 820249319 821757257 823260665 823510766 823822975 825141251 826007843 825872421
809.7 825872421 826342762 827641666 828067064 827639222 827907562 828226745 827045441 825614333 825687408
828.1 825687408 826083302 825661123 826231956 828750134 831123292 832321703 833689511 835394025 836086094
$$ packed form
699.6G78908372K91645J98484J419783J620352N12361N58257J632512J324534L28899
717.9G86795199J067817K354860J693786P32421J540363K072454Q54075K87175J346528
736.3G98744678J470507K28524K04444J258731Q81493j62423M53055J352251M34696
754.7H04865956m72128M39227J094996J05203k12729J025498J193404M1961K83123
773H08364511J513958J130580R4891Q69572J991689J221478M54128J491130J984238
791.4H19116175P47264L85880J507938J503408K50101L12209J318276Q66592j35422
809.7H25872421M70341J298904M25398m27842K68340L19183j181304j431108P3075
828.1H25687408L95894m22179N70833K518178K373158J198411J367808J704514O92069
$$ plain form
846.4 836086094 835964084 836382687 837109625 837183356 837315440 838468492 839640319 839780629 839831591 840512693
866.8 840512693 840697587 839931726 839466989 839594126 839184523 838163853 837469876 836946487 835757375
885.2 835757375 834270775 833395183 832785785 831841588 831277728 831652641 832124949 832189560 832490146 833117366
905.6 833117366 833204567 832623243 832225382 832109749 831568062 830741167 830409944 830404520 830016971 829505265
926 829505265 829402447 829210877 828292549 827024221 825788379 823999226 821329296 818402231 815448642
944.3 815448642 812003851 808265388 805098951 802684188 800510108 798559904 797224879 796222568
960.7 796222568 794916332 793433368 792137861 790605009 788332343 785531938 782399297 778537750
977 778537750 773760021 768638432 763591647 758431196 753277421 748693228 744755745 740999162 737212896
$$ packed form
846.4H36086094j22010M18603P26938P3731J32084J153052J171827J40310N0962O81102
866.8H40512693J84894p65861m64737J27137m09603j020670o93977n23389j189112
885.2H35757375j486600q75592o09398r44197n63860L74913M72308O4611L00586O27220
905.6H33117366Q7201n81324l97861j15633n41687q26895l31223n424l87549n11706
926H29505265j02818j91570r18328j268328j235842j789153k669930k927065k953589
944.3H15448642l444791l738463l166437k414763k174080j950204j335025j002311
960.7G96222568j306236j482964j295507j532852k272666k800405l132641l861547
977G78537750m777729n121589n046785n160451n153775m584193l937483l756583l786266
$$ plain form
995.3 737212896 733444333 729384959 724681199 719672620 714967787 710572839 706333876 702625334
1011.6 702625334 699659526 697014868 694481969 692424119 690966427 689690888 688482940 687743723
1028 687743723 687452853 687184453 687020779 687318683 687749982 687644660 687004805 686241508 685395181 684383810
1048.4 684383810 683514237 683017373 682586253 682023287 681672037 681662381 681615949 681403518 681281686 681210101
1068.8 681210101 680893898 680585861 680943608 682079792 683636844 685556412 687795937 689765990 691004992
1087.1 691004992 691765904 692203283 691981018 691197932 690484703 689988136 689454675 689183891 689799786 691306591
1107.5 691306591 693292975 695782781 698958933 702433169 705650449 708610117 711476028 714015186
1123.8 714015186 716129601 718273997 720723867 723042428 724847555 726298332 727344751 727697372
$$ packed form
995.3G37212896l768563m059374m703760n008579m704833m394948m238963l708542
1011.6G02625334k965808k644658k532899k057850j457692j275539j207948p39217
1028F87743723k90870k68400j63674K97904M31299j05322o39855p63297q46327j011371
1048.4F84383810q69573m96864m31120n62966l51250r656m6432k12431j21832p1585
1068.8F81210101l16203l08037L57747J136184J557052J919568K239525J970053J239002
1087.1F91004992P60912M37379k22265p83086p13229m96567n33461k70784O15895J506805
1107.5F91306591J986384K489806L176152L474236L217280K959668K865911K539158
1123.8G14015186K114415K144396K449870K318561J805127J450777J046419L52621
$$ plain form
1140.1 727697372 727688670 727936447 728514314 729321837 730619490 732575715 734856367 737231970 739998281
1158.5 739998281 743354678 747113168 751329541 756340861 762009263 767786801 773464382 779121816
1174.8 779121816 784489036 789138258 793144405 796745360 799682498 801728904 803171575 804158807
1191.1 804158807 804429948 803981841 803215504 802328765 801287711 800290287 799605131 799096882 798499823
1209.5 798499823 797806919 797020853 795914888 794354260 792588174 790822864 788967311 787009418 785148621
1227.9 785148621 783476114 781919241 780516863 779419959 778609931 777969837 777517319 777297735 777277946
1246.2 777277946 777385414 777595818 777901232 778226316 778508425 778825521 779269755 779776037 780269325 780784130
1266.6 780784130 781363487 781933010 782404423 782781541 783048928 783119619 783043087 782982528 782942653 782791674
$$ packed form
1140.1G27697372q702K47777N77867Q07523J297653J956225K280652K375603K766311
1158.5G39998281L356397L758490M216373N011320N668402N777538N677581N657434
1174.8G79121816N367220M649222M006147L600955K937138K046406J442671R87232
1191.1H04158807K71141m48107p66337q86739j041054r97424o85156n08249n97059
1209.5G98499823o92904p86066j105965j560628j766086j765310j855553j957893j860797
1227.9G85148621j672507j556873j402378j096904q10028o40094m52518k19584j9789
1246.2G77277946J07468K10404L05414L25084K82109L17096M44234N06282M93288N14805
1266.6G80784130N79357N69523M71413L77118K67387P0691p6532o0559l9875j50979
$$ plain form
1287 782791674 782450318 781956971 781270266 780262411 778931975 777393520 775705159 773870945 771896839
1305.4 771896839 769798040 767607689 765321791 763030946 760910988 759003937 757307470 755875647
1321.7 755875647 754587710 753185451 751537800 749756813 748020828 746333301 744653285 743031383
1338 743031383 741593778 740334094 739079833 737812877 736652672 735643566 734839857 734263301 733744860
1356.4 733744860 733037710 732047737 730916381 729751229 728370309 726670802 724826217 722654223 720009923
1374.7 720009923 717001975 711973727 701862514 689391851 685079932 693364978 704371393 709710538
1391 709710538 711213350 711315334 710938215 710595727 710521281 710519254 710613966 711025774 711607575 712150693
1411.4 712150693 712642312 713124275 713738501 714901924 716436088 718186259 720174551 722039342 723854125
$$ packed form
1287G82791674l41356m93347o86705j007855j330436j538455j688361j834214j974106
1305.4G71896839k098799k190351k285898k290845k119958j907051j696467j431823
1321.7G55875647j287937j402259j647651j780987j735985j687527j680016j621902
1338G43031383j437605j259684j254261j266956j160205j009106q03709n76556n18441
1356.4G33744860p07150r89973j131356j165152j380920j699507j844585k171994k644300
1374.7G20009923l007948n028248j0111213j2470663m311919Q285046J1006415N339145
1391G09710538J502812J01984l77119l42488p4446k027R4712M11808N81801N43118
1411.4G12150693M91619M81963O14226J163423J534164J750171J988292J864791J814783
$$ plain form
1429.8 723854125 725692093 727130175 728467464 730392098 732369304 733975947 735266447 736457586
1446.1 736457586 737743318 738954127 739902139 740732849 742105305 744799554 747574747 749832749 752228320
1464.5 752228320 755042613 757958591 761240482 765769958 770950854 775647283 779631913 782766044
1480.8 782766044 785204351 787030280 788166761 788639009 788964272 789104283 788352132 786593199 784798682
1499.1 784798682 783310890 781503022 778480828 774636984 772549331 770964205 768833041 766629338
1515.4 766629338 764901400 763574183 762302041 761278212 760104656 758493185 756927907 755209923
1531.8 755209923 753093481 751208127 749281406 746738136 744847834 744037390 743637979 743256807 742681503
1550.1 742681503 742217243 741973162 741497338 740490735 740360618 740779519 740390420 739245594 737641454
$$ packed form
1429.8G23854125J837968J438082J337289J924634J977206J606643J290500J191139
1446.1G36457586J285732J210809R48012Q30710J372456K694249K775193K258002K395571
1464.5G52228320K814293K915978L281891M529476N180896M696429L984630L134131
1480.8G82766044K438307J825929J136481M72248L25263J40011p52151j758933j794517
1499.1G84798682j487792j807868l022194l843844k087653j585126k131164k203703
1515.4G66629338j727938j327217j272142j023829j173556j611471j565278j717984
1531.8G55209923k116442j885354j926721k543270j890302q10444l99411l81172n75304
1550.1G42681503m64260k44081m75824j006603j30117M18901l89099j144826j604140
$$ plain form
1568.5 737641454 735934377 734237969 731789768 728585422 725970387 723404408 720215917 716821432
1584.8 716821432 713285744 709439039 705511928 701826930 698276818 694805622 691604018 688651741
1601.1 688651741 685698390 682692409 679729581 676764727 673787475 670800447 667484164 663958549
1617.4 663958549 661224723 658640027 655718863 653088868 650624633 648357511 646684825 645193875
1633.7 645193875 643794060 643545270 644096673 644712567 645201445 646068513 647836447 649311602 650679946
1652.1 650679946 653877020 657244742 659895420 662791669 666648686 671089649 674871922 678850651
1668.4 678850651 684053302 688993812 693869412 699374914 704353154 708518505 712917268 719526410
1684.7 719526410 726142824 731389821 736610115 741388917 746310055 751630664 756785810 762876511
$$ packed form
1568.5G37641454j707077j696408k448201l204346k615035k565979l188491l394485
1584.8G16821432l535688l846705l927111l684998l550112l471196l201604k952277
1601.1F88651741k953351l005981k962828k964854k977252k987028l316283l525615
1617.4F63958549k733826k584696k921164k629995k464235k267122j672686j490950
1633.7F45193875j399815k48790N51403O15894M88878Q67068J767934J475155J368344
1652.1F50679946L197074L367722K650678K896249L857017M440963L782273L978729
1668.4F78850651N202651M940510M875600N505502M978240M165351M398763O609142
1684.7G19526410O616414N246997N220294M778802M921138N320609N155146O090701
$$ plain form
1701.1 762876511 767916501 771620452 775282681 778445125 780742347 782202661 783237457 784750760
1717.4 784750760 786659420 788096368 789215863 790304601 791090548 791641116 792223454 793281198 794933617
1735.7 794933617 796427250 798091233 800160229 802244186 804399312 806843102 809701979 812852144
1752 812852144 815756559 818511784 821162879 823416352 825722814 827914596 829436183 830704212 832262635
1770.4 832262635 834182024 836070716 837559164 838838756 839991927 840901196 841753483 842704535 843354762
1788.8 843354762 843582273 844192147 845284581 846045613 846402466 846926928 847745180 848380566 848761201
1807.1 848761201 849170983 849706769 850192189 850605369 851082087 851519287 851677239 851750135 852082729 852389038
1827.5 852389038 852515876 852980912 853630781 853931606 854049325 854300439 854475319 854440808 854652643 855199456
$$ packed form
1701.1G62876511N039990L703951L662229L162444K297222J460314J034796J513303
1717.4G84750760J908660J436948J119495J088738P85947N50568N82338J057744J652419
1735.7G94933617J493633J663983K068996K083957K155126K443790K858877L150165
1752H12852144K904415K755225K651095K253473K306462K191782J521587J268029J558423
1770.4H32262635J919389J888692J488448J279592J153171R09269Q52287R51052O50227
1788.8H43354762K27511O09874J092434P61032L56853N24462Q18252O35386L80635
1807.1H48761201M09782N35786M85420M13180M76718M37200J57952P2896L32594L06309
1827.5H52389038J26838M65036O49869L00825J17719K51114J74880l4511K11835N46813
$$ plain form
1847.9 855199456 855679095 855874479 855986178 856267571 856527507 856596112 856666148 856804252 856727779 856563330
1868.3 856563330 856878579 857420802 857646942 857673705 857814789 858005643 858053565 858057797 858177304 858275831
1888.7 858275831 858298004 858393431 858588099 858743250 858770192 858843148 859053731 859170139 859084368 859079897 859263480
1911.1 859263480 859329522 859193146 859173477 859360278 859379828 859313786 859513044 859726191 859674633 859605491 859730065
1933.6 859730065 859831810 859744966 859593630 859503269 859473109 859462440 859542966 859707475 859741926 859618425 859569788
1956 859569788 859609544 859563112 859503925 859548986 859562755 859460771 859398663 859467387 859473884 859322190 859282553 859435618
1980.5 859435618 859487176 859347641 859242260 859191716 859017193 858853459 858943522 859107137 859056056 858891785
2000.9 858891785 858842492 858830452 858709693 858611882 858646035 858631492 858446956 858281493 858255565 858195126 858058631
$$ packed form
1847.9H55199456M79639J95384J11699K81393K59936O8605P0036J38104p6473j64449
1868.3H56563330L15249N42223K26140K6763J41084J90854M7922M232J19507R8527
1888.7H58275831K2173R5427J94668J55151K6942P2956K10583J16408q5771m471J83583
1911.1H59263480O6042j36376j9669J86801J9550o6042J99258K13147n1558o9142J24574
1933.6H59730065J01745q6844j51336r0361l0160j0669Q0526J64509L4451j23501m8637
1956H59569788L9756m6432n9187M5061J3769j01984o2108O8724O497j51694l9637J53065
1980.5H59435618N1558j39535j05381n0544j74523j63734R0063J63615n1081j64271
2000.9H58891785m9293j2040j20759r7811L4153j4543j84536j65463k5928o0439j36495
$$ plain form
2023.3 858058631 858020544 858064771 857976973 857778549 857710183 857737839 857620299 857435226 857425869 857474267 857370436
2045.8 857370436 857269049 857317150 857295752 857106924 857022703 857128382 857132435 856944799 856834173 856874168 856842577
2068.2 856842577 856739938 856799603 856927633 856868088 856751621 856815815 856932580 856898367 856829822 856879950 856919289
2090.6 856919289 856824994 856772602 856864095 856918752 856900632 856983066 857125819 857125342 857042193 857094347 857230186
2113.1 857230186 857246995 857222021 857328594 857432961 857371747 857312918 857400775 857443273 857350111 857363820 857544303
2135.5 857544303 857624590 857580543 857650101 857799768 857819498 857764781 857838809 858001411 858058691 858051658 858134449
2157.9 858134449 858220875 858203113 858213603 858335674 858432829 858463645 858567953 858736515 858797431 858779252 858869672
2180.4 858869672 859039783 859111786 859104633 859188318 859329343 859358549 859363616 859499753 859618127 859586477 859587491
$$ packed form
2023.3H58058631l8087M4227q7798j98424o8366K7656j17540j85073r357M8398j03831
2045.8H57370436j01387M8101k1398j88828q4221J05679M053j87636j10626L9995l1591
2068.2H56842577j02639N9665J28030n9545j16467O4194J16765l4213o8545N0128L9339
2090.6H56919289r4295n2392R1493N4657j8120Q2434J42753m77q3149N2154J35839
2113.1H57230186J6809k4974J06573J04367o1214n8829Q7857M2498r3162J3709J80483
2135.5H57544303Q0287m4047O9558J49667J9730n4717P4028J62602N7280p033Q2791
2157.9H58134449Q6426j7762J0490J22071R7155L0816J04308J68562O0916j8179R0420
2180.4H58869672J70111P2003p153Q3685J41025K9206N067J36137J18374l1650J014
$$ plain form
2202.8 859587491 859734714 859834254 859791756 859791219 859898329 859957457 859934628 859967470 860045493 860034168 859989941
2225.2 859989941 860061288 860175073 860173583 860128760 860147178 860153913 860121191 860157847 860292733 860391498 860360980
2247.7 860360980 860304654 860320508 860318840 860259831 860258877 860312760 860293627 860226452 860242903 860323846 860335708 860259831
2272.2 860259831 860210717 860225141 860233009 860248744 860315144 860316873 860158205 859990716 859938920 859900951 859778702
2294.6 859778702 859632552 859524548 859369516 859125674 858920038 858757198 858481646 858159423 857951224 857744396
2315 857744396 857352436 856848836 856450558 856161594 855818450 855429053 855104804 854795337 854462087 854245484
2335.4 854245484 854133844 853883445 853575647 853630662 854169965 854678631 854583740 853905737 853011966 852070332
2355.8 852070332 851225913 850795984 850705683 850828528 851287484 851925850 852462828 852957249 853576303 854216754
$$ packed form
2202.8H59587491J47223R9540m2498n37J07110N9128k2829L2842P8023j1325m4227
2225.2H59989941P1347J13785j490m4823J8418O735l2722L6656J34886R8765l0518
2247.7H60360980n6326J5854j668n9009r54N3883j9133o7175J6451Q0943J1862p5877
2272.2H60259831m9114J4424P868J5735O6400J729j58668j67489n1796l7969j22249
2294.6H59778702j46150j08004j55032k43842k05636j62840k75552l22223k08199k06828
2315H57744396l91960n03600l98278k88964l43144l89397l24249l09467l33250k16603
2335.4H54245484j11640k50399l07798N5015N39303N08666r4891o78003q93771r41634
2355.8H52070332q44419m29929r0301J22845M58956O38366N36978M94421O19054O40451
$$ plain form
2376.2 854216754 854695976 855063736 855421841 855641067 855563939 855343699 855186343 855019450 854730606 854449570
2396.6 854449570 854328096 854248643 854079485 853949308 853930950 853821516 853574991 853432655 853397787 853242218
2417 853242218 852976978 852735996 852476597 852151990 851962626 852057099 852173984 852087617 851966679 851925254
2437.4 851925254 851799488 851570547 851434350 851374626 851220310 851019800 850901484 850800097 850605786 850389600
2457.8 850389600 850274086 850171506 849956155 849717438 849539042 849343896 849105477 848935783 848839402 848650277
2478.1 848650277 848348260 848096311 847927094 847720683 847460449 847263634 847106814 846879780 846663535 846515059
2498.5 846515059 846304774 846011400 845789135 845649779 845452189 845203161 845005274 844827116 844587743 844364882
2518.9 844364882 844238997 844096005 843859375 843619466 843420446 843197644 842934847 842720449 842573345 842374861
$$ packed form
2376.2H54216754M79222L67760L58105K19226p7128k20240j57356j66893k88844k81036
2396.6H54449570j21474p9453j69158j30177j8358j09434k46525j42336l4868j55569
2417H53242218k65240k40982k59399l24607j89364R4473J16885q6367j20938m1425
2437.4H51925254j25766k28941j36197n9724j54316k00510j18316j01387j94311k16186
2457.8H50389600j15514j02580k15351k38717j78396j95146k38419j69694r6381j89125
2478.1H48650277l02017k51949j69217k06411k60234j96815j56820k27034k16245j48476
2498.5H46515059k10285k93374k22265j39356j97590k49028j97887j78158k39373k22861
2518.9H44364882j25885j42992k36630k39909j99020k22802k62797k14398j47104j98484
$$ plain form
2539.3 842374861 842101753 841876626 841712832 841480970 841180444 840956986 840816379 840632558 840371192 840104043
2559.7 840104043 839868963 839636326 839405894 839200914 839010119 838806868 838578463 838320494 838035226 837767422
2580.1 837767422 837529361 837265491 836992085 836748600 836512864 836246133 835943818 835660100 835390687 835080743
2600.5 835080743 834760785 834482670 834201038 833877563 833574057 833316207 833043337 832730412 832417727 832114637
2620.9 832114637 831797957 831489086 831192613 830870450 830545485 830238283 829914689 829563260 829193890 828822792
2641.3 828822792 828475893 828139603 827772915 827405632 827070475 826726198 826352060 825979292 825616539 825247824
2661.7 825247824 824891984 824540138 824155509 823763907 823427200 823122978 822758138 822353661 821987271 821598947
2682.1 821598947 821123362 820661843 820286810 819910109 819502711 819119871 818731487 818300307 817850947 817411423
$$ packed form
2539.3H42374861k73108k25127j63794k31862l00526k23458j40607j83821k61366k67149
2559.7H40104043k35080k32637k30432k04980j90795k03251k28405k57969k85268k67804
2580.1H37767422k38061k63870k73406k43485k35736k66731l02315k83718k69413l09944
2600.5H35080743l19958k78115k81632l23475l03506k57850k72870l12925l12685l03090
2620.9H32114637l16680l08871k96473l22163l24965l07202l23594l51429l69370l71098
2641.3H28822792l46899l36290l66688l67283l35157l44277l74138l72768l62753l68715
2661.7H25247824l55840l51846l84629l91602l36707l04222l64840m04477l66390l88324
2682.1H21598947m75585m61519l75033l76701m07398l82840l88384m31180m49360m39524
$$ plain form
2702.5 817411423 816984653 816553235 816127777 815713227 815287709 814829707 814360142 813932300 813513458 813057721
2722.9 813057721 812610924 812171340 811678708 811180413 810748458 810373783 810029507 809658766 809246123 808821917
2743.3 808821917 808384955 807988703 807621419 807174146 806690037 806281149 805889904 805398226 804873168 804452419
2763.7 804452419 804084301 803658545 803205371 802794456 802381337 801865935 801274300 800697327 800139964 799621642
2784.1 799621642 799195766 798807025 798297524 797629893 796960235 796372771 795776904 795118988 794457197 793785274
2804.5 793785274 793070912 792382121 791694880 790931940 790155590 789419174 788660765 787803233 786877632 785950720
2824.9 785950720 784993947 783966064 782900274 781788230 780539811 779109776 777440131 775388539
2841.2 775388539 772814453 769723475 766431928 763493121 761401117 760305703 759991109 760077417 760156751
$$ packed form
2702.5H17411423m26770m31418m25458m14550m25518m58002m69565m27842m18842m55737
2722.9H13057721m46797m39584m92632m98295m31955l74675l44276l70741m12643m24206
2743.3H08821917m36962l96252l67284m47273m84109m08888l91245m91678n25058m20749
2763.7H04452419l68118m25756m53174m10915m13119n15402n91635n76973n57363n18322
2784.1G99621642m25876l88741n09501o67631o69658n87464n95867o57916o61791o71923
2804.5G93785274p14362o88791o87241p62940p76350p36416p58409q57532r25601r26912
2824.9G85950720r56773j027883j065790j112044j248419j430035j669645k051592
2841.2G75388539k574086l090978l291547k938807k092004j095414l14594Q6308P9334
$$ plain form
2859.5 760156751 759981513 759543359 758810639 757747293 756641328 755829275 755186081 754508018 753933132
2877.9 753933132 753516257 753078103 752509773 751828671 751055360 750129163 749068856 747996390 746845722
2896.3 746845722 745491087 744068563 742720425 741344392 739815474 738104761 736126661 733683527
2912.6 733683527 730742633 727713704 725156665 723321676 722208142 721743047 721816897 722247124 722819626
2930.9 722819626 723553479 724544168 725704253 726992190 728455603 729947329 731165767 731947422 732362151
2949.3 732362151 732537925 732461870 732226729 732131839 732347548 732900023 733780444 734945178 736312568 737816155
2969.7 737816155 739476323 741190553 742719233 744066894 745341718 746383727 747118592 747799218 748559237
2988 748559237 749283493 749811113 750043035 750068128 749912322 749553740 749188125 748850226 748415232 748006821
$$ packed form
2859.5G60156751j75238m38154p32720j063346j105965q12053o43194o78063n74886
2877.9G53933132m16875m38154n68330o81102p73311r26197j060307j072466j150668
2896.3G46845722j354635j422524j348138j376033j528918j710713j978100k443134
2912.6G33683527k940894l028929k557039j834989j113534m65095P3850M30227N72502
2930.9G22819626P33853R90689J160085J287937J463413J491726J218438P81655M14729
2949.3G32362151J75774p6055k35141r4890K15709N52475Q80421J164734J367390J503587
2969.7G37816155J660168J714230J528680J347661J274824J042009P34865O80626P60019
2988G48559237P24256N27620K31922K5093j55806l58582l65615l37899m34994m08411
$$ plain form
3008.4 748006821 747754693 747466207 746924996 746191800 745417178 744619668 743800461 742980540 742122233 741282642
3028.8 741282642 740540266 739862919 739125311 738223732 737338185 736629665 735895336 734927416 733859539
3047.2 733859539 732945085 732104063 731118381 730095088 729148090 728210211 727335572 726594627 725936949
3065.5 725936949 725203097 724287212 723371625 722650170 722092390 721590757 721006095 720274568 719471693 718665481
3085.9 718665481 717894375 717105806 716207385 715311646 714577913 713932574 713194609 712328076 711474776 710727274
3106.3 710727274 709958434 709041536 708123803 707358778 706629694 705766797 704653800 703317523 701998532
3124.7 701998532 700836778 699746966 698577046 697316110 696126938 695079327 694016337 692743659
3141 692743659 691308022 689873993 688502371 687261701 686126411 684814274 683228672 681636989 680144250
$$ packed form
3008.4G48006821k52128k88486n41211p33196p74622p97510q19207q19921q58307q39591
3028.8G41282642p42376o77347p37608r01579q85547p08520p34329r67920j067877
3047.2G33859539r14454q41022r85682j023293r46998r37879q74639p40945o57678
3065.5G25936949p33852r15885r15587p21455n57780n01633n84662p31527q02875q06212
3085.9G18665481p71106p88569q98421q95739p33733o45339p37965q66533q53300p47502
3106.3G10727274p68840r16898r17733p65025p29084q62897j112997j336277j318991
3124.7G01998532j161754j089812j169920j260936j189172j047611j062990j272678
3141F92743659j435637j434029j371622j240670j135290j312137j585602j591683j492739
$$ plain form
3159.4 680144250 678636432 677099288 675592184 674101233 672589839 671083450 669584692 668028712
3175.7 668028712 666405976 664810359 663274050 661738157 660207093 658738613 657269955 655695379
3192 655695379 654064775 652463853 650906384 649418950 648020744 646643996 645211995 643735409 642301023
3210.3 642301023 640946865 639588058 638174534 636764884 635370970 633939862 632499158 631120563
3226.7 631120563 629815876 628593385 627424121 626088202 624498010 622934043 621553421 620245576
3243 620245576 618970394 617704630 616338730 614903748 613519549 612158775 610724628 609230936 607768476
3261.3 607768476 606405914 605152547 603964567 602824986 601657569 600365698 598964989 597550631
3277.7 597550631 596272528 595120430 593950808 592804611 591789544 590879858 589965105 588966846 587877572
$$ packed form
3159.4F80144250j507818j537144j507104j490951j511394j506389j498758j555980
3175.7F68028712j622736j595617j536309j535893j531064j468480j468658j574576
3192F55695379j630604j600922j557469j487434j398206j376748j432001j476586j434386
3210.3F42301023j354158j358807j413524j409650j393914j431108j440704j378595
3226.7F31120563j304687j222491j169264j335919j590192j563967j380622j307845
3243F20245576j275182j265764j365900j434982j384199j360774j434147j493692j462460
3261.3F07768476j362562j253367j187980j139581j167417j291871j400709j414358
3277.7E97550631j278103j152098j169622j146197j015067r09686r14753r98259j089274
$$ plain form
3296 587877572 586708367 585559428 584578097 583751559 582849324 581685185 580326736 578916490 577528119
3314.4 577528119 576150596 574748695 573338985 571969032 570611417 569099009 567388952 565649211
3330.7 565649211 563966930 562377751 560920894 559439957 557791650 556035697 554227710 552491486
3347 552491486 550954223 549365878 547487319 545571804 543884814 542296827 540604115 538916349 537494659
3365.4 537494659 536245704 534788668 533001781 531181514 529598355 528185487 526817501 525449693
3381.7 525449693 524100780 522879660 521927238 521230578 520408154 519197106 517971814 517185152 516663611
3400 516663611 515823543 514597952 513518929 512766540 512113810 511444628 510737479 510057867 509536684 509139001
3420.4 509139001 508787692 508574665 508609235 508815110 508969545 509103656 509385049 509593725 509505332 509435713
$$ packed form
3296E87877572j169205j148939r81331q26538r02235j164139j358449j410246j388371
3314.4E77528119j377523j401901j409710j369953j357615j512408j710057j739741
3330.7E65649211j682281j589179j456857j480937j648307j755953j807987j736224
3347E52491486j537263j588345j878559j915515j686990j587987j692712j687766j421690
3365.4E37494659j248955j457036j786887j820267j583159j412868j367986j367808
3381.7E25449693j348913j221120r52422o96660q22424j211048j225292p86662n21541
3400E16663611q40068j225591j079023p52389o52730o69182p07149o79612n21183l97683
3420.4E09139001l51309k13027L4570K05875J54435J34111K81393K08676q8393o9619
$$ plain form
3440.8 509435713 509676039 510149479 510780215 511479795 512186050 512937427 513799131 514850438 516062081
3459.2 516062081 517205596 518289089 519631684 521192372 522513330 523423016 524327695 525586009 527170777
3477.5 527170777 528763950 530099928 531435490 533055902 534688532 536163628 537748694 539533079
3493.8 539533079 541384280 543148577 544840932 546644807 548464775 550098836 551773310 553751945
3510.2 553751945 555925965 557987571 559854507 561743915 563793659 566053510 568310380 570337415
3526.5 570337415 572369158 574631989 577025414 579499245 582007587 584408164 586826265 589390099
3542.8 589390099 592026293 594558060 596903861 599287152 601927757 604678392 607377887 610166252
3559.1 610166252 612989664 615441203 617752194 620947003 624713004 627944827 630843520 633939385
$$ packed form
3440.8E09435713K40326M73440O30736O99580P06255P51377Q61704J051307J211643
3459.2E16062081J143515J083493J342595J560688J320958R09686R04679J258314J584768
3477.5E27170777J593173J335978J335562J620412J632630J475096J585066J784385
3493.8E39533079J851201J764297J692355J803875J819968J634061J674474J978635
3510.2E53751945K174020K061606J866936J889408K049744K259851K256870K027035
3526.5E70337415K031743K262831K393425K473831K508342K400577K418101K563834
3542.8E89390099K636194K531767K345801K383291K640605K750635K699495K788365
3559.1F10166252K823412K451539K310991L194809L766001L231823K898693L095865
$$ plain form
3575.4 633939385 637249053 640635967 643975139 647079766 650072396 653457105 657106817 660391927
3591.7 660391927 663571358 667048573 670707822 674399257 678006768 681271613 684234798 687478542
3608.1 687478542 691077530 694660902 698165417 701332927 704648972 708741486 712487519 715078175
3624.4 715078175 717057884 720125079 724520206 728137851 731171489 734122992 736845732 739425123
3640.7 739425123 741790891 743615806 745234668 748125374 752031565 754710853 756669939 759251714
3657 759251714 761836052 763676703 765091896 766200781 766921878 767934918 769474924 770481825 771767557
3675.4 771767557 773906827 775635779 776943982 777970791 778606653 779288650 780492663 781835318 782947063
3693.7 782947063 783826590 784385741 784716785 785324872 786182404 786607981 786542714 786607862 787522972 788739681
$$ packed form
3575.4F33939385L309668L386914L339172L104627K992630L384709L649712L285110
3591.7F60391927L179431L477215L659249L691435L607511L264845K963185L243744
3608.1F87478542L598988L583372L504515L167510L316045M092514L746033K590656
3624.4G15078175J979709L067195M395127L617645L033638K951503K722740K579391
3640.7G39425123K365768J824915J618862K890706L906191K679288J959086K581775
3657G59251714K584338J840651J415193J108885P21097J013040J540006J006901J285732
3675.4G71767557K139270J728952J308203J026809O35862O81997J204013J342655J111745
3693.7G82947063Q79527N59151L31044O08087Q57532M25577o5267O5148R15110J216709
$$ plain form
3714.1 788739681 789353192 789468050 789477825 789585233 789795816 790137649 790388346 790244281 789967000 790248275
3734.5 790248275 791360974 792303801 792081058 791184723 791143835 791662693 791642427 792148471 793411911 794146955
3754.9 794146955 794293821 794563770 795071006 795243561 795175195 795175076 795367122 795852780 796249032 796311677
3775.3 796311677 796295941 796504498 796737790 796751380 796819687 797044158 797276616 797365248 797178447 796908975
3795.7 796908975 796603024 796239913 796428323 796801269 796886027 797309101 797742486 797575712 797034562 796793401
3816.1 796793401 796739399 796694994 797249973 797697663 797713399 797688901 797579646 797441781 797298193 797073245
3836.5 797073245 797065437 797398865 797855198 798322320 798389435 797665417 796300232 795646250 796914637 798032165
3856.9 798032165 798170984 797819972 797482789 797513902 797394574 797141135 797360361 797736764 798020363 797954321
$$ packed form
3714.1G88739681O13511J14858R775J07408K10583L41833K50697j44065k77281K81275
3734.5G90248275J112699R42827k22743q96335m0888N18858k0266N06044J263440P35044
3754.9G94146955J46866K69949N07236J72555o8366j19J92046M85658L96252O2645
3775.3G96311677j5736K08557K33292J3590O8307K24471K32458Q8632j86801k69472
3795.7G96908975l05951l63111J88410L72946Q4758M23074M33385j66774n41150k41161
3816.1G96793401n4002m4405N54979M47690J5736k4498j09255j37865j43588k24948
3836.5G97073245p808L33428M56333M67122O7115p24018j365185o53982J268387J117528
3856.9G98032165J38819l51012l37183L1113j19328k53439K19226L76403K83599o6042
$$ plain form
3877.3 797954321 797623158 797645748 797851622 798131645 798316121 798088133 798075020 798366904 798170686 797529459
3897.7 797529459 797017992 796935439 797351062 798012257 798391998 798430741 798340738 798108339 797804356 797715545
3918.1 797715545 797816277 797822952 797799110 797868907 797793567 797607124 797676563 797908962 797935784 797763884 797559083
3940.5 797559083 797484159 797533691 797517478 797523737 797614276 797621906 797553599 797538936 797534406 797474384 797462940 797494233
3965 797494233 797447860 797351062 797342002 797416627 797458947 797425628 797345698 797307014 797314763 797277868 797192097 797135353
3989.5 797135353 797140479 797121227 797034264 796971798
3997.6 796971798
$$ packed form
3877.3G97954321l31163K2590K05874K80023J84476k27988j3113K91884j96218o41227
3897.7G97529459n11467q2553M15623O61195L79741L8743r0003k32399l03983q8811
3918.1G97715545J00732O675k3842O9797p5340j86443O9439K32399K6822j71900k04801
3940.5G97559083p4924M9532j6213O259R0539P630o8307j4663m530o0022j1444L1293
3965G97494233m6373r6798r060P4625M2320l3319p9930l8684P749l6895q5771n6744
3989.5G97135353N126j9252q6963o2466
3997.6G96971798
##END=$$ End of the data block
