##TITLE=$$ Begin of the data block
##JCAMP-DX=5.00 $$ ACD/SpecManager v 10.08
##SPECTROMETER/DATA SYSTEM=Alpha
##DATE=11 Nov 2014 09:02:30
##DATA TYPE=INFRARED SPECTRUM
##DATA CLASS=XYDATA
##ORIGIN=
##OWNER=
##NPOINTS=1765
##FIRSTX=399.76428223
##LASTX=3997.64306641
##MAXX=3997.64306641
##MINX=399.76428223
##MAXY=0.76577991
##MINY=0.27364314
##XFACTOR=1.0000000000
##YFACTOR=1.000000000000000e-9
##FIRSTY=0.56410694
##DELTAX=2.03961372
##XUNITS=1/CM
##YUNITS=ARBITRARY UNITS
##XYDATA=(X++(Y..Y))
$$ plain form
399.8 564106941 563242912 560639620 558691382 558569908 557855189 555294037 553408563 553428233 552624404
418.1 552624404 549174547 546320736 544781864 542692900 540222585 539238870 539785147 539551914 538075328
436.5 538075328 537443638 537774086 536966026 535102308 534316540 534256399 533183575 531332314 530212283
454.8 530212283 529632509 527966022 525618851 524131417 523550928 522654831 521005809 519611776 518818974
473.2 518818974 517779827 516359329 515226483 514509559 513635099 512315631 511046410 510069847 508880556
491.5 508880556 507344902 505850315 504450262 502923608 501002908 498726726 496426940 494075656
507.9 494075656 491541892 488828838 485992312 483136415 480301112 477454394 474635839 472045392
524.2 472045392 469721437 467499524 465308070 463322967 461889714 461004406 460549116 460952222 462544948
$$ packed form
399.8E64106941q64029k603292j948238j21474p14719k561152j885474J9670q03829
418.1E52624404l449857k853811j538872k088964k470315r83715N46277k33233j476586
436.5E38075328o31690L30448q08060j863718p85768o0141j072824j851261j120031
454.8E30212283n79774j666487k347171j487434n80489q96097j649022j394033p92802
473.2E18818974j039147j420498j132846p16924q74460j319468j269221r76563j189291
491.5E08880556j535654j494587j400053j526654j920700k276182k299786k351284
507.9D94075656k533764k713054k836526k855897k835303k846718k818555k590447
524.2D72045392k323955k221913k191454j985103j433253q85308m55290M03106J592726
$$ plain form
542.5 462544948 464789689 466861755 468455523 469697416 470508426 470540017 469957441 469618976 469965667
560.9 469965667 470443308 470641911 470856935 471092135 470888257 470220357 469680816 469541669 469375134 469000936
581.3 469000936 468919098 469221264 469146729 468461841 467896610 467811704 467548847 466727138 466051936 465892732
601.7 465892732 465379626 463822484 461802840 459850580 457084298 453166485 449972183 449291885 450727493
620 450727493 452958256 455640793 459111303 462734908 465217233 466726601 468344986 469979465 470887333
638.4 470887333 471470833 472836882 474905163 476576626 477809757 479654521 481977940 483371437 483619958
656.8 483619958 483922392 484524250 484588295 484075934 484085619 485899627 487993747 489433080 491389811 494348139
677.2 494348139 497118920 498908401 500608325 502892375 504803121 505505383 505916476 506976426 507991970
$$ packed form
542.5D62544948K244741K072066J593768J241893Q11010L1591n82576l38465L46691
560.9D69965667M77641J98603K15024K35200k03878o67900n39541j39147j66535l74198
581.3D69000936q1838L02166p4535o84888n65231q4906k62857q21709o75202j59204
601.7D65892732n13106j557142k019644j952260k766282l917813l194302o80298J435608
620D50727493K230763K682537L470510L623605K482325J509368J618385J634479R07868
638.4D70887333N83500J366049K068281J671463J233131J844764K323419J393497K48521
656.8D83619958L02434O01858O4045n12361R685J814008K094120J439333J956731K958328
677.2D94348139K770781J789481J699924K284050J910746P02262M11093J059950J015544
$$ plain form
695.5 507991970 508125186 508270741 509764314 512150943 514083207 515685320 517989814 520750880 522845209
713.9 522845209 524428308 526827633 530190468 533280015 535877526 539090991 542948544 546060085
730.2 546060085 547994018 549927890 552355707 554227293 555094182 556039989 557784915 559336662 559857547
748.5 559857547 560253561 561390400 562331319 562079549 561582863 562097251 563068509 563418627 563700736 565046430
768.9 565046430 567062020 568544507 569699466 571741581 574660122 577295423 579447806 582162917
785.3 582162917 585626483 588643253 590689003 592745960 595224619 597055078 597789705 598467529 599676788
803.6 599676788 600659788 600935638 601402760 602942765 604728281 605499566 605270922 603906155 599843740
822 599843740 593762159 590459883 592368543 596259058 599268556 602665126 608051181 614269137 619340539
$$ packed form
695.5E07991970J33216J45555J493573K386629J932264J602113K304494K761066K094329
713.9E22845209J583099K399325L362835L089547K597511L213465L857553L111541
730.2E46060085J933933J933872K427817J871586Q66889R45807J744926J551747N20885
748.5E59857547L96014J136839R40919k51770m96686N14388R71258L50118K82109J345694
768.9E65046430K015590J482487J154959K042115K918541K635301K152383K715111
785.3E82162917L463566L016770K045750K056957K478659J830459P34627O77824J209259
803.6E99676788R83000K75850M67122J540005J785516P71285k28644j364767m062415
822E99843740o081581l302276J908660L890515L009498L396570N386055O217956N071402
$$ plain form
840.3 619340539 622691929 625032961 626829803 627549887 627070129 626710653 627788126 629983068 632225633
858.7 632225633 634399891 636829495 638941050 640001297 640467525 641109705 641488969 640737891 639091969
877 639091969 637296200 635105312 631717563 627479494 623723984 620910645 618405402 616118550 614925623
895.4 614925623 615184188 616029203 616670191 617306113 618058801 618140996 617023349 615467668 614398956
913.7 614398956 613567650 612368464 611259222 611047685 611381650 611268222 610563338 609792948 608664870
932.1 608664870 606111169 601963758 597073615 591588795 584672272 576261520 567602694 559683383
948.4 559683383 552497804 546077430 541030467 537588239 534928918 532176614 529403925 526864409
964.7 526864409 523900509 519644439 514243662 508219540 501238465 492633045 482659221 472284049
$$ packed form
840.3F19340539L351390K341032J796842P20084m79758l59476J077473K194942K242565
858.7F32225633K174258K429604K111555J060247M66228O42180L79264p51078j645922
877F39091969j795769k190888l387749m238069l755510k813339k505243k286852j192927
895.4F14925623K58565Q45015O40988O35922P52688Q2195j117647j555681j068712
913.7F14398956q31306j199186j109242k11537L33965j13428p04884p70390j128078
932.1F08664870k553701m147411m890143n484820o916523q410752q658826p919311
948.4E59683383p185579o420374n046963l442228k659321k752304k772689k539516
964.7E26864409k963900m256070n400777o024122o981075q605420r973824j0375172
$$ plain form
981.1 472284049 462072372 452062696 442596018 434392780 427563965 421360254 415167630 408955336
997.4 408955336 402569592 395627469 388324380 381467819 375590533 370487839 365777940 361605376
1013.7 361605376 358261198 355531871 353046715 350922257 349526912 348765761 348242521 347951800 348203391
1032 348203391 348976523 349845797 350512564 350954920 351002127 350348234 349146575 348006397 347262204 346661448
1052.4 346661448 345974028 345401764 345143914 345059216 344903350 344673753 344513923 344284415 343759537 343319386
1072.8 343319386 343726754 345220000 347445607 350126028 353186607 356204927 358369291 359295368 359287620
1091.2 359287620 358623564 357169509 354985297 352723002 350957453 349784166 349390447 350329369 352844715
1109.6 352844715 356479645 360671431 365306288 370365381 375328898 379588395 383350551 387298107
$$ packed form
981.1D72284049j0211677j0009676r466678q203238o828815o203711o192624o212294
997.4D08955336o385744o942123p303089o856561n877286n102694m709899m172564
1013.7C61605376l344178k729327k485156k124458j395345p61151n23240k90721K51591
1032C48203391P73132Q69274O66767M42356M7207o53893j201659j140178p44193o00756
1052.4C46661448o87420n72264k57850q4698j55866k29597j59830k29508n24878m40151
1072.8C43319386M07368J493246K225607K680421L060579L018320K164364R26077p748
1091.2C59287620o64056j454055k184212k262295j765549j173287l93719R38922K515346
1109.6C52844715L634930M191786M634857N059093M963517M259497L762156L947556
$$ plain form
1125.9 387298107 391493320 395443380 398874849 401834160 404160023 405366391 405453235 405257553 405498594
1144.2 405498594 406218469 407503635 409840345 413434058 417854488 422733247 428377748 435196191
1160.5 435196191 443033993 451773584 461876988 473662943 486501753 499357402 511898160 524217963
1176.9 524217963 535773635 545614123 553608775 560304761 565599322 568807602 569983244 569927394
1193.2 569927394 568910003 566598535 563347042 560336292 558117390 556196153 554221332 552480459
1209.5 552480459 550857365 548503995 545056164 541092336 537086308 532781065 528022230 523354411
1225.8 523354411 519273043 515576720 512012124 508927941 506755650 505259395 503981352 503076911
1242.1 503076911 502920806 503312290 503711224 504043639 504567266 505199850 505606651 505861759 506421387 507375956
$$ packed form
1125.9C87298107M195213L950060L431469K959311K325863J206368Q6844j95682K41041
1144.2D05498594P19875J285166K336710L593713M420430M878759N644501O818443
1160.5D35196191P837802Q739591J0103404J1785955J2838810J2855649J2540758J2319803
1176.9E24217963J1555672R840488P994652O695986N294561L208280J175642n5850
1193.2E69927394j017391k311468l251493l010750k218902j921237j974821j740873
1209.5E52480459j623094k353370l447831l963828m006028m305243m758835m667819
1225.8E23354411m081368l696323l564596l084183k172291j496255j278043r04441
1242.1E03076911j56105L91484L98934L32415N23627O32584M06801K55108N59628R54569
$$ plain form
1262.5 507375956 508365095 509243250 510243833 511329710 512045383 512134075 511796653 511138260 510050297
1280.9 510050297 508724928 507527232 506422579 504950464 502843618 500239551 497207284 493482560
1297.2 493482560 488934219 483829528 478465050 472811937 466799736 460771352 455102473 449812979
1313.5 449812979 444891989 440511167 436783165 433596760 430603892 427570671 424490601 421310186
1329.8 421310186 417948335 414560050 411424488 408396930 405149311 401945591 399189532 396840155
1346.2 396840155 394840449 393285871 392301679 391759187 391315967 390821934 390199155 389145821 387445003
1364.5 387445003 385257632 382581383 379509687 375797480 371002614 365420729 357493192 343650460
1380.8 343650460 327536911 322031319 331848890 344723433 351032585 353077710 353432149 352996141
$$ packed form
1262.5E07375956R89139Q78155J000583J085877P15673Q8692l37422o58393j087963
1280.9E10050297j325369j197696j104653j472115k106846k604067l032267l724724
1297.2D93482560m548341n104691n364478n653113o012201o028384n668879n289494
1313.5D49812979m920990m380822l728002l186405k992868l033221l080070l180415
1329.8D21310186l361851l388285l135562l027558l247619l203720k756059k349377
1346.2C96840155j999706j554578r84192n42492m43220m94033o22779j053334j700818
1364.5C87445003k187371k676249l071696l712207m794866n581885p927537j3842732
1380.8C43650460j6113549n505592R817571J2874543O309152K045125L54439m36008
$$ plain form
1397.1 352996141 352211148 351540834 351371258 351586699 352001250 352721244 353886992 355506152 357629716
1415.5 357629716 360421002 363943547 367635936 371631265 376071185 380635023 385027111 388667434
1431.8 388667434 391757727 395210952 398821861 401813447 404648513 407550961 410528302 413486063
1448.1 413486063 416220039 418975115 422292352 426968902 432375193 436736017 441052735 446213514
1464.5 446213514 451561004 456889659 463581353 472529262 481184423 487928957 493661374 498589545
1480.8 498589545 502355635 504797399 506225169 506165802 504033208 501102865 497898608 493431300 487939805
1499.1 487939805 482805312 478737772 474563599 467759609 461122870 456254095 452004284 448250353
1515.4 448250353 445206165 443342924 441940993 440146565 438009918 435485393 433315992 431417704
$$ packed form
1397.1C52996141p84993o70314j69576K15441M14551P19994J165748J619160K123564
1415.5C57629716K791286L522545L692389L995329M439920M563838M392088L640323
1431.8C88667434L090293L453225L610909K991586K835066K902448K977341K957761
1448.1D13486063K733976K755076L317237M676550N406291M360824M316718N160779
1464.5D46213514N347490N328655O691694Q947909Q655161O744534N732417M928171
1480.8D98589545L766090K441764J427770n9367k132594k930343l204257m467308n491495
1499.1D87939805n134493m067540m174173o803990o636739m868775m249811l753931
1515.4D48250353l044188j863241j401931j794428k136647k524525k169401j898288
$$ plain form
1531.8 431417704 428842217 426526278 425181925 423312128 420490772 418278694 416894585 416323811
1548.1 416323811 416223586 416492254 417308658 418600380 419403434 418480635 417550772 416832447 415696800
1566.4 415696800 413708776 410739899 408009708 405085713 400247842 395145059 390782535 386014640
1582.8 386014640 380723625 375305831 369977325 364663541 359426439 354454249 350042313 346171021
1599.1 346171021 342489928 338904709 335650861 332663924 329549968 326453835 323830694 321249008
1615.4 321249008 317934811 315053225 312690109 309941977 307093680 304284215 301575154 299652755
1631.7 299652755 298245609 296237320 294358581 293511301 293273360 293347299 293523401 293737203 294241190
1650.1 294241190 294799119 294895440 295381457 296565771 298329920 300591975 303330928 306434929 310216129
$$ packed form
1531.8D31417704k575487k315939j344353j869797k821356k212078j384109n70774
1548.1D16323811j00225K68668Q16404J291722Q03054r22799r29863p18325j135647
1566.4D15696800j988024k968877k730191k923995m837871n102783m362524m767895
1582.8C86014640n291015n417794n328506n313784n237102m972190m411936l871292
1599.1C46171021l681093l585219l253848k986937l113956l096133k623141k581686
1615.4C21249008l314197k881586k363116k748132k848297k809465k709061j922399
1631.7B99652755j407146k008289j878739q47280k37941P3939J76102K13802N03987
1650.1B94241190N57929R6321M86017J184314J764149K262055K738953L104001L781200
$$ plain form
1668.4 310216129 314616412 319020420 324258298 330398083 336448669 342694670 350409240 360635668
1684.7 360635668 370056868 378627807 388317436 398193926 409370273 421707630 433697701 446652234
1701.1 446652234 457160205 465987086 474885732 482625455 489281923 495206416 500727832 505995929
1717.4 505995929 510074019 513131857 516152859 519376099 522495151 525400281 528200030 531237781
1733.7 531237781 534152031 536863029 540203810 544432938 549229503 554398358 560071349 566614866
1750 566614866 573521137 579895198 586360157 593115628 599153996 604413450 609573185 615400493 621997237
1768.4 621997237 628581822 634450912 639261365 643443167 647386193 650930345 654170930 657489836
1784.7 657489836 660722256 663637936 666471720 669377446 671964288 674188673 676362038 678688109
$$ packed form
1668.4C10216129M400283M404008N237878O139785O050586O246001P714570J0226428
1684.7C60635668R421200Q570939R689629R876490J1176347J2337357J1990071J2954533
1701.1D46652234J0507971Q826881Q898646P739723O656468N924493N521416N268097
1717.4E05995929M078090L057838L021002L223240L119052K905130K799749L037751
1733.7E31237781K914250K710998L340781M229128M796565N168855N672991O543517
1750E66614866O906271O374061O464959O755471O038368N259454N159735N827308O596744
1768.4F21997237O584585N869090M810453M181802L943026L544152L240585L318906
1784.7F57489836L232420K915680K833784K905726K586842K224385K173365K326071
$$ plain form
1801 678688109 680937111 682845533 684680462 686776876 688951194 690706015 692211747 693916321 695839584
1819.4 695839584 697650969 699248135 700882137 702653527 704202235 705256402 706380010 707881749
1835.7 707881749 709367335 710615873 711964488 713524640 714831889 715678036 716480017 717637956 718903542
1854 718903542 719873965 720698535 721770048 722978175 724027395 725005805 726009488 726850212 727453113
1872.4 727453113 728017271 728765368 729708552 730509579 731081247 731795430 732804179 733685911 734173417
1890.7 734173417 734720826 735533059 736245155 736705959 737206519 737929225 738716662 739326596 739782989 740326166
1911.1 740326166 740960836 741513431 741974413 742524445 743132353 743511677 743700624 744058013 744567990 744953811
1931.5 744953811 745196700 745508611 745998979 746480048 746742725 746882200 747139752 747403204 747516453 747672796
$$ packed form
1801F78688109K249002J908422J834929K096414K174318J754821J505732J704574J923263
1819.4F95839584J811385J597166J634002J771390J548708J054167J123608J501739
1835.7G07881749J485586J248538J348615J560152J307249Q46147Q01981J157939J265586
1854G18903542R70423Q24570J071513J208127J049220R78410J003683Q40724O02901
1872.4G27453113N64158P48097R43184Q01027N71668P14183J008749Q81732M87506
1890.7G34173417N47409Q12233P12096M60804N00560P22706P87437O09934M56393N43177
1911.1G40326166O34670N52595M60982N50032O07908L79324J88947L57389N09977L85821
1931.5G44953811K42889L11911M90368M81069K62677J39475K57552K63452J13249J56343
$$ plain form
1951.9 747672796 748009861 748337388 748484552 748618782 748896241 749212146 749396920 749505401 749708772 749940991
1972.3 749940991 750045300 750095189 750262022 750495017 750650585 750735819 750886202 751112759 751243770 751193464
1992.7 751193464 751171231 751289845 751367807 751358092 751362681 751419961 751441896 751389802 751375139 751438081 751455307 751349926
2017.2 751349926 751215935 751125395 751027882 750871062 750726879 750659227 750610888 750494003 750366271 750343561
2037.6 750343561 750342131 750235736 750128448 750139713 750147760 750069380 750008881 750039220 750042319 749896526 749713957
2060 749713957 749669194 749711335 749687433 749648452 749700129 749786377 749789238 749767601 749866128 750026584 750091970 750107646
2084.5 750107646 750222683 750381768 750448644 750482202 750633121 750847518 750992417 751095653 751276016 751522541
2104.9 751522541 751687109 751752377 751860321 752060294 752231061 752334237 752494991 752760410 752968192 753036439
$$ packed form
1951.9G47672796L37065L27527J47164J34230K77459L15905J84774J08481K03371K32219
1972.3G49940991J04309M9889J66833K32995J55568Q5234J50383K26557J31011n0306
1992.7G51193464k2233J18614P7962r715M589N7280K1935n2094j4663O2942J7226j05381
2017.2G51349926j33991r0540r7513j56820j44183o7652m8339j16885j27732k2710
2037.6G50343561j430j06395j07288J1265Q047p8380o0499L0339L099j45793j82569
2060G49713957m4763M2141k3902l8981N1677Q6248K861k1637R8527J60456O5386J5676
2084.5G50107646J15037J59085O6876L3558J50919K14397J44899J03236J80363K46525
2104.9G51522541J64568O5268J07944J99973J70767J03176J60754K65419K07782O8247
$$ plain form
2125.3 753036439 753145576 753394067 753620327 753710806 753832817 754104376 754381061 754535556 754662156 754898131
2145.7 754898131 755176485 755368292 755531549 755825877 756211162 756474614 756622910 756869078 757220685 757518589
2166.1 757518589 757751942 758061767 758469701 758772492 758914053 759117603 759463727 759776354 759981096 760211945
2186.5 760211945 760555148 760879278 761051476 761196852 761464298 761738539 761867404 761980891 762239754 762520671
2206.9 762520671 762662530 762752831 762946784 763202548 763387740 763517082 763709784 763946593 764101565 764164507
2227.3 764164507 764265418 764456689 764605403 764647186 764729023 764936149 765107155 765134752 765159070 765301466
2247.7 765301466 765448689 765472770 765469551 765554190 765665591 765686274 765643716 765657008 765729725 765742421 765687287
2270.1 765687287 765702426 765779912 765760958 765632033 765570045 765622079 765607774 765458941 765320659 765226424 765068173
$$ packed form
2125.3G53036439J09137K48491K26260R0479J22011K71559K76685J54495J26600K35975
2145.7G54898131K78354J91807J63257K94328L85285K63452J48296K46168L51607K97904
2166.1G57518589K33353L09825M07934L02791J41561K03550L46124L12627K04742K30849
2186.5G60211945L43203L24130J72198J45376K67446K74241J28865J13487K58863K80917
2206.9G62520671J41859R0301J93953K55764J85192J29342J92702K36809J54972O2942
2227.3G64164507J00911J91271J48714M1783Q1837K07126J71006K7597K4318J42396
2247.7G65301466J47223K4081l219Q4639J11401K0683m2558J3292P2717J2696n5134
2270.1G65687287J5139P7486j8954j28925o1988N2034j4305j48833j38282r4235j58251
$$ plain form
2292.5 765068173 764840722 764629066 764474392 764288306 763992846 763675690 763433695 763162971 762736142 762251914
2312.9 762251914 761849403 761429429 760792971 760035396 759461761 759087265 758626044 757987499 757409990 757031262
2333.3 757031262 756621420 756043792 755522609 755207181 755089343 755262077 755568147 755445719 754545212 753075004
2353.7 753075004 751654685 750661433 750051081 749684274 749512196 749540448 749722064 749979079 750271678 750570178
2374.1 750570178 750822961 750979185 750985920 750788271 750360191 749668121 748728096 747614682 746378839 745141685
2394.5 745141685 744136751 743506074 743213356 743112147 743029118 742886782 742675185 742377698 741949677 741390705
2414.9 741390705 740794063 740205169 739507020 738576949 737615466 737029910 736869633 736769795 736505330 736164868
2435.3 736164868 735807955 735356033 734817445 734296978 733818948 733303964 732683659 732023299 731408358 730788648
$$ packed form
2292.5G65068173k27451k11656j54674j86086k95460l17156k41995k70724m26829m84228
2312.9G62251914m02511m19974o36458p57575n73635l74496m61221o38545n77509l78728
2333.3G57031262m09842n77628n21183l15428j17838J72734L06070j22428r00507j470208
2353.7G53075004j420319r93252o10352l66807j72078K8252J81616K57015K92599K98500
2374.1G50570178K52783J56224O735j97649m28080o92070r40025j113414j235843j237154
2394.5G45141685j004934o30677k92718j01209q3029j42336k11597k97487m28021n58972
2414.9G41390705n96642n88894o98149r30071r61483n85556j60277r9838k64465l40462
2435.3G36164868l56913m51922n38588n20467m78030n14984o20305o60360o14941o19710
$$ plain form
2455.7 730788648 730102420 729408801 728761137 728084028 727297187 726452291 725664973 724939942 724164724 723302126
2476.1 723302126 722446144 721662521 720892131 720057309 719211876 718431234 717641652 716791570 715992093 715301991
2496.5 715301991 714589834 713775873 712959409 712233663 711543322 710782886 709990382 709264159 708565533 707788885
2516.9 707788885 706977963 706265450 705612421 704892993 704121828 703398287 702720940 701984286 701177835 700421154
2537.3 700421154 699735045 698994994 698173046 697395980 696723342 696022928 695186317 694308102 693497479 692720234
2557.7 692720234 691900790 691058099 690278113 689523458 688661456 687713027 686819851 685971498 685026586 684032679
2578.1 684032679 683159173 682358861 681451917 680404127 679355443 678413510 677495122 676486611 675469398
2596.4 675469398 674561918 673679173 672693491 671656966 670678258 669742763 668776512 667793095 666863739
$$ packed form
2455.7G30788648o86228o93619o47664o77109p86841q44896p87318p25031p75218q62598
2476.1G23302126q55982p83623p70390q34822q45433p80642p89582q50082p99477o90102
2496.5G15301991p12157q13961q16464p25746o90341p60436p92504p26223o98626p76648
2516.9G07788885q10922p12513o53029p19428p71165p23541o77347p36654q06451p56681
2537.3G00421154o86109p40051q21948p77066o72638p00414q36611q78215q10623p77245
2557.7F92720234q19444q42691p79986p54655q62002r48429q93176q48353r44912r93907
2578.1F84032679q73506q00312r06944j047790j048684r41933r18388j008511j017213
2596.4F75469398r07480q82745r85682j036525r78708r35495r66251r83417r29356
$$ plain form
2614.8 666863739 665968776 665006995 663982689 663036764 662199378 661299169 660257280 659261465 658421159
2633.2 658421159 657548666 656522572 655507267 654631555 653765500 652797282 651823878 650940955 650072217
2651.5 650072217 649105668 648110509 647217274 646339118 645327508 644271433 643306017 642369032 641350508
2669.9 641350508 640273869 639251351 638290107 637251675 636122048 635067999 634097934 633035302 631853104
2688.2 631853104 630709887 629666269 628592908 627375662 626124859 624997020 623881340 622629702
2704.5 622629702 621338725 620133221 618948936 617662966 616330683 615104675 613939106 612666011
2720.9 612666011 611304998 610004604 608810425 607635081 606409788 605215907 604143143 603114903
2737.2 603114903 602044284 600996614 600036025 599074125 598040640 597026527 596093118 595136404 594057083
$$ packed form
2614.8F66863739q94963r61781j024306r45925q37386r00209j041889r95815q40306
2633.2F58421159q72493j026094j015305q75712q66055r68218r73404q82923q68738
2651.5F50072217r66549r95159q93235q78156j011610j056075r65416r36985j018524
2669.9F41350508j076639j022518r61244j038432j129627j054049r70065j062632j182198
2688.2F31853104j143217j043618j073361j217246j250803j127839j115680j251638
2704.5F22629702j290977j205504j184285j285970j332283j226008j165569j273095
2720.9F12666011j361013j300394j194179j175344j225293j193881j072764j028240
2737.2F03114903j070619j047670r60589r61900j033485j014113r33409r56714j079321
$$ plain form
2755.5 594057083 592934549 591877222 590843201 589773834 588719904 587729573 586754382 585691035 584524930
2773.9 584524930 583382428 582287908 581116617 579854488 578625560 577433348 576140463 574763000
2790.2 574763000 573423505 572107732 570709288 569201291 567693472 566253841 564758539 563094795
2806.5 563094795 561352909 559661746 558002234 556279600 554491639 552668929 550757468 548723578
2822.8 548723578 546612263 544480503 542311311 540009201 537526369 534889519 532070816 528931856
2839.1 528931856 525293469 521025240 516084135 510726631 505815566 502331138 500441849 499531418
2855.5 499531418 498918653 498213708 497201771 495704293 493676335 491315722 488924921 486773700 485032767
2873.8 485032767 483732074 482779980 481964529 481067061 479983449 478731126 477393001 475958109 474345118
$$ packed form
2755.5E94057083j122534j057327j034021j069367j053930r90331r75191j063347j166105
2773.9E84524930j142502j094520j171291j262129j228928j192212j292885j377463
2790.2E74763000j339495j315773j398444j507997j507819j439631j495302j663744
2806.5E63094795j741886j691163j659512j722634j787961j822710j911461k033890
2822.8E48723578k111315k131760k169192k302110k482832k636850k818703l138960
2839.1E28931856l638387m268229m941105n357504m911065l484428j889289r10431
2855.5D99531418o12765p04945j011937j497478k027958k360613k390801k151221j740933
2873.8D85032767j300693r52094q15451q97468j083612j252323j338125j434892j612991
$$ plain form
2892.2 474345118 472575456 470722616 468813270 466827244 464733690 462487787 460006416 457187325
2908.5 457187325 453890562 450065613 445921451 441903919 438496411 435942203 434215873 433170766
2924.8 433170766 432638079 432516098 432765514 433328241 434188813 435425222 437036008 438840121 440601498
2943.2 440601498 442146629 443383038 444265932 444760114 444927484 445005447 445242763 445784003 446716428
2961.5 446716428 448055446 449753970 451755553 453988969 456343234 458679557 460909873 463020742
2977.8 463020742 464971095 466712654 468272984 469668210 470857650 471828908 472555280 472948074 473015070
2996.2 473015070 472835481 472424150 471786886 470956534 470007062 469026834 468037069 466983259 465834588
3014.5 465834588 464641809 463446826 462199777 460848063 459423453 457965821 456505746 455078721
$$ packed form
2892.2D74345118j769662j852840j909346j986026k093554k245903k481371k819091
2908.5D57187325l296763l824949m144162m017532l407508k554208j726330j045107
2924.8D33170766n32687j21981K49416N62727Q60572J236409J610786J804113J761377
2943.2D40601498J545131J236409Q82894M94182J67370P7963K37316N41240R32425
2961.5D46716428J339018J698524K001583K233416K354265K336323K230316K110869
2977.8D63020742J950353J741559J560330J395226J189440R71258P26372L92794O6996
2996.2D73015070j79589m11331o37264q30352r49472r80228r89765j053810j148671
3014.5D65834588j192779j194983j247049j351714j424610j457632j460075j427025
$$ plain form
3030.9 455078721 453685582 452283204 450839549 449382156 447957844 446564645 445131004 443618596
3047.2 443618596 442098916 440649658 439237595 437808692 436393380 435036063 433757126 432547241
3063.5 432547241 431380808 430268824 429198235 428138286 427110046 426132143 425197452 424263090 423280507
3081.9 423280507 422290355 421387494 420565516 419701695 418755919 417825133 416937232 416013539 415040553 414054960
3102.2 414054960 413033515 411962867 410870522 409770668 408679903 407556176 406349927 405112177
3118.6 405112177 403832823 402462721 401082903 399746507 398396641 397001743 395560950 394086957
3134.9 394086957 392603874 391117662 389592439 388005048 386413783 384875417 383360028 381800205
3151.2 381800205 380193025 378574371 376961261 375344753 373721123 372129828 370554388 368931144
$$ packed form
3030.9D55078721j393139j402378j443655j457393j424312j393199j433641j512408
3047.2D43618596j519680j449258j412063j428903j415312j357317j278937j209885
3063.5D32547241j166433j111984j070589j059949j028240r77903r34691r34362r82583
3081.9D23280507r90152r02861q21978q63821r45776r30786q87901r23693r72986r85593
3102.2D14054960j021445j070648j092345j099854j090765j123727j206249j237750
3118.6D05112177j279354j370102j379818j336396j349866j394898j440793j473993
3134.9C94086957j483083j486212j525223j587391j591265j538366j515389j559823
3151.2C81800205j607180j618654j613110j616508j623630j591295j575440j623244
$$ plain form
3167.5 368931144 367289871 365707278 364173979 362621754 361058027 359546274 358078539 356601179
3183.8 356601179 355102986 353637040 352217466 350820929 349475682 348203957 346977472 345736027
3200.1 345736027 344475806 343258619 342136204 341074646 339996040 338924259 337916940 336942196
3216.5 336942196 335948557 334970534 334046721 333101571 332068354 331029207 330073863 329150587 328134835
3234.8 328134835 327024341 325944215 324904442 323800683 322621703 321471959 320371807 319220603
3251.1 319220603 317983925 316707045 315459698 314265966 313052416 311790854 310523868 309294343
3267.5 309294343 308142602 307051152 305964291 304871142 303808868 302821934 301937640 301108718 300308883
3285.8 300308883 299590677 298928589 298297405 297725588 297162116 296606332 296133667 295694262 295237809 294795007
$$ packed form
3167.5C68931144j641273j582593j533299j552225j563727j511753j467735j477360
3183.8C56601179j498193j465946j419574j396537j345247j271725j226485j241445
3200.1C45736027j260221j217187j122415j061558j078606j071781j007319r74744
3216.5C36942196r93639r78023r23813r45150j033217j039147r55344r23276j015752
3234.8C28134835j110494j080126j039773j103759j178980j149744j100152j151204
3251.1C19220603j236678j276880j247347j193732j213550j261562j266986j229525
3267.5C09294343j151741j091450j086861j093149j062274r86934q84294q28922p99835
3285.8C00308883p18206o62088o31184n71817n63472n55784m72665m39405m56453m42802
$$ plain form
3306.2 294795007 294327229 293795556 293223947 292648077 292099625 291533023 290902495 290261060 289603502 288868785
3326.6 288868785 288103342 287382782 286690325 285994321 285295397 284614474 283964723 283330858 282726943 282173991
3347 282173991 281642586 281102836 280544698 279967546 279465437 279123217 278823137 278441519 278064311 277743459
3367.4 277743459 277372032 276913702 276491791 276190251 275929421 275652468 275376230 275114506 274872750 274708271
3387.8 274708271 274636716 274530709 274323821 274099380 273984373 273989886 273946583 273773938 273643136 273661107
3408.2 273661107 273774505 273899645 273979574 274058521 274229050 274477482 274726629 275046080 275520176 276079088
3428.6 276079088 276621699 277226120 277923167 278529078 278990895 279499292 280227780 281123132 282012016 282843798
3449 282843798 283748746 284779608 285872191 287009627 288210094 289403200 290596932 291915029 293314904
$$ packed form
3306.2B94795007m67778n31673n71609n75870n48452n66602o30528o41435o57558p34717
3326.6B88868785p65443p20560o92457o96004o98924o80923o49751o33865o03915n52952
3347B82173991n31405n39750n58138n77152n02109l42220l00080l81618l77208l20852
3367.4B77743459l71427m58330m21911l01540k60830k76953k76238k61724k41756j64479
3387.8B74708271p1555j06007k06888k24441j15007N513m3303j72645j30802J7971
3408.2B73661107J13398J25140P9929P8947J70529K48432K49147L19451M74096N58912
3428.6B76079088N42611O04421O97047O05911M61817N08397P28488Q95352Q88884Q31782
3449B82843798R04948J030862J092583J137436J200467J193106J193732J318097J399875
$$ plain form
3467.3 293314904 294662148 295907259 297144353 298472911 299962580 301558733 303073734 304532737
3483.6 304532737 306104422 307743728 309352130 310982704 312677145 314435303 316229701 318068683
3500 318068683 319906592 321665168 323380291 325138569 327027440 329066247 331107825 333039820 335015297
3518.3 335015297 337187618 339478642 341663331 343760699 345932275 348179013 350520670 353026241
3534.6 353026241 355590582 358086854 360670984 363436311 366227746 368869245 371476710 374222964
3551 374222964 377104819 380029857 382999003 386125565 389383167 392683059 396009684 399449378 402890682
3569.3 402890682 406243742 409661442 413226068 416912317 420742780 424732357 428782642 432782978
3585.6 432782978 436722159 440688014 444692284 448804796 453057468 457423419 461825371 466214061
$$ packed form
3467.3B93314904J347244J245111J237094J328558J489669J596153J515001J459003
3483.6C04532737J571685J639306J608402J630574J694441J758158J794398J838982
3500C18068683J837909J758576J715123J758278J888871K038807K041578J931995J975477
3518.3C35015297K172321K291024K184689K097368K171576K246738K341657K505571
3534.6C53026241K564341K496272K584130K765327K791435K641499K607465K746254
3551C74222964K881855K925038K969146L126562L257602L299892L326625L439694L441304
3569.3D02890682L353060L417700L564626L686249L830463L989577M050285M000336
3585.6D32782978L939181L965855M004270M112512M252672M365951M401952M388690
$$ plain form
3601.9 466214061 470650882 475149691 479717076 484307885 488965631 493694305 498358816 503046691
3618.3 503046691 507842720 512487113 517084301 521880567 526947200 531969786 536621630 541254878
3634.6 541254878 545933723 550604522 555376053 560221195 565090179 570076168 575097740 579601705
3650.9 579601705 583591223 587545931 591661096 595689595 599491656 603150666 606842279 610627890
3667.2 610627890 614326358 617798090 621020079 623884439 626323342 628616869 630972326 633552015
3683.5 633552015 636379480 639105082 641122460 642583132 644130647 645854354 647662342 649420440
3699.8 649420440 650934219 652353704 653976500 655733109 657251060 658228397 659145713 660298049 661515951
3718.2 661515951 662670791 663699090 664576113 665306568 666251898 667624474 669150472 670218289 670576870
$$ packed form
3601.9D66214061M436821M498809M567385M590809M657746M728674M664511M687875
3618.3E03046691M796029M644393M597188M796266N066633N022586M651844M633248
3634.6E41254878M678845M670799M771531M845142M868984M985989N021572M503965
3650.9E79601705L989518L954708M115165M028499L802061L659010L691613L785611
3667.2F10627890L698468L471732L221989K864360K438903K293527K355457K579689
3683.5F33552015K827465K725602K017378J460672J547515J723707J807988J758098
3699.8F49420440J513779J419485J622796J756609J517951R77337R17316J152336J217902
3718.2F61515951J154840J028299Q77023P30455R45330J372576J525998J067817L58581
$$ plain form
3736.5 670576870 670995057 671954215 672932029 673543036 674441576 675454736 675741136 675707579 676270902 677145422
3756.9 677145422 677730739 678161204 678826988 679560125 680192590 680645943 680895627 681248963 681900620 682693779
3777.3 682693779 683225274 683526218 683905482 684294820 684699416 685217321 685842156 686510742 687103808 687716663
3797.7 687716663 688223541 688372374 688714266 689133406 689178407 689363897 690016448 690739274 691150784 691595614
3818.1 691595614 691896915 691768289 691870451 692203224 692567110 692975879 693431973 694053531 694541156 694604635
3838.5 694604635 694640338 694679439 694648504 694955528 695796311 696692467 696594298 695845783 695926905 696408570
3858.9 696408570 696838439 697088718 697231472 697547734 697763801 697703123 697648823 697719634 698087633 698488176
3879.3 698488176 698652446 698721290 698549986 698483229 698771179 698876560 698843300 699110627 699548721 699884534
$$ packed form
3736.5F70576870M18187R59158R77814O11007Q98540J013160K86400l3557N63323Q74520
3756.9F77145422N85317M30465O65784P33137O32465M53353K49684L53336O51657P93159
3777.3F82693779N31495L00944L79264L89338M04596N17905O24835O68586N93066O12855
3797.7F87716663N06878J48833L41892M19140M5001J85490O52551P22826M11510M44830
3818.1F91595614L01301j28626J02162L32773L63886M08769M56094O21558M87625O3479
3838.5F94604635L5703L9101l0935L07024Q40783Q96156r8169p48515Q1122M81665
3858.9F96408570M29869K50279J42754L16262K16067o0678n4300P0811L67999M00543
3879.3F98488176J64270O8844j71304o6757K87950J05381l3260K67327M38094L35813
$$ plain form
3899.7 699884534 699950457 699661613 699314833 699188709 699203432 699358642 699647546 699827194 699790239 699764967
3920.1 699764967 699842989 699838221 699803054 700002789 700264275 700264096 700112879 700021744 700045466 700169921 700255752
3942.5 700255752 700301409 700434387 700524330 700448871 700341761 700321198 700353920 700378656 700390279 700432003 700543284
3965 700543284 700687170 700769842 700744092 700669169 700640619 700732172 700880587 700974166 701048911 701099575 701086342
3987.4 701086342 701097786 701166809 701211095 701217055 701227427
3997.6 701227427
$$ packed form
3899.7F99884534O5923k88844l46780j26124J4723J55210K88904J79648l6955k5272
3920.1F99764967P8022m768l5167J99735K61486j79j51217r1135K3722J24455Q5831
3942.5G00255752M5657J32978Q9943p5459j07110k0563L2722K4736J1623M1724J11281
3965G00543284J43886Q2672k5750p4923k8550R1553J48415R3579P4745N0664j3233
3987.4G01086342J1444O9023M4286N960J0372
3997.6G01227427
##END=$$ End of the data block
