##TITLE=$$ Begin of the data block
##JCAMP-DX=5.00 $$ ACD/SpecManager v 10.08
##SPECTROMETER/DATA SYSTEM=Alpha
##DATE=11 Nov 2014 09:02:30
##DATA TYPE=INFRARED SPECTRUM
##DATA CLASS=XYDATA
##ORIGIN=
##OWNER=
##NPOINTS=1765
##FIRSTX=399.76428223
##LASTX=3997.64306641
##MAXX=3997.64306641
##MINX=399.76428223
##MAXY=0.83555210
##MINY=0.48379081
##XFACTOR=1.0000000000
##YFACTOR=1.000000000000000e-9
##FIRSTY=0.74905628
##DELTAX=2.03961372
##XUNITS=1/CM
##YUNITS=ARBITRARY UNITS
##XYDATA=(X++(Y..Y))
399.8G49056280J758992j228869k192616n64337K99275q74639k083301j384854k69592
418.1G42516339j151681k334654j205683R52899N05507j818418j587510O67929R15230
436.5G37459958j079262j874506k65062Q91328m74513j740694n37991J138508K59817
454.8G33777583k142728j850009P24018N80966j832604k244353j09375Q86023o43790
473.2G27145731j672506j70231J309812J16706j878857j384259Q67308J128077j021802
491.5G24439979j754165R3877J036525n29826k001047j032770M92096j78813j850009
509.9G18715847j668454r4831M5598j640499k161503m88698O27398l95417j714349
528.3G11225092j116156L48389K15828j072704q41022J028776J879037N92351o25074
$$ y = [749056280, 750815272, 749586403, 747393787, 746829450, 747128725, 746254086, 744170785, 742785931, 742516339, 741364658, 739030004, 737824321, 738777220, 739282727, 737464309, 735876799, 736544728, 737459958, 736380696, 734506190, 734241128, 735132456, 734657943, 732917249, 732379258, 733517766, 733777583, 731634855, 729784846, 730508864, 731089830, 729257226, 727012873, 726903498, 727789521, 727145731, 725473225, 725302994, 726612806, 726729512, 724850655, 723466396, 724333704, 725461781, 724439979, 722685814, 722779691, 723816216, 723286390, 721285343, 720252573, 720744669, 720565856, 718715847, 717047393, 716952562, 716998160, 715357661, 713196158, 712707460, 713334858, 712939441, 711225092, 710108936, 710457325, 710673153, 709600449, 708759427, 709788203, 711667240, 712259591, 711634517]
546.6G11634517P7843J106322L06547j189828j015842L48926P20083k49982p72595
565G10965991J02878Q19564l8028j072824n14686P54296P69020m16160p65562M19557
585.4G11024046J106262m77j121342l53813R28640N78463o53028o89745L88622N68152
605.8G11775780o48678j431524o97434K47836j06156q87096q1122J751840K173901
624.1G12097347R93609M45962J302302J789451O77645m89175J20103J539171J573324
642.5G20049739L50058P4387J298308J976550Q93175k22683L60906J390219P38382
660.8G26909041o37173l19243J593888K183616J56760n7160J393199K371490J528918
679.2G35123336K51949N03600J619994J441479l6955n43773N25117J170933K40445
$$ y = [711634517, 711712360, 712818682, 713125229, 711935401, 710919559, 711268485, 711988568, 711738586, 710965991, 711068869, 711888433, 711850405, 710777581, 710262895, 711017191, 711786211, 711370051, 710604489, 711024046, 712130308, 712129831, 711008489, 710654676, 711583316, 712161779, 711508751, 710819006, 711207628, 711775780, 711127102, 709695578, 708998144, 709245980, 709139824, 708252728, 708171606, 709923446, 712097347, 713090956, 713536918, 714839220, 716628671, 717306316, 716817141, 716937244, 718476415, 720049739, 720399797, 720474184, 721772492, 723749042, 724642217, 724419534, 724780440, 726170659, 726909041, 726271868, 725952625, 727546513, 729730129, 729886889, 729829729, 731222928, 733594418, 735123336, 735375285, 735878885, 737498879, 738940358, 738903403, 738359630, 738884747, 740055680, 740296125]
697.5G40296125o25491K03252J568735J480698L63708L08931J592874K194405J216411
715.9G48599648M11571J151263K193511J858532R29475J091778K067983K063513P56502
734.3G61123776l2186P27713J584590R86039n6565J53482J115799J075745r0659n79119
754.7G66008615L06428R93431L74257l79979J92225J377284J449704N17726K61069
773G71100760J193344J802623J168669N00261R63450J867711J733482P11859N02407
791.4G81544566J447976J885116J013279J67608N74768J367926R76801j13487j71125
809.7G88693428Q04901J198173L58939m32849j17242K56180m35352j165748m86135
828.1G88674295J074552J670540Q81910M82559J659513K931774K360642P40528K93195
$$ y = [740296125, 739670634, 739873886, 741442621, 742923319, 743287027, 743595958, 745188832, 747383237, 748599648, 749011219, 750162482, 752355993, 754214525, 755144000, 756235778, 758303761, 760367274, 761123776, 761091590, 761819303, 763403893, 764389932, 764333367, 764486849, 765602648, 766678393, 766587734, 766008615, 766315043, 767308474, 767682731, 767302752, 767494977, 768872261, 770321965, 770839691, 771100760, 772294104, 774096727, 775265396, 775765657, 776729107, 778596818, 780330300, 781042159, 781544566, 782992542, 784877658, 785890937, 786058545, 786633313, 788001239, 788978040, 788864553, 788693428, 789498329, 790696502, 791055441, 790622592, 790505350, 790761530, 790326178, 789160430, 788674295, 789748847, 791419387, 792301297, 792783856, 794443369, 797375143, 799735785, 800476313, 800769508]
846.4H00769508R74059R13620k14636o50406N05328J573265R19640l18289k16246P05183
866.8H04961026N25057q01504j375734n52714l2842r83775k104104j807511q45551
885.2G96982348r93073k008081j997232n98490L61204j14381n52714L40104J295626
903.5G92715311O33240q65042j242519m72843l10660j286387j876116j064778k2172
921.9G86208034k73824j193285j091421k05099l26038j715541k677440k387524k143979
940.3G74193883l114998m292250m135609l088236k705097l098964k899111j703501
956.6G49156117r07123j479447k341985k117813j434445j843989l179789l873348l620148
974.9G28358030l786444n000651n968392n547524m607498m422963m644275m134774
$$ y = [800769508, 801743567, 802657187, 802442551, 801792145, 802297473, 803870738, 804790378, 804472089, 804255843, 804961026, 805486083, 804684579, 803308845, 802756131, 802723289, 801739514, 799635410, 797827899, 796982348, 795989275, 793981194, 791983962, 791385472, 791746676, 791632295, 791079581, 791419685, 792715311, 793348551, 792483509, 791240990, 790768147, 790457487, 789171100, 787294984, 786230206, 786208034, 785934210, 784740925, 783649504, 783444405, 783118367, 781402826, 778725386, 776337862, 774193883, 771078885, 766786635, 762651026, 759562790, 756857693, 753758729, 750859618, 749156117, 748248994, 746769547, 744427562, 742309749, 740875304, 739031315, 735851526, 731978178, 728358030, 724571586, 719570935, 713602543, 708055019, 703447521, 699024558, 694380283, 690245509]
991.3F90245509l000736k563894l283620m027664l878236l469050l743947m307568
1007.6F61970794m095197l190696k649367k747655k631425j741350p55787n51999p31289
1025.9F42876029l27647N06223P97152M16040K70427P04169Q86202J60038p95602q49486
1046.3F44643545j02579K48193j46508k91586K96772P84218M65453p5996m1962K60651
1066.7F46040201Q464p35819r06349M77J101911J492262J554251K000928K463758K047002
1087.1F55067086R09984J62900J73271J70588l41117p27117k93792N23031Q45432P97510
1107.5F57287776J200557K104402K675950K478004K091408K181649K444327K161383
1123.8F74625456J531959J511037K274275K636314J855134Q63851N82695N58436R6619
$$ y = [690245509, 687244773, 684680879, 681397259, 677369595, 673491359, 670022309, 666278362, 661970794, 657875597, 654684901, 652035534, 649287879, 646656454, 644915104, 644159317, 643607318, 642876029, 642548382, 643054605, 643851757, 644267797, 644538224, 645242393, 646128595, 646288633, 645493031, 644643545, 644540966, 644789159, 644642651, 644351065, 644647837, 645432055, 645897508, 645821512, 645779550, 646040201, 646048665, 645312846, 644406497, 644406974, 645508885, 647001147, 648555398, 650556326, 653020084, 655067086, 655977070, 656139970, 656313241, 656483829, 656142712, 655415595, 655121803, 655644834, 656490266, 657287776, 658488333, 660592735, 663268685, 665746689, 667838097, 670019746, 672464073, 674625456, 676157415, 677668452, 679942727, 682579041, 684434175, 685298026, 685880721, 686439157, 686535776]
1142.2F86535776m06742j06335Q59678J449942J338065J408100K191842L044724L327608
1160.5F99642658L464997M274547N551756O236493O018877N758107O018042O134689
1176.9G43100166N414367M355133L881216L814518L187835J902342Q86321N73635K25366
1195.2G67340899o95885j473367j348793p71881o36041r97245j079440o61791n58853
1213.6G59117603j232087j953066j939714j581430j679003k121330k117574j533866
1229.9G44959533j108527j240492j332640q16763j64211p0393l15010j71483L75748
1248.2G40115762O08444K29418j12056J44720N75780N10812J98365L71277R21965J097261
1268.6G44661748P11263M57823P20858R44853N88537J6927o3657K69115K74956k59519
$$ y = [686535776, 686129034, 686022699, 686882377, 688332319, 689670384, 691078484, 693270326, 696315050, 699642658, 703107655, 707382202, 712933958, 719170451, 725189328, 730947435, 736965477, 743100166, 748514533, 752869666, 756750882, 760565400, 763753235, 765655577, 766541898, 767115533, 767340899, 766645014, 765171647, 763822854, 763050973, 762414932, 761417687, 760338247, 759676456, 759117603, 757885516, 755932450, 753992736, 752411306, 750732303, 748610973, 746493399, 744959533, 743851006, 742610514, 741277874, 740461111, 740296900, 740226507, 739911497, 739740014, 740115762, 740724206, 740953624, 740841568, 740986288, 741562068, 742072880, 742271245, 742642522, 743564487, 744661748, 745373011, 745830834, 746551692, 747496545, 748085082, 748102009, 748038352, 748307467, 748582423, 748322904]
1289G48322904o37174m81724l90768r24826j600921j715005j430928j465082j970768
1307.4G37705708k242268j952350j623332j720667j915634j575887q87513p32124j126230
1325.8G23929703j295686r72986o84142q40366j049876q17597j94847P1764k64824
1344.1G17881143n19752l67821l37958p26342j043976q98182p24494j236260k057672
1362.5G09968686k144694j890123k323032l126680m077316m904866n729318j0692298
1378.8F75080359k2385836k6901424p299542K1081328K6331008J3236463M681230J593351
1395.1F85416937J68681n33104l31283J88530M05669L93808L92139O45638R09984P28547
1415.5F88385546L61324Q01980J665354J861274J710057J577914J664579J819491J514852
$$ y = [748322904, 747685730, 747204006, 746813238, 745888412, 744287491, 742572486, 741141558, 739676476, 737705708, 735463440, 733511090, 731887758, 730167091, 728251457, 726675570, 725788057, 725055933, 723929703, 722634017, 721661031, 720976889, 720136523, 719086647, 718269050, 718074203, 718145967, 717881143, 717361391, 716993570, 716655612, 715929270, 714885294, 713987112, 713262618, 712026358, 709968686, 707823992, 705933869, 703610837, 700484157, 696406841, 691501975, 685772657, 675080359, 652694523, 625793099, 618493557, 639574885, 665905893, 679142356, 683823586, 685416937, 685585618, 685052514, 684721231, 684909761, 685315430, 685709238, 686101377, 686747015, 687656999, 688385546, 688746870, 689548850, 691214204, 693075478, 694785535, 696363449, 698028028, 699847519, 701362371]
1433.9G01362371J110495J412034J743733J463295R28103N94676P70748J121044R63628
1452.2G11470127N59926O58035K020538K660811K048135J872718K610803L160477L327131
1470.6G30388701M169583N014003M833757M058898L106832K451420J872063J033962
1486.9G56929219N9306l54945l46303j001179k168954k517104k121091j947641l004968
1505.2G43526340m457951k565682j222372j429081j797616j741767j285851j089633
1521.6G27936387p94470r28700j346350j137078j248955j668752j273930j351893k299785
1539.9G15886474j561225l21209q6308J192J28031L20733K72274m0591l84927O90103
1560.3G14904547J288831N33760L4987k74598n29885n69284j295030k275646j911998
$$ y = [701362371, 702472866, 703884900, 705628633, 707091928, 708020031, 708614707, 709385455, 710506499, 711470127, 712030053, 712688088, 714708626, 717369437, 719417572, 721290290, 723901093, 727061570, 730388701, 734558284, 739572287, 744406044, 748464942, 751571774, 754023194, 755895257, 756929219, 756988525, 756633580, 756287277, 755286098, 753117144, 750600040, 748478949, 746531308, 743526340, 739068389, 736502707, 735280335, 733851254, 732053638, 730311871, 729026020, 727936387, 727141917, 726213217, 724866867, 723729789, 722480834, 720812082, 719538152, 718186259, 715886474, 714325249, 714004040, 713917732, 713918924, 714046955, 714367688, 714639962, 714599371, 714214444, 714904547, 716193378, 716727138, 716762125, 716487527, 715957642, 715388358, 714093328, 711817682, 709905684]
1578.7G09905684j890779k680420l112376l277421l560245l894448l934920l627360
1595F83927715l229857l149748l290772l169119k855301k888322l214419l104687k732217
1613.4F56293273l237247l970624k895712k423823k991736k923906k862513k707362
1629.7F32280350j945198j888990k534986j490891j31786K49744J67310j03354N53727
1648F25155926J260757R55045J505793K558767K598226K681673L027081L393174L283858
1666.4F46420300L494561M296779M219175M156410M710436M616976M077733L926754
1682.7F79919124N212605N745887N112887M994929M463017M509329N125821N017400
1699G20100999N295098M582882L811299L747523L086090K237976J663387J205802R84192
$$ y = [709905684, 708014905, 705334485, 702222109, 698944688, 695384443, 691489995, 687555075, 683927715, 680697858, 677548110, 674257338, 671088219, 668232918, 665344596, 662130177, 659025490, 656293273, 653056026, 649085402, 646189690, 643765867, 640774131, 637850225, 634987712, 632280350, 630335152, 628446162, 625911176, 624420285, 624288499, 624538243, 624705553, 624602199, 625155926, 626416683, 627371728, 628877521, 631436288, 634034514, 636716187, 639743268, 643136442, 646420300, 649914861, 654211640, 658430815, 662587225, 667297661, 671914637, 675992370, 679919124, 685131729, 690877616, 695990503, 700985432, 705448449, 709957778, 715083599, 720100999, 725396097, 729978979, 733790278, 737537801, 740623891, 742861867, 744525254, 745731056, 746715248]
1717.4G46715248J232326J296818J075864R70542P41542N16414M81844P17163J430094
1735.7G55177855J484097J351475J843274K277315K227008K157330K665639L445328
1752G72629321L271699K778589K788246K869546K911926K701282K278745K169371K177894
1770.4G96576619K074540J991451J858234J740515J555324J194119R83835J193344
1786.7H09167981J238406O98447M32313R18448J195609R01699N31614O30081R58740
1805.1H16673338R84312N90562L01779N43654Q29339O91533M03583L14474M26113N66245
1825.5H22324932L64780O9797M58539Q86261O16133K32756K39373L31878K12908K33352
1845.9H25970709M00186N48959O32703M16934R5129Q4401L89933M79400J40250k18928
$$ y = [746715248, 747947574, 749244392, 750320256, 751290798, 752032340, 752548754, 753030598, 753747761, 755177855, 756661952, 758013427, 759856701, 762134016, 764361024, 766518354, 769183993, 772629321, 775901020, 778679609, 781467855, 784337401, 787249327, 789950609, 792229354, 794398725, 796576619, 798651159, 800642610, 802500844, 804241359, 805796683, 806990802, 807974637, 809167981, 810406387, 811104834, 811537147, 812455595, 813651204, 814552903, 815084517, 815714598, 816673338, 817657650, 818248212, 818549991, 819093645, 819922984, 820614517, 821018100, 821332574, 821758687, 822324932, 822689712, 822759509, 823218048, 824104309, 824720442, 824953198, 825192571, 825524449, 825737357, 825970709, 826370895, 826919854, 827552557, 827969491, 828064620, 828149021, 828538954, 829018354, 829158604, 828939676]
1866.3H28939676p4804M99487N89848K10404J12236L44336L64184J05262j7047J24932
1886.7H31198514K04384J69575J02341R3758K98798L59059R0718p0214J03295K42054
1907.1H32792282R9123k0981J04487K03132R1374r119k7180Q7559K78116J78217m6789
1929.5H33730221l2068J43767J76847k6643k17319j49190J02996J38402m7206l5644
1949.9H33784163J43170J32561o8128j59144j4902J15574m2260k66194r8586K30550
1970.3H33756804J86623r3580j82509j0908J15454O319j50800j13368J3351l7312j68801
1992.7H33321273j17719N2393J08719m4883k08914j23739N9604J1862k16365k63870
2013.1H32578361q2433R715j08719k19285j24454L0279l4094k44200k52784o1393n424
$$ y = [828939676, 828864872, 829364359, 829954207, 830164611, 830276847, 830621183, 830985367, 831090629, 831073582, 831198514, 831402898, 831572473, 831674814, 831768572, 832067370, 832426429, 832517147, 832446933, 832550228, 832792282, 832891405, 832870424, 832974911, 833178043, 833269417, 833260298, 833233118, 833320677, 833598793, 833777010, 833730221, 833698153, 833841920, 834018767, 833992124, 833774805, 833625615, 833728611, 833867013, 833819807, 833784163, 833927333, 834059894, 833991766, 833832622, 833817720, 833933294, 833891034, 833624840, 833526254, 833756804, 833943427, 833849847, 833667338, 833656430, 833771884, 833778203, 833627403, 833514035, 833527386, 833490074, 833321273, 833203554, 833255947, 833364666, 833319783, 833110869, 832987130, 833046734, 833058596, 832842231, 832578361, 832495928, 832505643, 832396924, 832177639, 832053185, 832083464, 832049370, 831805170, 831552386, 831490993, 831485569]
2035.6H31485569j58965k57969j09613Q3208P153k08736k01404m649N6744p5639j58012
2058H30457687n2750N5850m5419j86980j16169M9889N2929j12236j57714J4306J37209
2080.4H30096602J8597j68323j46807J7286K8670j25528j31190Q0943K00987M3094
2100.8H29914331j34110o1214R7334O3360j10686j31905N0664J38641r418j27435k0742
2123.3H29668820J29461P9632r2268q7202R1613J60098K1398j04308k5869J19031R7573
2145.7H30057979m0830o2048O8367J38759L9518m4584N4359J75178J11580j0013J5735
2168.1H30504000J25230J30713M1484J7643R4176J58667R7811j6152K1040J76847J80066
2190.6H31531525L1352o855Q7857J33396P6055o735J0550J14858J26123L5823j9908
$$ y = [831485569, 831326604, 831068635, 830959022, 831042230, 831049383, 830840647, 830639243, 830634594, 830691338, 830615699, 830457687, 830404937, 830460787, 830415368, 830228388, 830112219, 830162108, 830215037, 830102801, 829945087, 829959393, 830096602, 830115199, 829946876, 829800069, 829817355, 829846025, 829720497, 829589307, 829670250, 829871237, 829914331, 829780221, 829719007, 829816341, 829879701, 829769015, 829637110, 829687774, 829826415, 829816997, 829689562, 829668820, 829798281, 829877913, 829785645, 829698443, 829790056, 829950154, 829971552, 829867244, 829841375, 829960406, 830057979, 830017149, 829955101, 830023468, 830162227, 830201745, 830157161, 830211520, 830386698, 830498278, 830488265, 830504000, 830629230, 830759943, 830801427, 830819070, 830913246, 831071913, 831169724, 831153572, 831174612, 831351459, 831531525, 831562877, 831556022, 831643879, 831777275, 831853330, 831846595, 831857145, 831972003, 832098126, 832133949, 832114041]
2213H32114041J9669P2897L7670r239K2710J00255J15037K3543n4776j7882O0201O5267
2237.5H32549393J2934l576N5075J00732O1810Q34r775J2994L814j4960J2874O7175
2262H32849324Q4281J7643m8936J2219Q7679L755j24872j06811P15M0352J550l8564
2286.4H32778335J1742Q8632N2154J2696R3400J55151R5785L3259O5625J63913K22563
2308.9H33773255J81318J21414J33276K24412L08871K61128J30475J04606J41740J21474
2329.3H35501969N0127j4722o1929j00315q9943j10924l38734p48455o72817j1921
2349.7H33402336N95152P46906N15640K12192j28031l85820n31257p21633q38816p91312
2370.1H32075357p72059q29815q38399p62105p00593o52552n20229l49641k48671k43067
$$ y = [832114041, 832133710, 832206607, 832244277, 832235038, 832257748, 832358003, 832473040, 832496583, 832441807, 832423925, 832484126, 832549393, 832562327, 832558751, 832613826, 832714558, 832776368, 832777202, 832767427, 832780421, 832784235, 832769275, 832782149, 832849324, 832933605, 832951248, 832902312, 832914531, 833002210, 833005965, 832881093, 832774282, 832774997, 832815349, 832816899, 832778335, 832790077, 832878709, 832930863, 832943559, 833036959, 833192110, 833287895, 833321154, 833386779, 833550692, 833773255, 833954573, 834075987, 834209263, 834433675, 834742546, 835003674, 835134149, 835238755, 835380495, 835501969, 835552096, 835537374, 835475445, 835375130, 835285187, 835174263, 834835529, 834087074, 833414257, 833402336, 833997488, 834744394, 835260034, 835472226, 835344195, 834958375, 834427118, 833705485, 832866669, 832075357, 831303298, 830473483, 829635084, 828872979, 828172386, 827519834, 826999605, 826649964, 826401293, 826158226]
2390.4H26158226k68341k64883k22861j65344j62422k12670k21252j78039j75715k29537
2410.8H24057162k60413k39074k44022l15785m29749n69225n64515k60771R8586J75715
2431.2H21447909L0458r1732j55627k01643j90318j46210j44481j90974k46882k90632
2451.6H19819868k99395k75790k60949k35796j94729j92642k49922l05414l06845k98739
2472H17199647k85744k63095k67923k68161k42234k58386l37958l62456k81453k29359
2492.4H14402878k75492l07262k71738k53737k75373l00885l06546k64704k20120k36035
2512.8H11690986k77459k64347k38359k73645l08037k95698k84076k91824k87891k72453
2533.2H08897197k74122k81035k93076l13223l16322l06010k93255k75314k60591k54154
$$ y = [826158226, 825889885, 825625002, 825402141, 825236797, 825074375, 824861705, 824640453, 824462414, 824286699, 824057162, 823796749, 823557675, 823313653, 822997868, 822568119, 821998894, 821434379, 821173608, 821272194, 821447909, 821478367, 821386635, 821231008, 821029365, 820839047, 820692837, 820548356, 820357382, 820110500, 819819868, 819520473, 819244683, 818983734, 818747938, 818553209, 818360567, 818110645, 817805231, 817498386, 817199647, 816913903, 816650808, 816382885, 816114724, 815872490, 815614104, 815276146, 814913690, 814632237, 814402878, 814127386, 813820124, 813548386, 813294649, 813019276, 812718391, 812411845, 812147141, 811927021, 811690986, 811413527, 811149180, 810910821, 810637176, 810329139, 810033441, 809749365, 809457541, 809169650, 808897197, 808623075, 808342040, 808048964, 807735741, 807419419, 807113409, 806820154, 806544840, 806284249, 806030095]
2553.6H06030095k51890k80797l51548l66330l03388k75672k97009l09229k99693k73048
2574H03021491k81394l50237l93033l63767l12984k99394l13819k90274k75314l28958
2594.4G99812317l91960l97384l65675l60310l53158l42190l46601l39746l52025l90292
2614.8G96172976m06682m03523m03703l75688l46303l70383m06802m41432m96685m92990
2635.2G92028785l99590l56674m00543m46975m49777m16458m36961n11229n15998m34041
2655.6G87660539l74913l87788m30584m40061m04477m33385n16415m92990m06861l98934
2676G83374131m52638m88281m77731m43876m32611m60803m71652m43816m52161m84049
2696.4G78766513m69387m37259m53234n14686n36680m92394m50254m61697n01991m95434
$$ y = [806030095, 805778205, 805497408, 805145860, 804779530, 804476142, 804200470, 803903461, 803594232, 803294539, 803021491, 802740097, 802389860, 801996827, 801633060, 801320076, 801020682, 800706863, 800416589, 800141275, 799812317, 799420357, 799022973, 798657298, 798296988, 797943830, 797601640, 797255039, 796915293, 796563268, 796172976, 795766294, 795362771, 794959068, 794583380, 794237077, 793866694, 793459892, 793018460, 792521775, 792028785, 791629195, 791272521, 790871978, 790425003, 789975226, 789558768, 789121807, 788610578, 788094580, 787660539, 787285626, 786897838, 786467254, 786027193, 785622716, 785189331, 784672916, 784179926, 783773065, 783374131, 782921493, 782433212, 781955481, 781511605, 781078994, 780618191, 780146539, 779702723, 779250562, 778766513, 778297126, 777859867, 777406633, 776891947, 776355267, 775862873, 775412619, 774950922, 774448931, 773953497]
2716.8G73953497m50015m54604n11527n32389n19812n18263n07950m91679m30763l51488
2737.2G69185007l74794m69149n12599m36664l23177l55005m84288n19573m68314m64737
2757.6G64776707n28395n41509m46260l62157l92616m69625m81129m63307n25176o12975
2778G59953558o11186n72741n76019n69522n37217n50806o05166o39439o39141o43611
2798.4G54008710o85691p47204p88749p62879p04945p44640q65817r03130q52704q41618
2818.8G46111333q96453r76682j034677j042068j074612j182914j288593j345813j416922
2837.1G35852599j673817k107919k475798k762973l014326k968133k359807j404107
2853.4G17085719o36041k65122j88350l32773o00517q93116j183986j288295j054347
$$ y = [773953497, 773503482, 773048878, 772537351, 772004962, 771485150, 770966887, 770458937, 769967258, 769536495, 769185007, 768810213, 768341064, 767828465, 767391801, 767068624, 766713619, 766229331, 765709758, 765241444, 764776707, 764248312, 763706803, 763260543, 762898386, 762505770, 762036145, 761555016, 761091709, 760566533, 759953558, 759342372, 758769631, 758193612, 757624090, 757086873, 756536067, 755930901, 755291462, 754652321, 754008710, 753323019, 752575815, 751787066, 751024187, 750319242, 749574602, 748708785, 747805655, 746952951, 746111333, 745214880, 744238198, 743203521, 742161453, 741086841, 739903927, 738615334, 737269521, 735852599, 734178782, 732070863, 729595065, 726832092, 723817766, 720849633, 718489826, 717085719, 716449678, 716184556, 715996206, 715663433, 715062916, 714169800, 712985814, 711697519, 710643172]
2871.8G10643172p98404p66993p17043n48900m50313n25236p19130q50677q85845r41455
2892.2G03439176j007855j090109j195967j238764j252174j335919j490414j671195
2908.5F93156779j861692k141535k504110k678514k487361k074421j551211r43660
2924.8F76914275l52204J13606L40522M84049Q11458J153767J313746J437544J537204
2943.2F83753967J391113R64642N14388K63870O9379j01804j550K86639N82695Q60810
2963.6F88584149J096606J326025J527309J653969J686037J583934J468599J395404
2979.9G00322032J199245R54569Q37624Q03053P89941O58095L48031J07825n3585k62797
3000.3G05704033l94821m33028m25457l46184k75195l55363n75483p49349p70986p40052
$$ y = [710643172, 709844768, 709077775, 708360732, 707811832, 707361519, 706836283, 706117153, 705266476, 704380631, 703439176, 702431321, 701341212, 700145245, 698906481, 697654307, 696318388, 694827974, 693156779, 691295087, 689153552, 686649442, 683970928, 681483567, 679409146, 677857935, 676914275, 676562071, 676675677, 677016199, 677500248, 678311706, 679465473, 680779219, 682216763, 683753967, 685145080, 686109722, 686624110, 686887980, 686957359, 686855555, 686854005, 687140644, 687723339, 688584149, 689680755, 691006780, 692534089, 694188058, 695874095, 697458029, 698926628, 700322032, 701521277, 702475846, 703313470, 704116523, 704906464, 705564559, 705912590, 706020415, 705966830, 705704033, 705309212, 704876184, 704450727, 704104543, 703829348, 703473985, 702898502, 702149153, 701378167, 700638115]
3020.7G00638115p53104q06690q67307q35836p39753p03216q13841r82166r30428p80106
3041.1F92425668q00967r35674j059413j053929r75907r78470j002073j016736j032889
3059.4F83569610r50873q03292p21752q14975j001656j005470q32916o67154o11902
3077.8F76159620p33316q73148q97825r23037r15707q64505r51112j075267j009942
3096.1F67915761q57293q65579r93311j009822r06050q80361j003504j014590q39889
3114.5F59545362q03232r67443j205564j399874j372755j197875j088917j127243j191318
3132.8F49191141j127124j025617j077711j293481j402855j338005j291513j215816
3149.2F39419019j132965j235664j442909j527250j482785j411378j371503j390576
$$ y = [700638115, 699885011, 699078321, 698211014, 697375178, 696635425, 695932209, 695118368, 694136202, 693205774, 692425668, 691624701, 690689027, 689629614, 688575685, 687599778, 686621308, 685619235, 684602499, 683569610, 682618737, 681815445, 681093693, 680278718, 679277062, 678271592, 677438676, 676771522, 676159620, 675426304, 674553156, 673655331, 672732294, 671816587, 670952082, 670000970, 668925703, 667915761, 667058468, 666192889, 665199578, 664189756, 663283706, 662403345, 661399841, 660385251, 659545362, 658742130, 657774687, 656569123, 655169249, 653796494, 652598619, 651509702, 650382459, 649191141, 648064017, 647038400, 645960689, 644667208, 643264353, 641926348, 640634835, 639419019, 638286054, 637050390, 635607481, 634080231, 632597446, 631186068, 629814565, 628423989]
3165.5F28423989j429260j442492j426578j411616j416028j406371j374782j403391
3181.8F17113471j455605j435459j394629j353920j339972j407921j448989j399517
3198.1F05877459j358569j334667j294792j285195j309335j317442j298725j280904
3214.4E95397830j275241j292885j314282j278103j209616j194716j210034j145720
3230.7E85477233j074612j200497j374066j358867j273632j197696j079738j074135
3247.1E75843990j263201j354099j242518j176596j222312j255870j219928j139403
3263.4E65970063j073718j022160r62913j012623j156330j231134j216889j135826
3279.7E57158470j054704j030624j003027r12011q03113q23676r50217j011491j034737
$$ y = [628423989, 626994729, 625552237, 624125659, 622714043, 621298015, 619891644, 618516862, 617113471, 615657866, 614222407, 612827778, 611473858, 610133886, 608725965, 607276976, 605877459, 604518890, 603184223, 601889431, 600604236, 599294901, 597977459, 596678734, 595397830, 594122589, 592829704, 591515422, 590237319, 589027703, 587832987, 586622953, 585477233, 584402621, 583202124, 581828058, 580469191, 579195559, 577997863, 576918125, 575843990, 574580789, 573226690, 571984172, 570807576, 569585264, 568329394, 567109466, 565970063, 564896345, 563874185, 562911272, 561898649, 560742319, 559511185, 558294296, 557158470, 556103766, 555073142, 554070115, 553158104, 552354991, 551531315, 550581098, 549569607, 548534870]
3298E48534870j016795q82864p64430q42273j071334j254440j306593j224995j111567
3316.4E39059579j100421j165568j218379j220882j277685j396656j415372j359403
3332.7E28905213j286149j168668j184404j388908j510143j476049j340747j168371
3349E18381774j259863j543105j565337j357674j246453j288950j288235j106024r53436
3367.4E06772697j131535j479446j493633j218915j094044j097559j127005j155317
3383.7D96975243j062810q18462n59926o22510r58324j008779o66618m80890p90239
3402.1D90006685j110136r33230o05971m77254m71026n64992o17206n01723m01109
3420.4D84324038l46392j86831J4275J24276Q0466P8589K26050J43171k05428k75701
$$ y = [548534870, 547518075, 546635211, 545870781, 545028508, 543957174, 542702734, 541396141, 540171146, 539059579, 537959158, 536793590, 535575211, 534354329, 533076644, 531679988, 530264616, 528905213, 527619064, 526450396, 525265992, 523877084, 522366941, 520890892, 519550145, 518381774, 517121911, 515578806, 514013469, 512655795, 511409342, 510120392, 508832157, 507726133, 506772697, 505641162, 504161716, 502668083, 501449168, 500355124, 499257565, 498130560, 496975243, 495912433, 495093971, 494534045, 493911535, 492953211, 491944432, 491277814, 490796924, 490006685, 488896549, 487963319, 487357348, 486880094, 486409068, 485844076, 485226870, 484725147, 484324038, 483977646, 483790815, 483805090, 483929366, 484009832, 484088421, 484314471, 484457642, 484252214, 483976513]
3440.8D83976513M3661L65346M90815M73588M81636N62280N92291O15895P49827Q04215
3461.2D89156067Q22127J043767J182258R34392O13630O19561Q50230J121163J196892
3479.6D97540087J000583R58562J143485J160085J097739J188159J276433J337409
3495.9E06702542J357079J335323J341998J256228J147926J243889J482725J666129
3512.2E17533839J552343J285374J312554J564801J764774J667440J431942J485467
3528.5E29598534J684368J819312J963854J954019J792729J867712K059042K047062
3544.8E44786632J844406J716316J838207K069295K169251K192617K289354K269030
3561.1E61175108J952112J747191K320528K947211K761602K469898K463579K572000
$$ y = [483976513, 484020174, 484385520, 484876335, 485349923, 485831559, 486393839, 486986130, 487602025, 488351852, 489156067, 489978194, 491021961, 492204219, 493138611, 493752241, 494371802, 495222032, 496343195, 497540087, 498540670, 499499232, 500642717, 501802802, 502900541, 504088700, 505365133, 506702542, 508059621, 509394944, 510736942, 511993170, 513141096, 514384985, 515867710, 517533839, 519086182, 520371556, 521684110, 523248911, 525013685, 526681125, 528113067, 529598534, 531282902, 533102214, 535066068, 537020087, 538812816, 540680528, 542739570, 544786632, 546631038, 548347354, 550185561, 552254856, 554424107, 556616724, 558906078, 561175108, 563127220, 564874411, 567194939, 570142150, 572903752, 575373650, 577837229, 580409229]
3577.5E80409229K752006K882898K687990K351880K462805K892673K861023K719044
3593.8F02019548K913833L113449L049254K954185K816379K558828K608299K875745
3610.1F24909520K992690L076136K936125K964317L452838L347874K638578K075851
3626.4F48393929K558112L563523L306687K923847K799809K643764K581775K472460
3642.7F71243906K109170J890123K627015L374398K701044K201676K657235K758622
3659F91563189K156496J703918J473010J150965J185179J677871J498461J445114J901806
3677.4G05756009J803219J581669J351416J008391R34720J114726J164079J095474
3693.7G15809703R37819P13289N46634O64175Q53896O01828J26183j8477N21064J020908
$$ y = [580409229, 583161235, 586044133, 588732123, 591084003, 593546808, 596439481, 599300504, 602019548, 604933381, 608046830, 611096084, 614050269, 616866648, 619425476, 622033775, 624909520, 627902210, 630978346, 633914471, 636878788, 640331626, 643679500, 646318078, 648393929, 650952041, 654515564, 657822251, 660746098, 663545907, 666189671, 668771446, 671243906, 673353076, 675243199, 677870214, 681244612, 683945656, 686147332, 688804567, 691563189, 693719685, 695423603, 696896613, 698047578, 699232757, 700910628, 702409089, 703854203, 705756009, 707559228, 709140897, 710492313, 711500704, 712435424, 713550150, 714714229, 715809703, 716747522, 717460811, 718007445, 718671620, 719525516, 720127344, 720253527, 720235050, 720756114, 721777022]
3714.1G21777022Q46565M66227J82152J41919L63826N60522M04358k5510k51174J04308
3734.5G24570215P39693P29025L0339n04971j04845M20630P2360J14739P72834P49648
3754.9G27589667L10719K51472M50611L20256O5744j5796J13070L79980M07875J87099
3775.3G30060697N6684J21057J61528Q9288R4891J57058J54376O3717j19209k02298
3795.7G30637789j98841k41399P5221K93791P0274K37405M00603K2292l66985k54274
3816.1G30675876o4611j19388J65820L48687K09749N2213r8645r5547n0842j91689
3836.5G30831623k19345Q5771L41117L86477J31249m06503r14216o62864N65589P70986
3856.9G30909884J99556j87277k43307j04189k01106k25424J03175K35439J89006k3007
$$ y = [721777022, 722623587, 723089814, 723271966, 723413885, 723777711, 724338233, 724742591, 724717081, 724465907, 724570215, 725309908, 726038933, 726069272, 725564301, 725459456, 725880086, 725952446, 726067185, 726840019, 727589667, 727900386, 728151858, 728602469, 728922725, 728988469, 728972673, 729085743, 729465723, 729873598, 730060697, 730117381, 730238438, 730399966, 730489254, 730584145, 730741203, 730895579, 730959296, 730840087, 730637789, 730438948, 730197549, 730272770, 730566561, 730636835, 730874240, 731274843, 731297135, 730930150, 730675876, 730611265, 730491877, 730657697, 731006384, 731216133, 731268346, 731169701, 731074154, 731023312, 730831623, 730612278, 730698049, 731039166, 731425643, 731556892, 731150389, 730236173, 729573309, 730138898, 730909884, 731109440, 730922163, 730678856, 730574667, 730373561, 730148137, 730251312, 730486751, 730675757, 730652750]
3877.3G30652750k41876o9201J16169J42813K3246j69695k6166J26302j53959m62651
3897.7G29937732m64499j96159K25664M77790K70903j7166j36196k31803k54690j05858
3918.1G29505718j4603q8036r9361l5167r3579j48654J5974J16467n5849j95623j91450
3940.5G28715837r2030k4437r2447j25110p6712j2755j4186j13308j62125j09315n7399
3962.9G27836013m8816q7083j13308n4896k5809l8981l9280r3996j17183o4671q5950
3985.4G27066040j52588j32024r3103q1241l6657q94
3997.6G26569533
$$ y = [730652750, 730410874, 730341673, 730457842, 730600655, 730623901, 730454206, 730428040, 730554342, 730400383, 729937732, 729473233, 729277074, 729502738, 729980528, 730251431, 730234265, 730098069, 729866266, 729611576, 729505718, 729491115, 729403079, 729303718, 729268551, 729174972, 729026318, 729042292, 729158759, 729102910, 728907287, 728715837, 728623807, 728599370, 728506923, 728381813, 728305101, 728292346, 728278160, 728164852, 728002727, 727893412, 727836013, 727787197, 727700114, 727586806, 727531910, 727506101, 727467120, 727427840, 727333844, 727216661, 727151990, 727066040, 726913452, 726781428, 726688325, 726607084, 726570427, 726569533]
##END=$$ End of the data block
