##TITLE=$$ Begin of the data block
##JCAMP-DX=5.00 $$ ACD/SpecManager v 10.08
##SPECTROMETER/DATA SYSTEM=Alpha
##DATE=11 Nov 2014 09:02:30
##DATA TYPE=INFRARED SPECTRUM
##DATA CLASS=XYDATA
##ORIGIN=
##OWNER=
##NPOINTS=1765
##FIRSTX=399.76428223
##LASTX=3997.64306641
##MAXX=3997.64306641
##MINX=399.76428223
##MAXY=0.84218895
##MINY=0.47815371
##XFACTOR=1.0000000000
##YFACTOR=1.000000000000000e-9
##FIRSTY=0.74466431
##DELTAX=2.03961372
##XUNITS=1/CM
##YUNITS=ARBITRARY UNITS
##XYDATA=(X++(Y..Y))
399.8G44664311J251281j568079k292037o56486J94371j431644k572715j204253K04266
418.1G36589015o27995k159536j532316N71728N64456j516104j581311N49316R86219
436.5G31843472r58622j930237n23329P57099k59877j324176k83480R60529j64211
454.8G28117168k364814j718045J011551J007378j478374k338648l32534R63926m53114
473.2G22414494j639009l27527J206755J55687j924276j411974R29653J151145j004398
491.5G19550550j752973l4749Q40604o53684j965046p91132O43551k43783j906157
509.9G13687181j721680k20239P2003j311601j958191n01931O94156m08709j875043
528.3G06455946j283646K40565K84195r31561q59380Q59797J752972O00756n96285
$$ y = [744664311, 745915592, 744347513, 742055476, 741398990, 741593361, 740161717, 737589002, 736384749, 736589015, 735961020, 733801484, 732269168, 732840896, 733405352, 731889248, 730307937, 730857253, 731843472, 730884850, 728954613, 728431284, 729188383, 728928506, 727604330, 727320850, 728281379, 728117168, 725752354, 724034309, 725045860, 726053238, 724574864, 722236216, 721903682, 722867608, 722414494, 720775485, 720447958, 721654713, 721810400, 719886124, 718474150, 719403803, 720554948, 719550550, 717797577, 717762828, 718603432, 717949748, 715984702, 715193570, 715837121, 715593338, 713687181, 711965501, 711745262, 711817265, 710505664, 708547473, 708045542, 708739698, 708330989, 706455946, 705172300, 705412865, 705697060, 704765499, 703906119, 704765916, 706518888, 707119644, 706523359]
546.6G06523359O2287J111746L69250j144230j056790L47435P66814k88725q03650
565G05887496J49608R37104J62483r53019n46813P17938P64727m03404p69496L13759
585.4G06260383J088679K50578r15468m44710Q05139N57006p25746p55489M65870P53820
605.8G07340062m58122j296103o29484K38657j72019r04441M7207J940369K305568
624.1G08411694J038491M63367J366973J857996O95049m49895K96533J719832J572132
642.5G16972172K74003J12712J456917K069592Q46207k92361L15607J376033P59125
660.8G23890007o19054l00825J616478K320886L79562K3007J343191K370000J586080
679.2G32609332K15709M42982J656711J523673M6790m76897O15895J283526K94745
$$ y = [706523359, 706585646, 707697392, 708066642, 706922412, 705865622, 706213057, 706979871, 706691146, 705887496, 706037104, 706974208, 707136691, 706183672, 705636859, 706354797, 707119524, 706716120, 705946624, 706260383, 707349062, 707599640, 706684172, 706239462, 707044601, 707601607, 706875861, 706120372, 706586242, 707340062, 706881940, 705585837, 704956353, 705195010, 705022991, 704118550, 704165757, 706106126, 708411694, 709450185, 709913552, 711280525, 713138521, 713833570, 713383675, 713680208, 715400040, 716972172, 717246175, 717358887, 718815804, 720885396, 721731603, 721439242, 721754849, 723130882, 723890007, 723270953, 722970128, 724586606, 726907492, 727287054, 727310061, 728653252, 731023252, 732609332, 732825041, 733268023, 734924734, 736448407, 736495197, 736018300, 736634195, 737917721, 738212466]
697.5G38212466o06835K18511J578748J537264M59969L51190J568198K167404J212537
715.9G46699452M43101J208485K258718J958549J023471J100600K010107K028823Q19146
734.3G59550452J06454Q27074J560867R11474o0260K00093J126229J077891l8266n45919
754.7G64716089K63333R69350M39704k95580K47777J463890J541019N18441K11179
773G70075202J144052J783132J203120N56767J060128J994669J834631P80404N07116
791.4G80939221J381457J851380J020312J42634N79477J416087J013040j07765k13563
809.7G88022280P71820J249552M67479l76343j59026J54376n55157j165867l15726
828.1G88093388J209378J693905R40680O01411J744092K946615K328098O88016K41518
$$ y = [738212466, 737605631, 737824142, 739402890, 740940154, 741400123, 741751313, 743319511, 745486915, 746699452, 747142553, 748351038, 750609756, 752568305, 753591776, 754692376, 756702483, 758731306, 759550452, 759656906, 760483980, 762044847, 762956321, 762896061, 763096154, 764222383, 765300274, 765262008, 764716089, 764979422, 765948772, 766388476, 766092896, 766340673, 767804563, 769345582, 769864023, 770075202, 771219254, 773002386, 774205506, 774762273, 775822401, 777817070, 779651701, 780432105, 780939221, 782320678, 784172058, 785192370, 785335004, 785914481, 787330568, 788343608, 788235843, 788022280, 788794100, 790043652, 790511131, 790134788, 789975762, 790130138, 789574981, 788409114, 788093388, 789302766, 790996671, 791937351, 792538762, 794282854, 797229469, 799557567, 800245583, 800487101]
846.4H00487101R16302Q25763k59757o16550N07056J521290Q89957l20733k12848P28965
866.8H04466546N42521q26418j403690n40375P74r73761k113938j806796q49485j022160
887.2G95473218k031803j983583n40733M33564p2062n58317K55823J179874O05822
905.6G92761803p87020j142800m40001l41952j344264j974523j159429n4300k62618
923.9G85254896j167238j080453k22981l80993j800180k737999k390384k102197l063023
942.3G70309448m226565m054546l008664k598465k993822k874911j757085r84371j517534
960.7G46293485k318084k110660j495004j893282l173768l894091l712475l859937
977G23836184m941166n847990n514086m603028m366875m594624m144311l036558k542317
$$ y = [800487101, 801403403, 802229166, 801969409, 801352859, 801859915, 803381205, 804271162, 803950429, 803737581, 804466546, 805009067, 804182649, 802778959, 802238584, 802239358, 801265597, 799151659, 797344863, 796495378, 795473218, 793441415, 791457832, 790917099, 791350663, 791278601, 790720284, 790976107, 792155981, 792761803, 791974783, 790831983, 790391982, 790050030, 788705766, 786731243, 785571814, 785517514, 785254896, 784087658, 783007205, 782784224, 782403231, 780603051, 777865052, 775474668, 773372471, 770309448, 766082883, 762028337, 759019673, 756421208, 753427386, 750552475, 748795390, 747811019, 746293485, 743975401, 741864741, 740369737, 738476455, 735302687, 731408596, 727696121, 723836184, 718895018, 713047028, 707532942, 702929914, 698563039, 693968415, 689824104, 686787546, 684245229]
995.3F84245229l207684l959894l810585l371834l651798m269838m095078l171444
1011.6F54707074k590775k708316k639234j747966p35045n27977p47443l64840M96328
1030F43141806P93100L82423K16961O39379Q26597J30057q11219q27670l2186L22699
1050.4F44781947p7367k44617K89976P44105M46200l8743N0485L39449P331p54714
1070.8F45544052q67784J8180J026809J406371J526237J998067K428412K003193R31025
1089.2F56014562K37941K73228K83659k43843o65963k74002N51760R43303Q97348J206696
1109.6F59224689K041698K632081K491415K115607K191186K458572K175093J537621
1125.9F76867962J505434K259791K624750J859367Q93772O40035O40034J74821l76225
$$ y = [684245229, 681037545, 677077651, 673267066, 669895232, 666243434, 661973596, 657878518, 654707074, 652116299, 649407983, 646768749, 645020783, 644285738, 643757761, 643010318, 642645478, 643141806, 643934906, 644317329, 644534290, 645173669, 646000266, 646130323, 645319104, 644491434, 644459248, 644781947, 644704580, 644459963, 644749939, 645494044, 645940244, 645901501, 645951986, 646291435, 646298766, 645544052, 644676268, 644694448, 645721257, 647127628, 648653865, 650651932, 653080344, 655083537, 656014562, 656252503, 656525731, 656809390, 656565547, 655899584, 655625582, 656177342, 657120645, 658017993, 659224689, 661266387, 663898468, 666389883, 668505490, 670696676, 673155248, 675330341, 676867962, 678373396, 680633187, 683257937, 685117304, 686011076, 686651111, 687291145, 687465966, 687089741]
1144.2F87089741j32203Q22127J446962J338482J365125K151072L044129L343344L489136
1162.6G03957915M286409N532503O181717N942404N718052O024361O160617N450189
1178.9G49254167M384577L893614L810466L179430J901329Q93891N73039K16722o96659
1197.3G67410576j490414j381039p69973o00040r83656j116335p01487n81682j274347
1215.6G58511603j998305j956165j555980j636326k108097k107620j503289j088917
1231.9G44556904j221538j277446p56622j34647n0843k85148j40429L85225N77867
1250.3G41653323J86563j06395J79828N97119N55038K53082L78430R05335J083791
1268.6G45686114O92963M35651P09057R45449N53190n4002r4711K87234K99156k53975
$$ y = [687089741, 686957538, 687779665, 689226627, 690565109, 691930234, 694081306, 697125435, 700468779, 703957915, 708244324, 713776827, 719958544, 725900948, 731619000, 737643361, 743803978, 749254167, 753638744, 757532358, 761342824, 764522254, 766423583, 767317474, 767890513, 768107235, 767410576, 765920162, 764539123, 763769150, 763169110, 762185454, 761069119, 760367632, 759785950, 758511603, 756513298, 754557133, 753001153, 751364827, 749256730, 747149110, 745645821, 744556904, 743335366, 742057920, 741301298, 741166651, 741115808, 740830660, 740690231, 741075456, 741653323, 741839886, 741733491, 741913319, 742510438, 743065476, 743318558, 743696988, 744602323, 745686114, 746379077, 746814728, 747523785, 748469234, 749022424, 748968422, 748873711, 749160945, 749460101, 749206126]
1289G49206126o48320n02288m36247r99212j664221j736939j443565j505077k013743
1307.4G38256514k253473j936555j605034j715242j900554j535177q63552p38085j147687
1325.8G24561155j339853j028120p10547q15571j022994q34346k18213R0957k33233
1344.1G18449235n19037l60191k70248o27279r63092q38816o57558j138747j953900
1362.5G11120367k078533j806498k121448k835274l752828m507422n186796r625137
1378.8F79206431k0132661k4227798o720364J8743813K3531735J1812985M124284J347005
1395.1F87685430N2095n94914l57986J65165L49521L12865L16679N89908Q73744P06792
1415.5F90099299L43919P79092J654446J857937J690387J553119J654982J815438J513303
$$ y = [749206126, 748557806, 748055518, 747619271, 746620059, 744955838, 743218899, 741775334, 740270257, 738256514, 736003041, 734066486, 732461452, 730746210, 728845656, 727310479, 726446927, 725708842, 724561155, 723221302, 722193182, 721482635, 720667064, 719644070, 718809724, 718591511, 718682468, 718449235, 717930198, 717570007, 717299759, 716672480, 715709388, 714870572, 714213014, 713074267, 711120367, 709041834, 707235336, 705113888, 702278614, 698525786, 694018364, 688831568, 679206431, 659073770, 634845972, 628125608, 646869421, 670401156, 682214141, 686338425, 687685430, 687737525, 687142611, 686784625, 686949790, 687299311, 687612176, 687928855, 688518763, 689392507, 690099299, 690443218, 691222310, 692876756, 694734693, 696425080, 697978199, 699633181, 701448619, 702961922]
1433.9G02961922J108348J377940J706183J457691R46403O40869Q08358J108408R49145
1452.2G13065267N72502O66499J989544K649307K090573J926363K622485L154457L348767
1470.6G32085764M200936N013406M815519M037261L084123K413571J826346J022458
1486.9G58499384L9518m12524l71814j009404k210439k573788k141893j941919k983153
1505.2G44893968m409552k549588j252175j446008j753688j655161j227022j088977
1521.6G29511797p85648q49963j243233j068414j201033j611531j196563j251936k212107
1539.9G18091369j517833k71141o4850j3471J22130L20018K53558p1407m53770N64873
1560.3G16959476J224101N14507L755l51905o23286o29008j358986k368629j995325
$$ y = [702961922, 704070270, 705448210, 707154393, 708612084, 709558487, 710199356, 711007714, 712116122, 713065267, 713637769, 714304268, 716293812, 718943119, 721033692, 722960055, 725582540, 728736997, 732085764, 736286700, 741300106, 746115625, 750152886, 753237009, 755650580, 757476926, 758499384, 758538902, 758126378, 757754564, 756745160, 754534721, 751960933, 749819040, 747877121, 744893968, 740484416, 737934828, 736682653, 735236645, 733482957, 731827796, 730600774, 729511797, 728726149, 727876186, 726632953, 725564539, 724363506, 722751975, 721555412, 720303476, 718091369, 716573536, 716302395, 716237545, 716224074, 716346204, 716666222, 716919780, 716848373, 716394603, 716959476, 718183577, 718698084, 718701839, 718349934, 717726648, 717097640, 715738654, 713370025, 711374700]
1578.7G11374700j980305k793491l226757l383815l670514m026532m088461l787398
1595F84417427l396273l334701l502429l383457l062427l123165l473639l348768k938032
1613.4F54854536l445625m217267l076911k542079l128290l054082k945304k739787
1629.7F29705191j914978j812697k428233j354814M3452M75764M20392J73807Q38577
1648F24146461J499773J261651J924992K812385K776325K886057L262222L596306L387510
1666.4F47553682L590227M470467M385054M269958M817009M750013M194439L997087
1682.7F82027936N296171N836546N190253N078078M538357M573941N169630N037785
1699G22748697N352616M713953L947615L827691L125608K289892J743137J286149J036704
$$ y = [711374700, 709394395, 706600904, 703374147, 699990332, 696319818, 692293286, 688204825, 684417427, 681021154, 677686453, 674184024, 670800567, 667738140, 664614975, 661141336, 657792568, 654854536, 651408911, 647191644, 644114733, 641572654, 638444364, 635390282, 632444978, 629705191, 627790213, 625977516, 623549283, 622194469, 622237921, 622713685, 623134077, 623307884, 624146461, 625646234, 626907885, 628832877, 631645262, 634421587, 637307644, 640569866, 644166172, 647553682, 651143909, 655614376, 659999430, 664269388, 669086397, 673836410, 678030849, 682027936, 687324107, 693160653, 698350906, 703428984, 707967341, 712541282, 717710912, 722748697, 728101313, 732815266, 736762881, 740590572, 743716180, 746006072, 747749209, 749035358, 750072062]
1717.4G50072062J266360J336217J148522J054108P83086N44548N29111P43866J394212
1735.7G58872092J439869J367271J916826K331138K241492K171933K691091L470480
1752G76502192L314555K831161K786278K825439K925098K769590K338648K226889K224922
1770.4H00744772K071798J968384J858413J758635J578569J226127J007796J192808
1786.7H13407302J254260P27475M43697R41634J233936R23872N27322O19531R62972
1805.1H21042001R93669N91100L10421N61773Q35896O93559M16220L26574M32074N87463
1825.5H26790750M05371Q9884M58539Q91268O02424K04921K31981L46184K45869K61009
1845.9H30528200L93152N32091O32643M15743Q7022J05143M28975N01394J61886j91092
$$ y = [750072062, 751338422, 752674639, 753823161, 754877269, 755660355, 756204903, 756734014, 757477880, 758872092, 760311961, 761679232, 763596058, 765927196, 768168688, 770340621, 773031712, 776502192, 779816747, 782647908, 785434186, 788259625, 791184723, 793954313, 796292961, 798519850, 800744772, 802816570, 804784954, 806643367, 808402002, 809980571, 811206698, 812214494, 813407302, 814661562, 815389037, 815832734, 816774368, 818008304, 818932176, 819459498, 820079029, 821042001, 822035670, 822626770, 822937191, 823498964, 824334860, 825028419, 825444639, 825771213, 826203287, 826790750, 827196121, 827286005, 827744544, 828635812, 829238236, 829443157, 829675138, 830021322, 830267191, 830528200, 830921352, 831453443, 832086086, 832501829, 832588851, 832693994, 833122969, 833624363, 833786249, 833595157]
1866.3H33595157o1691M91381N69641K04981J22487L50714L72350J10924k1875J19984
1886.7H35854053K09451J71006R6738J02997L24190L73959R2686o0261J09613K27928
1907.1H37502360Q5891j4723J18614K14338R5784k4735m9890Q4758K86639J73986o0439
1929.5H38412583j8597J77682J84595k2530j83285j24394Q9883J26839l6478k9743
1949.9H38576555J42217J44362p0273j85729l2126J19566k861j98185p4327J91867
1970.3H38611066J55151r9063j86145j8358J02281J371j37567q8394N5671o0j84178
1992.7H38211775j58191M1843J24454k7180j98722j15454N6267L994k00570k45214
2013.1H37493002q3685M411j07586j99914q6308N4837l1412k44617k53559n9664o0
$$ y = [833595157, 833533466, 834024847, 834594488, 834799469, 834921956, 835272670, 835645020, 835755944, 835734069, 835854053, 836063504, 836234510, 836331248, 836434245, 836758435, 837132394, 837225080, 837164819, 837274432, 837502360, 837588251, 837573528, 837692142, 837906480, 838002264, 837977529, 837927639, 838012397, 838299036, 838473022, 838412583, 838393986, 838571668, 838756263, 838733733, 838550448, 838426054, 838515937, 838642776, 838606298, 838576555, 838718772, 838863134, 838792861, 838607132, 838575006, 838694572, 838691711, 838493526, 838419199, 838611066, 838766217, 838667154, 838481009, 838462651, 838564932, 838566303, 838428736, 838340342, 838396013, 838395953, 838211775, 838053584, 838095427, 838219881, 838192701, 837993979, 837878525, 837934792, 837938786, 837738216, 837493002, 837409317, 837413728, 837306142, 837106228, 837019920, 837074757, 837043345, 836798728, 836545169, 836485505, 836485445]
2035.6H36485445j40249k17378p9155Q9764R060k01166j95920l159P0930p9752j89423
2058H35548997o0678R0003k086j77026j18672O7532R0599o5327j24872M0531J66297
2080.4H35455298J8955j94848j51694L9518M7624j05023r9063J00136J98781N9665
2100.8H35369349q8454l3378R4175P9751n7459r4890N7876J57714K5153r5964l755
2123.3H35410118J28508Q3565p0512p7903P5936J48773L3141n3108M8756J56582Q1956
2145.7H35965812n9247l5047J23441J67012N1797j0431O6399J45793R2983o616L7790
2168.1H36539686J82807J91689O4432L0578J15215J53840Q2016J0788O3122J74820
2188.5H37608993J79291P9274M6968J15514J44005Q6248J4186K6464J11103J16587
$$ y = [836485445, 836345196, 836127818, 836048663, 836138427, 836147487, 835946321, 835750401, 835747242, 835818172, 835738420, 835548997, 835488319, 835578322, 835576236, 835399210, 835280538, 835348070, 835438669, 835373342, 835248470, 835289001, 835455298, 835474253, 835279405, 835127711, 835167229, 835214853, 835109830, 835010767, 835110903, 835309684, 835369349, 835280895, 835247517, 835341692, 835421443, 835363984, 835269094, 835326970, 835484684, 835509837, 835413873, 835410118, 835538626, 835622191, 835551679, 835473776, 835549712, 835698485, 835731626, 835678518, 835727274, 835883856, 835965812, 835906565, 835871518, 835994959, 836161971, 836213768, 836203337, 836269736, 836415529, 836508512, 836501896, 836539686, 836722493, 836914182, 836978614, 837009192, 837124407, 837278247, 837360263, 837371051, 837434173, 837608993, 837788284, 837867558, 837914526, 838030040, 838174045, 838260293, 838274479, 838300943, 838412046, 838528633]
2208.9H38528633L6359L040M8995Q7321N6326O616J6689R6560J32799N2333k0385J1981
2233.4H39057267O1452N1320L3021N3227R4533Q8155J7047j9968J6809M8160K5392
2255.8H39526415L338M3869J10745J06335J2815o1631j4305O2763K4081n0545k9803
2278.3H39734077K6584J7405k0862TK6703P4864O2942M1545R3639J33693P9274J8656
2302.7H40267658M2379J45137K11239J53244Q0585J14203K08795K32220J40249J00613
2323.1H41696322J90496J96219Q5533J7583K801o2763j81198k15531j92106k94864
2343.5H41242492n40852m82321j6093M33564N95212N24997K98381j28865m31657n36144
2363.9H40958714o95288p59542o69539o42001p08938p28786o48916n91635n63026m78685
$$ y = [838528633, 838564992, 838568032, 838617027, 838704348, 838760674, 838767290, 838783979, 838880539, 839013338, 839065671, 839045286, 839057267, 839118719, 839170039, 839203060, 839256287, 839350820, 839438975, 839456022, 839436054, 839452863, 839501023, 839526415, 839529753, 839573622, 839684367, 839790702, 839803517, 839741886, 839727581, 839790344, 839814425, 839763880, 839734077, 839760661, 839778066, 839757204, 839736342, 839763045, 839837909, 839900851, 839942396, 840036035, 840169728, 840249002, 840267658, 840310037, 840455174, 840666413, 840819657, 840900242, 841014445, 841223240, 841455460, 841595709, 841696322, 841886818, 842083037, 842168570, 842186153, 842188954, 842126191, 841944993, 841729462, 841537356, 841242492, 840701640, 840219319, 840203226, 840636790, 841232002, 841756999, 842055380, 841926515, 841494858, 840958714, 840263426, 839503884, 838834345, 838192344, 837483406, 836754620, 836105704, 835514069, 834951043, 834472358]
2384.3H34472358l48985k28763j99675k47061k71202k48611j97470j66833j88470j80304
2404.7H32194984j17242j22011k20597k92420k75910k40028k71022l80397n14150n12600
2425.1H29248607k39074P6473J32143K2888p5876j55270k03193j93238j58012j52409
2445.5H28303039j85907k26438k69949k97547k72989k24650j85907j80542k15054k60174
2465.9H25983882k88963k86162k62380k60472k87891k82585k42055k24292k53201l21149
2486.3H23274732l48390k93314k53379k56777k51413k54035k76982k84732k76208k86460
2506.7H20493042k84731k45213k21670k41816k53737k50399k66731k80380k88070k83777
2527.1H17876518k67506k66790k67148k57016k67505l02196k96414k70485k70188k60055
$$ y = [834472358, 834123373, 833894610, 833694935, 833447874, 833176672, 832928061, 832730591, 832563758, 832375288, 832194984, 832077742, 831955731, 831735134, 831442714, 831166804, 830926776, 830655754, 830275357, 829761207, 829248607, 829009533, 829086006, 829218149, 829241037, 829165161, 829009891, 828806698, 828613460, 828455448, 828303039, 828117132, 827890694, 827620745, 827323198, 827050209, 826825559, 826639652, 826459110, 826244056, 825983882, 825694919, 825408757, 825146377, 824885905, 824598014, 824315429, 824073374, 823849082, 823595881, 823274732, 822926342, 822633028, 822379649, 822122872, 821871459, 821617424, 821340442, 821055710, 820779502, 820493042, 820208311, 819963098, 819741428, 819499612, 819245875, 818995476, 818728745, 818448365, 818160295, 817876518, 817609012, 817342222, 817075074, 816818058, 816550553, 816248357, 815951943, 815681458, 815411270, 815151215]
2547.5H15151215k63155k88486k85507k67028k82765l22640l17335k72393k76983l14534
2567.9H12260389l04222k74062k67446k91169l32534l50893l48866l31223k94625k79844
2588.3H09185505k71916k65420l14355l95775m30286l90172l40640l17037l11494l30269
2608.7H05818141l41416l55303m02570m22537l81589l42012l50773l78609l83138l70503
2629.1H02089691m01735n02050n42283m38511l28005l27289m18842m68194m15504m07756
2649.5G97839522m68492m76957m43577m21584m14133m37319m40061l88563m12881n06580
2669.9G93429375m98534m25100l92318l87787m07100m41373m61161m70638m83155m55320
2690.3G89006889l99590m16815m68612m55320m29511m51326m98295n36024n16534m63307
$$ y = [815151215, 814888060, 814599574, 814314067, 814047039, 813764274, 813441634, 813124299, 812851906, 812574923, 812260389, 811956167, 811682105, 811414659, 811123490, 810790956, 810440063, 810091197, 809759974, 809465349, 809185505, 808913589, 808648169, 808333814, 807938039, 807507753, 807117581, 806776941, 806459904, 806148410, 805818141, 805476725, 805121422, 804718852, 804296315, 803914726, 803572714, 803221941, 802843332, 802460194, 802089691, 801687956, 801185906, 800643623, 800205112, 799877107, 799549818, 799130976, 798662782, 798247278, 797839522, 797371030, 796894073, 796450496, 796028912, 795614779, 795177460, 794737399, 794348836, 793935955, 793429375, 792930841, 792505741, 792113423, 791725636, 791318536, 790877163, 790416002, 789945364, 789462209, 789006889, 788607299, 788190484, 787721872, 787266552, 786837041, 786385715, 785887420, 785351396, 784834862, 784371555]
2710.7G84371555m54545m76599m68850m49359m79520n36799n37575m75943m51266n04136
2731.1G79536963n19097m30644l63588l93927m44234m53531l91424l22402l74496m90129
2751.4G75353491n13732m49360m50491n39542n36084m06086l24786l90053n05447m93407
2771.8G70744503m16756m89473o25194o25550n56767n50151n47588m99785n05984n91874
2792.2G65335381o57916o54161o57260p09355p62344p77185p17699o67811p44342q64506
2812.6G58122802r06050q85249q59260q82983r71675j034737j024187j042902j176238
2831G49339521j326203j400590j463592j687110k095163k475679k770841l007054k974272
2849.3G30139017k402484j450479o59705k68161j80960l17812n72502q43823j137495
$$ y = [784371555, 783917010, 783440411, 782971561, 782522202, 782042682, 781505883, 780968308, 780492365, 780041099, 779536963, 779017866, 778587222, 778223634, 777829707, 777385473, 776931942, 776540518, 776218116, 775843620, 775353491, 774839759, 774390399, 773939908, 773400366, 772864282, 772458196, 772133410, 771743357, 771237910, 770744503, 770327747, 769838274, 769213080, 768587530, 768030763, 767480612, 766933024, 766433239, 765927255, 765335381, 764677465, 764023304, 763366044, 762656689, 761894345, 761117160, 760399461, 759731650, 758987308, 758122802, 757216752, 756331503, 755472243, 754589260, 753617585, 752582848, 751558661, 750515759, 749339521, 748013318, 746612728, 745149136, 743462026, 741366863, 738891184, 736120343, 733113289, 730139017, 727736533, 726286054, 725626349, 725358188, 725177228, 724859416, 724286914, 723443091, 722305596]
2867.7G22305596j295209j099467q24929p56800o79433n27203m91321n81444p04765
2886.1G15345025p94887q56221r42230j035929j122117j222134j266360j252711j302779
2904.4G05549657j432836j618325j849413k147675k497315k692223k547502k115786
2920.7F88648582j543820r53138l84987J01209L73244N68688Q69632J163661J351357
2939.1F90194428J503944J596332J414597R60767N25892K93553J19746l6180N2094
2957.4F96625173L40939O37293Q82148J107872J351356J564086J712739J744569J624167
2975.8G07590342J516282J468182J259029R62674Q43406Q44657Q38101O87182L54111
2994.2G16363966J15276k3484k14339l37481l90589l97444l14236k65896l60608n50390
$$ y = [722305596, 721010387, 719910920, 719085991, 718329191, 717649758, 717122555, 716631234, 716049790, 715345025, 714550138, 713693917, 712751687, 711715758, 710593641, 709371507, 708105147, 706852436, 705549657, 704116821, 702498496, 700649083, 698501408, 696004093, 693311870, 690764368, 688648582, 687104762, 686151624, 685766637, 685867846, 686241090, 686809778, 687679410, 688843071, 690194428, 691698372, 693294704, 694709301, 695670068, 696195960, 696489513, 696609259, 696573079, 696625173, 696966112, 697603405, 698485553, 699593425, 700944781, 702508867, 704221606, 705966175, 707590342, 709106624, 710574806, 711833835, 712796509, 713639915, 714484572, 715322673, 716009855, 716363966, 716479242, 716455758, 716241419, 715903938, 715513349, 715115905, 714801669, 714535773, 714175165, 713624775]
3014.5G13624775p25209p83444p74801p88867q15868q54969q25763p23601o77526p94649
3034.9G05860078r78231r34780p81059q23379r80138j064062j027167r68933r72391
3053.3F97329938r85801j015901j037240r46522q17478p45416p89880r38118r78231
3071.7F89075351q54254p16150o63161p17759q19087q93355r54270r47535q65996r04739
3092.1F80739045j048326j041830q66353q16107r71794j059235r79959r18627r93848
3110.4F72042966j016379q73982q14617r69768j234531j399994j341641j211405j153230
3128.8F62027419j209081j293242j206159j022220j051962j322448j482666j429319
3145.1F52010322j332522j204789j123130j259267j511455j606047j541853j458883
$$ y = [713624775, 712899566, 712116122, 711341321, 710552454, 709736586, 708881617, 708055854, 707332253, 706654727, 705860078, 704881847, 703947067, 703166008, 702342629, 701362491, 700298429, 699271262, 698302329, 697329938, 696344137, 695328236, 694290996, 693344474, 692526996, 691781580, 690991700, 690053582, 689075351, 688221097, 687504947, 686841786, 686124027, 685304940, 684411585, 683457315, 682509780, 681643784, 680739045, 679690719, 678648889, 677782536, 676966429, 675994635, 674935400, 673955441, 673036814, 672042966, 671026587, 670152605, 669337988, 668368220, 667133689, 665733695, 664392054, 663180649, 662027419, 660818338, 659525096, 658318937, 657296717, 656244755, 654922307, 653439641, 652010322, 650677800, 649473011, 648349881, 647090614, 645579159, 643973112, 642431259, 640972376]
3161.4F40972376j417101j435756j476705j494646j458824j450539j523196j554132
3177.7F29161477j507461j493037j500427j473964j454472j457572j465440j506627
3194F17302477j547634j484633j405358j415193j413524j358211j343012j387179j420200
3212.4F04527533j403809j340568j334786j392007j382828j343727j343012j321077
3228.7E93665719j206517j104891j226068j432836j448751j359641j295746j210629
3245E83380640j179934j303256j388430j300931j223028j291394j385510j352906j230538
3263.4E71724713j121223j035631r84251j069188j236558j316548j311004j222730
3279.7E62427580j083433j026869j044870j043975r82284r36151j024902j131356j130402
$$ y = [640972376, 639555275, 638119519, 636642814, 635148168, 633689344, 632238805, 630715609, 629161477, 627654016, 626160979, 624660552, 623186588, 621732116, 620274544, 618809104, 617302477, 615754843, 614270210, 612864852, 611449659, 610036135, 608677924, 607334912, 605947733, 604527533, 603123724, 601783156, 600448370, 599056363, 597673535, 596329808, 594986796, 593665719, 592459202, 591354311, 590128243, 588695407, 587246656, 585887015, 584591269, 583380640, 582200706, 580897450, 579509020, 578208089, 576985061, 575693667, 574308157, 572955251, 571724713, 570603490, 569567859, 568583608, 567514420, 566277862, 564961314, 563650310, 562427580, 561344147, 560317278, 559272408, 558228433, 557246149, 556309998, 555285096, 554153740, 553023338]
3298E53023338j085221r89318q81255r55164j193524j377344j425147j355410j273751
3316.4E42487204j284778j350164j391650j394808j468599j593888j610636j546562
3332.7E30846119j471996j377941j411080j576781j631916j641392j623989j457035
3349E18653989j477540j763820j824022j581311j405716j461267j536429j410663j262844
3367.4E04930377j375854j647055j676381j448035j320869j305640j282393j248777
3383.7D93625373j181484r92179p34061p78347j121789j175463p60496n04941q57085
3402.1D85519528j250088j071185o86586n49167n95182p04140p24643n56558m18604
3420.4D78963375m15206l22610p1853J17480O3271O1303K29657J43468j76728k43008
$$ y = [553023338, 551938117, 550948799, 550067544, 549112380, 547918856, 546541512, 545116365, 543760955, 542487204, 541202426, 539852262, 538460612, 537065804, 535597205, 534003317, 532392681, 530846119, 529374123, 527996182, 526585102, 525008321, 523376405, 521735013, 520111024, 518653989, 517176449, 515412629, 513588607, 512007296, 510601580, 509140313, 507603884, 506193221, 504930377, 503554523, 501907468, 500231087, 498783052, 497462183, 496156543, 494874150, 493625373, 492443889, 491451710, 490717649, 489939302, 488817513, 487642050, 486881554, 486376613, 485519528, 484269440, 483198255, 482511669, 481962502, 481367320, 480663180, 479938537, 479381979, 478963375, 478548169, 478225559, 478153706, 478271186, 478334457, 478395760, 478625417, 478768885, 478592157, 478349149]
3440.8D78349149N5880L92019N23031N19842N45591N84632O26505P60376Q92073Q33392
3461.2D84082490Q60274J205862J406908J086354O38336O56962J005590J281589J268596
3479.6D93492961J041293J064390J328677J366883J277507J366764J478732J506805
3495.9E03924012J464248J435995J497447J432360J276672J374244J671672J873374
3512.2E15950024J767993J520276J503766J707792J940906J920641J709520J721621
3528.5E29742539J919031K046347K144992K151430K008676K063394K280831K308667
3544.8E46665907K106309J979828K094328K310395K446950K474010K486944K461433
3561.1E65026104K240301K094090K689361L299952L044486K711177K746999K916932
$$ y = [478349149, 478405029, 478797048, 479320079, 479839921, 480385512, 480970144, 481596649, 482357025, 483249098, 484082490, 484942764, 486148626, 487555534, 488641888, 489280224, 489937186, 490942776, 492224365, 493492961, 494534254, 495598644, 496927321, 498294204, 499571711, 500938475, 502417207, 503924012, 505388260, 506824255, 508321702, 509754062, 511030734, 512404978, 514076650, 515950024, 517718017, 519238293, 520742059, 522449851, 524390757, 526311398, 528020918, 529742539, 531661570, 533707917, 535852909, 538004339, 540013015, 542076409, 544357240, 546665907, 548772216, 550752044, 552846372, 555156767, 557603717, 560077727, 562564671, 565026104, 567266405, 569360495, 572049856, 575349808, 578394294, 581105471, 583852470, 586769402]
3577.5E86769402L076613L155053L019154K770662K868712L245592L191054L051937
3593.8F11148179L224372L433466L455639L387630L173054K867102K973318L277302
3610.1F36940062L348053L419697L264844L244996L761292L693282K925039K323270
3626.4F62920535K907812L968299L625869L222883L060937K822280K731681K651751
3642.7F87912047K334773K132118K835453L600120K952576K405584K774417K797544
3659G09744632K241254J900792J705349J348793J294792J627028J380324J445532K047360
3677.4G24735856J943409J656652J383722J017451R44316J208783J333058J235842
3693.7G35459089J028657P50363N53608P17402R31203O40392J52707L815N41687J052439
$$ y = [586769402, 589846015, 593001068, 596020222, 598790884, 601659596, 604905188, 608096242, 611148179, 614372551, 617806017, 621261656, 624649286, 627822340, 630689442, 633662760, 636940062, 640288115, 643707812, 646972656, 650217652, 653978944, 657672226, 660597265, 662920535, 665828347, 669796646, 673422515, 676645398, 679706335, 682528615, 685260296, 687912047, 690246820, 692378938, 695214391, 698814511, 701767087, 704172671, 706947088, 709744632, 711985886, 713886678, 715592027, 716940820, 718235612, 719862640, 721242964, 722688496, 724735856, 726679265, 728335917, 729719639, 730737090, 731681406, 732890189, 734223247, 735459089, 736487746, 737238109, 737791717, 738509119, 739440322, 740080714, 740233421, 740237236, 740778923, 741831362]
3714.1G41831362Q44658M51147K35319K03073L33667N53072M55498m0173k98679J40429
3734.5G44709373Q37266Q05616N1976n05448n5611M62711J9252J23382R12845Q23319
3754.9G48184681L16501K78115N19335L54111L7313j79J84774M19200L95000J58250
3775.3G50847101L1412J12653J99973J47701J45792J97888K05696J29818p7426j66297
3795.7G51774311j55985k76745m7087K64704J89245L46481M19915M0293l28779k14696
3816.1G52011657o5089j68502J75834L70979J87934R5009R299n1558j04368k11775
3836.5G52249420j78039N7160L12508M49717J84655m24147j000762p80761N82099Q56280
3856.9G52308130K62141r4592j51575l7729j17779j54793J02102J66834J27077m411
$$ y = [741831362, 742676020, 743127167, 743362486, 743565559, 743899226, 744452298, 744907796, 744867623, 744568944, 744709373, 745546639, 746352255, 746404231, 745898783, 745843172, 746305883, 746325135, 746448517, 747361362, 748184681, 748501182, 748779297, 749298632, 749652743, 749690056, 749689877, 749874651, 750293851, 750688851, 750847101, 750878513, 750991166, 751191139, 751338840, 751484632, 751682520, 751888216, 752018034, 751940608, 751774311, 751618326, 751341581, 751294494, 751559198, 751748443, 752094924, 752514839, 752555132, 752226353, 752011657, 751946568, 751778066, 751953900, 752324879, 752512813, 752607822, 752617121, 752565563, 752461195, 752249420, 752071381, 752128541, 752441049, 752890766, 753075421, 752651274, 751650512, 750869751, 751451850, 752308130, 752570271, 752475679, 752324104, 752286375, 752168596, 752013803, 752115905, 752282739, 752409816, 752405405]
3877.3G52405405j54793l0458M1067J19269J49906q2970n9843Q8990j39177m21762
3897.7G51915634m36724k05040J51337L94344L06189O6221j10209k04385j62243K9802
3918.1G51744926Q6129j17004j95980m8340m7981j23263L9518J68443k7716k23577
3938.5G51255155k02835q8394n1975r6381o0379J2696K2828r179p1466j30474j34051
3960.9G50445545l6419O2764J79j17839j15811m8697J5854J6094o6102r8944m8756
3983.3G50007868p0632j43110j09256k7656r477l4571l7491
3997.6G49575675
$$ y = [752405405, 752250612, 752220154, 752261221, 752380490, 752530396, 752447426, 752387583, 752476573, 752337396, 751915634, 751478910, 751273870, 751425207, 751819551, 752125740, 752191961, 752081752, 751877367, 751715124, 751744926, 751831055, 751714051, 751518071, 751469731, 751421750, 751298487, 751338005, 751506448, 751478732, 751255155, 751052320, 750963926, 750911951, 750815570, 750755191, 750767887, 750790715, 750781536, 750710070, 750579596, 750445545, 750409126, 750471890, 750472069, 750354230, 750238419, 750189722, 750205576, 750221670, 750155568, 750056624, 750007868, 749937236, 749794126, 749684870, 749657214, 749647737, 749613166, 749575675]
##END=$$ End of the data block
