##TITLE=$$ Begin of the data block
##JCAMP-DX=5.00 $$ ACD/SpecManager v 10.08
##SPECTROMETER/DATA SYSTEM=Alpha
##DATE=11 Nov 2014 09:02:30
##DATA TYPE=INFRARED SPECTRUM
##DATA CLASS=XYDATA
##ORIGIN=
##OWNER=
##NPOINTS=1765
##FIRSTX=399.76428223
##LASTX=3997.64306641
##MAXX=3997.64306641
##MINX=399.76428223
##MAXY=0.84948856
##MINY=0.47351000
##XFACTOR=1.0000000000
##YFACTOR=1.000000000000000e-9
##FIRSTY=0.74297202
##DELTAX=2.03961372
##XUNITS=1/CM
##YUNITS=ARBITRARY UNITS
##XYDATA=(X++(Y..Y))
399.8 742972016 744070947 742374361 739783287 739002407 739280820 738272309 736129224 734926045 734947264
418.1 734947264 733698010 730965674 729784429 730788589 730982304 729044378 727583349 728290379 729155719
436.5 729155719 728112459 726400077 726226449 727127373 726737320 725084901 724497139 725299776 725150228
454.8 725150228 723095000 721534729 722183764 722699761 721068621 719102323 719180226 720053494 719267905
473.2 719267905 717530310 717307329 718608797 718826473 716966331 715430260 716078639 717121661 716215014
491.5 716215014 714612424 714694381 715649903 715178013 713226557 712079406 712464869 712415397 710764587
509.9 710764587 709038734 708782852 708926857 707644403 705615461 704925776 705415428 704956353 703170538
528.3 703170538 702104390 702640593 703044057 701868474 700626791 701373816 703312933 704100788 703479052
546.6 703479052 703334630 704310894 704772413 703784466 702794731 703186154 703972697 703542590 702550054 702689588
567 702689588 703667641 703784823 702817142 702312410 703115642 704021275 703675091 702838659 703132331 704234481
587.4 704234481 704413831 703451991 703122318 704085052 704669654 703941464 703283608 703865409 704690874 704262555
607.8 704262555 702943861 702280045 702573657 702560186 701767206 701815009 703796148 706229389 707391500
626.2 707391500 707915604 709262669 711111903 711909652 711578488 711910784 713710666 715453923 715854347
644.5 715854347 715981901 717386305 719460607 720435083 720348775 720843077 722275317 723040223 722448885
662.9 722448885 722147703 723774612 726177454 726618290 726691902 728124440 730576456 732207119 732542574
681.2 732542574 733168781 734927177 736502767 736600697 736116707 736662567 737890720 738208830 737672091
699.6 737672091 737985671 739687264 741293907 741741240 742065191 743615866 745778501 747011423 747474670
717.9 747474670 748709798 751026988 752987921 753921092 754970372 757050633 759195268 760057747 760097742
736.3 760097742 760836661 762385726 763308823 763214111 763425708 764661670 765839338 765821457 765274107 765575409
756.7 765575409 766610205 767108202 766834140 767094433 768589795 770125747 770621479 770864189 772119641
775.1 772119641 774046123 775311589 775823653 776771963 778651476 780447841 781218708 781682491 783048272
793.4 783048272 784936011 786021054 786213458 786756039 788119376 789166331 789128780 788953722 789739847
811.8 789739847 790996492 791465461 791089654 790925741 791078866 790548682 789418280 789089978 790261507
830.1 790261507 792011619 793101072 793802321 795501471 798317134 800555587 801215470 801422775 802314222
848.5 802314222 803201199 803025723 802423656 802882254 804311752 805129528 804790199 804566085 805259407 805734813
868.9 805734813 804843307 803390682 802765846 802670240 801662028 799563944 797772408 796935618 795941353
887.2 795941353 793936193 791960299 791401565 791821957 791807711 791358113 791659892 792777777 793279171
905.6 793279171 792392492 791174889 790721774 790386260 789008439 787034810 785930634 785878241 785542011
923.9 785542011 784289181 783156097 782904506 782509327 780719578 777990043 775564730 773407936 770345926
942.3 770345926 766158581 762144446 759206235 756690741 753764153 750933230 749165833 748119950
958.6 748119950 746532261 744152486 741992652 740469992 738546133 735304952 731360316 727671444
974.9 727671444 723830938 718842387 712974131 707529962 703004420 698681056 694107115 689956248
991.3 689956248 686914265 684377134 681181669 677251279 673489749 670198023 666657925 662477672
1007.6 662477672 658398032 655195832 652596414 649917066 647297502 645576239 644908667 644437134 643698692
1025.9 643698692 643298984 643752754 644558489 644948959 645054758 645558953 646349132 646489561 645716786 644935369
1046.3 644935369 644900978 645216703 645156145 644933462 645258486 646044433 646523178 646493971 646511018 646811724
1066.7 646811724 646874130 646234512 645382047 645329297 646336794 647753119 649213076 651109040 653533101
1085.1 653533101 655606985 656537294 656728327 657038689 657453716 657361567 656809568 656626523 657263994 658255219
1105.5 658255219 659144223 660320580 662382364 665072262 667583287 669691503 671852350 674240470
1121.8 674240470 676375985 677912474 679380059 681611121 684260309 686140060 687065601 687768519 688463390
1140.1 688463390 688695729 688379586 688267529 689056933 690458357 691790223 693190038 695374429 698426366
1158.5 698426366 701748252 705153227 709314883 714771152 720937908 726873398 732571304 738578856
1174.8 738578856 744736612 750199318 754587114 758462012 762271583 765479267 767397225 768278420
1191.1 768278420 768824518 769020200 768344879 766901076 765535891 764750838 764111459 763081908 761927247
1209.5 761927247 761178374 760588467 759364486 757373929 755370736 753808618 752224922 750169575 748083234
1227.9 748083234 746604323 745576441 744443238 743235171 742522180 742452204 742462635 742182016 742007911
1246.2 742007911 742377818 743000448 743268847 743203640 743372679 743963182 744502544 744691312 745015264 745934129
1266.6 745934129 747050047 747731864 748132765 748830497 749789357 750358760 750304639 750193059 750462830 750742257
1287 750742257 750463486 749762893 749177873 748703539 747752249 746129751 744359612 742863834 741328299
1305.4 741328299 739295065 737031162 735100865 733524919 731828868 729901791 728328764 727467179
1321.7 727467179 726754785 725605011 724237978 723217726 722552717 721743405 720683336 719844580 719630122
1340 719630122 719659865 719363153 718864381 718566298 718353510 717791259 716878653 716080427 715504229 714487314
1360.4 714487314 712655544 710700631 709026277 707043290 704400063 700955391 696832120 692105889
1376.7 692105889 683471322 665546119 644036174 638059497 654564321 675231695 685561299 689171314
1393.1 689171314 690337598 690278292 689582646 689131141 689248085 689596236 689878106 690120041 690660894 691530824
1413.5 691530824 692244351 692605376 693389356 695007741 696833849 698512793 700047791 701658845 703426480
1431.8 703426480 704932153 706038058 707381189 709071755 710535705 711475015 712088823 712879062 714012027
1450.2 714012027 715023816 715680122 716449559 718476892 721074879 723126233 725050926 727701187 730907500
1468.5 730907500 734317422 738553047 743533909 748282194 752276421 755329072 757696211 759504020
1484.9 759504020 760570467 760648370 760151446 759662032 758626461 756420374 753780484 751575470 749675333
1503.2 749675333 746861398 742572904 739946961 738652766 737255096 735558033 733917654 732745409
1519.5 732745409 731799662 731110930 730286539 729062200 728044808 726974070 725528657 724439979 723307192
1537.9 723307192 721281588 719862282 719567120 719467223 719468415 719606996 719901800 720145404 720115364 719680011
1558.3 719680011 720091581 721156180 721566617 721505344 721131444 720442951 719718456 718293726 715791285
1576.6 715791285 713592231 711445332 708513796 705166399 701667309 697838306 693627477 689381540
1593 689381540 685398996 681722343 678101063 674355924 670746088 667448699 664078355 660340786 656728268
1611.3 656728268 653571308 649940312 645512700 642247736 639605701 636461616 633401036 630402684
1627.6 630402684 627586007 625649750 623971283 621866941 620813251 621042907 621704161 622417569 623050451
1646 623050451 624320567 626107097 627761066 630143642 633136451 636031747 639104068 642586350 646357059
1664.3 646357059 649892211 653652191 658238947 662682652 667037070 671932995 676732540 681000352
1680.7 681000352 685129464 690551698 696397424 701557636 706625462 711201251 715887964 721182168
1697 721182168 726317465 731740177 736452401 740399480 744255066 747420132 749776423 751620173 753033161
1715.3 753033161 754156768 755410731 756722629 757862687 758909285 759717822 760332584 760952652 761756122
1733.7 761756122 763140976 764585793 765991151 767935753 770277858 772530735 774715185 777391851
1750 777391851 780821800 784102440 786918938 789732695 792611957 795561314 798336267 800708413 802990973
1768.4 802990973 805272222 807381272 809341431 811173201 812925339 814518154 815755665 816773474
1784.7 816773474 817995071 819300830 820091605 820545793 821432590 822647631 823627532 824212730 824810743
1803 824810743 825721800 826710999 827326059 827637434 828193426 829042673 829753399 830171764 830493331 830932796
1823.4 830932796 831538737 831983864 832120478 832566500 833427668 834048569 834281504 834521532 834892213 835172951
1843.8 835172951 835427642 835776567 836256802 836865664 837298274 837422192 837549150 837967932 838469803 838666677
1864.2 838666677 838506758 838436723 838907778 839484096 839694142 839803994 840146661 840513408 840623915 840629339
1884.6 840629339 840791762 841018260 841178775 841257930 841344774 841658473 842022121 842111170 842047393 842149913
1905 842149913 842408895 842543840 842539012 842651665 842871010 842965961 842938423 842893481 842982829 843276322 843453109
1927.5 843453109 843383014 843351841 843527675 843718529 843680203 843461990 843340993 843477070 843624651 843565166
1947.9 843565166 843510628 843638420 843753695 843676805 843535483 843545377 843673348 843660772 843453348 843370736 843555510
1970.3 843555510 843701601 843591571 843401551 843396842 843536794 843574405 843456268 843379378 843436301 843430459 843255103
1992.7 843255103 843109190 843135417 843236268 843204260 843009889 842900813 842973888 843003452 842824936 842587411
2013.1 842587411 842501223 842524648 842458069 842265546 842132449 842134237 842101276 841904223 841689110 841655254 841702461
2035.6 841702461 841594517 841361821 841252744 841314614 841313720 841148794 841012657 841039896 841102362 841025412 840871155
2058 840871155 840862632 841003597 841034353 840879202 840771973 840834498 840913415 840840042 840711713 840751588 840926945
2080.4 840926945 840986669 840856850 840745449 840805709 840904713 840859473 840770125 840853155 841058016 841139495 841061652
2102.9 841061652 841036916 841147125 841226935 841176093 841143787 841275752 841451228 841471493 841392815 841415226 841567338
2125.3 841567338 841659129 841573656 841500580 841636062 841859400 841929376 841870844 841911197 842074931 842166364 842119932
2147.7 842119932 842102110 842240393 842426240 842507184 842513382 842582643 842750072 842877090 842895031 842943490 843124092
2170.2 843124092 843334436 843433142 843454719 843543172 843718112 843845010 843881071 843974173 844202220 844420552
2190.6 844420552 844489038 844487548 844579101 844758213 844883323 844905317 844954312 845117033 845274150 845314562 845297635
2213 845297635 845348477 845479012 845570087 845570564 845577002 845686018 845846236 845940053 845949411 845956028 846016645 846085429
2237.5 846085429 846118271 846172988 846299708 846425891 846458137 846431136 846437454 846483290 846516609 846538484 846603036
2259.9 846603036 846718609 846809745 846819222 846786857 846804321 846875191 846888244 846815407 846782446 846841216 846890211
2282.3 846890211 846874535 846852720 846897364 846978784 847021461 847055316 847171962 847350240 847463310 847499371 847565591
2304.8 847565591 847722650 847917378 848050296 848145008 848321676 848608792 848892510 849055231 849152148 849284232
2325.2 849284232 849392235 849427402 849430144 849429369 849418283 849386632 849303722 849114954 848752320 848133266 847616673
2347.6 847616673 847632468 848143518 848799586 849276066 849488556 849410951 849096954 848594368 847902238 847146869
2368 847146869 846476614 845806241 845040619 844291508 843658745 843091846 842555761 842093766 841748059 841529489
2388.4 841529489 841359913 841143012 840868711 840605736 840433717 840320289 840173900 840006232 839863777 839700222
2408.8 839700222 839469850 839210510 838978708 838768840 838514090 838153601 837679386 837222159 837001979 837033927
2429.2 837033927 837097228 837070286 837005079 836902976 836723268 836518347 836349308 836199343 836013973 835772038
2449.6 835772038 835495412 835217834 834985852 834796548 834608793 834416628 834227920 834007740 833722293 833412170
2470 833412170 833124995 832860172 832602739 832358956 832138419 831938505 831700265 831357837 830990672 830716670
2490.4 830716670 830496669 830230832 829945922 829711080 829492927 829236269 828947723 828656018 828392625 828164220
2510.8 828164220 827933013 827678740 827430308 827191472 826925457 826642394 826381445 826140404 825890124 825618029
2531.2 825618029 825337768 825089633 824871004 824598730 824276984 823973179 823703885 823480964 823267698 823001444
2551.6 823001444 822703838 822438776 822192073 821901023 821578622 821285784 821025848 820756912 820469141 820189536
2572 820189536 819932044 819669127 819350481 818981588 818635821 818329394 818045855 817780733 817498803 817197978
2592.4 817197978 816883624 816535830 816179037 815853953 815528095 815170169 814819694 814501107 814191282 813851833
2612.8 813851833 813460350 813052297 812672019 812295616 811930180 811604083 811246097 810838640 810443044 810028851
2633.2 810028851 809571564 809134960 808738649 808332384 807901621 807512045 807169616 806770861 806276083 805769682
2653.5 805769682 805323482 804921508 804531634 804124236 803712308 803333163 802917838 802422762 801940262 801526487
2673.9 801526487 801137567 800724387 800286949 799861193 799456894 799024403 798537374 798075676 797683775 797290862
2694.3 797290862 796847820 796379149 795935452 795504510 795015514 794467092 793944299 793500602 793085694 792646229
2714.7 792646229 792192638 791732907 791262507 790788352 790312886 789834142 789355218 788865924 788363397 787915170
2735.1 787915170 787548006 787181258 786744595 786260366 785862446 785570621 785208166 784730256 784251094 783827782
2755.5 783827782 783413827 782935023 782423615 781985819 781626821 781240106 780771375 780311823 779909790 779438376
2775.9 779438376 778829932 778194129 777614236 777072251 776550829 776036620 775485098 774870276 774228632 773607433
2796.3 773607433 772984207 772296965 771543860 770761847 770012856 769345641 768660784 767839909 766928971 766030490
2816.7 766030490 765178382 764303148 763323247 762282252 761276364 760241508 759033203 757687986 756326318
2835.1 756326318 754916966 753222585 751051605 748494744 745690644 742711067 739779770 737372577
2851.4 737372577 735872328 735156298 734858632 734711826 734449923 733875453 732979298 731820047 730580509
2869.7 730580509 729533076 728699207 727937877 727288008 726795733 726337075 725787997 725088656 724264681
2888.1 724264681 723367691 722408473 721418202 720358908 719152272 717868328 716605783 715304315 713839054
2906.5 713839054 712187111 710346997 708197594 705679893 702996254 700492084 698416948 696874082
2922.8 696874082 695911348 695540011 695641220 696010768 696641505 697629213 698883533 700272441 701800168
2941.1 701800168 703407228 704830647 705828130 706401050 706742644 706912518 706913769 706975162 707309842 707963109
2961.5 707963109 708898425 710075259 711486399 713090241 714840651 716654420 718357325 719929814
2977.8 719929814 721444070 722747087 723761201 724654853 725527048 726394951 727139652 727551341 727680027
2996.2 727680027 727653623 727478504 727183163 726794660 726402640 726127565 725929022 725630105 725087821 724350870
3016.6 724350870 723580003 722836852 722102225 721315980 720441759 719610155 718916953 718262374 717474818 716522694
3037 716522694 715623558 714878976 714098513 713147581 712082803 711037278 710059941 709105730 708150268 707134604
3057.4 707134604 706077695 705130279 704323471 703593433 702820063 701891363 700913906 700045884 699342549
3075.7 699342549 698722601 698019147 697223067 696366608 695401788 694450200 693620801 692738831 691709161
3094.1 691709161 690694273 689820766 688970804 687986791 686960161 686039805 685179174 684226692 683234811
3112.4 683234811 682368994 681534588 680555522 679345250 677920401 676510870 675298214 674181521 672968388
3130.8 672968388 671657979 670446038 669391692 668263853 666888118 665434241 664055765 662694871
3147.1 662694871 661408901 660228312 658938706 657419622 655804038 654211581 652661085 651168346
3163.4 651168346 649722993 648232758 646645725 645067155 643565059 642045021 640463173 638914287
3179.8 638914287 637400150 635845304 634265959 632706881 631169081 629624784 628056526 626474202
3196.1 626474202 624909818 623387933 621900439 620433211 618979633 617541850 616113484 614659607
3212.4 614659607 613182843 611727178 610270381 608777404 607305050 605910540 604541838 603170574
3228.7 603170574 601871490 600639284 599296510 597759485 596203268 594766617 593423367 592155635
3245 592155635 590884864 589460492 587970316 586616576 585344017 584002435 582622230 581287920 579999447
3263.4 579999447 578756213 577584267 576462567 575292051 574030578 572718680 571408570 570186794
3279.7 570186794 569053650 567916930 566757917 565622628 564557254 563530266 562428057 561230302
3296 561230302 559988856 558752596 557601631 556558132 555465639 554120302 552559495 551002860 549561024
3314.4 549561024 548152924 546668231 545100331 543520987 541936219 540247500 538463414 536695063
3330.7 536695063 534964502 533280373 531665206 529994965 528169990 526261151 524342358 522532761
3347 522532761 520886838 519126713 517065585 514966786 513083577 511362195 509610832 507817745 506196678
3365.4 506196678 504721284 503080666 501146317 499196470 497503489 495972604 494462371 492936015
3381.7 492936015 491432607 490071833 488968879 488092214 487109751 485804915 484500766 483574986 482870519
3400 482870519 481890768 480565429 479373336 478549272 477892280 477196068 476394624 475582451 474920928 474381864
3420.4 474381864 473899364 473590285 473509997 473538667 473522007 473559618 473782867 473934650 473801702 473655909
3440.8 473655909 473819703 474242151 474747658 475285947 475902349 476615787 477410287 478315145 479324132
3459.2 479324132 480272919 481234998 482535273 484035850 485234529 486055195 486924738 488088071 489495695
3477.5 489495695 490926534 492158353 493383348 494847089 496335953 497712374 499202192 500839829
3493.8 500839829 502503633 504157126 505850196 507586002 509198606 510687947 512289703 514119625
3510.2 514119625 516135395 518085301 519807220 521546125 523500502 525670171 527799845 529676795
3526.5 529676795 531564355 533678114 535927534 538282216 540657640 542943180 545337200 547925770
3542.8 547925770 550472379 552807033 555072129 557471752 560033977 562645137 565294564 568084776
3559.1 568084776 570921540 573519468 575930119 578842044 582334638 585670590 588732541 591814816
3575.4 591814816 595029056 598435640 602016330 605475426 608648658 611914337 615537763 619065106
3591.7 619065106 622448444 626064837 629917800 633733034 637465477 641006589 644246280 647591949
3608.1 647591949 651210546 654894948 658679545 662304342 665892959 670004964 674023807 677287877
3624.4 677287877 679990590 683175564 687315464 691137671 694561064 697835565 700893462 703852415
3640.7 703852415 706725657 709284484 711597919 714496791 718120813 721219897 723816514 726719022
3657 726719022 729588032 731865346 733798921 735584438 737002313 738301456 740033031 741540492 742909670
3675.4 742909670 744879842 746867537 748591781 750101507 751259565 752202511 753311157 754646838
3691.7 754646838 755951047 757066309 757932961 758572996 759315312 760290384 761020362 761252999 761267006
3710 761267006 761744916 762786925 763709605 764245093 764520764 764733791 765040338 765520275 765965343 766033828
3730.4 766033828 765842915 765955746 766676962 767487586 767717242 767338037 767205000 767631948 767726183 767859221
3750.8 767859221 768716216 769542634 769886017 770110130 770555615 770930350 771065950 771146178 771288872 771628559
3771.2 771628559 772086680 772401989 772520125 772596478 772720933 772817552 772957623 773226678 773540556 773751020
3791.6 773751020 773705184 773529053 773379624 773085892 772964776 773186862 773310721 773633659 774167299 774332464
3812 774332464 774046302 773807287 773764312 773612201 773747206 774136841 774365127 774461746 774436712 774389505 774412870
3834.4 774412870 774272501 773997605 774055481 774448574 774896502 775149524 774937987 774075091 773107648 773425281
3854.8 773425281 774331927 774735808 774660766 774423301 774383307 774394751 774266422 774266958 774451613 774733782 774838626
3877.3 774838626 774635971 774559975 774652600 774756968 774866700 774780154 774684727 774798393 774768412 774440467
3897.7 774440467 774082482 773899555 773998260 774390280 774720311 774809420 774766147 774583638 774329722 774240196
3918.1 774240196 774309516 774322331 774262905 774259925 774230778 774081290 773984313 774040103 774072707 773985744 773871303
3940.5 773871303 773854733 773904741 773861885 773766994 773744941 773771822 773797274 773772836 773671985 773544550 773469031
3962.9 773469031 773449183 773419738 773396373 773407340 773400724 773388207 773390651 773350954 773291051 773271143 773255229 773206890
3987.4 773206890 773126006 773041189 773001790 773000836 773019433
3997.6 773019433
##END=$$ End of the data block
