##TITLE=$$ Begin of the data block
##JCAMP-DX=5.00 $$ ACD/SpecManager v 10.08
##SPECTROMETER/DATA SYSTEM=Varian
##DATE=19 Mar 2013 14:21:50
##DATA TYPE=INFRARED SPECTRUM
##DATA CLASS=XYDATA
##ORIGIN=
##OWNER=
##NPOINTS=3735
##FIRSTX=399.26403809
##LASTX=4000.35498047
##MAXX=4000.35498047
##MINX=399.26403809
##MAXY=1000.00000000
##MINY=0.00000100
##XFACTOR=1.0000000000
##YFACTOR=0.000010000000000
##FIRSTY=86.22345734
##DELTAX=0.96440572
##XUNITS=1/CM
##YUNITS=TRANSMITTANCE
##XYDATA=(X++(Y..Y))
399.3H622346Uq622346%ZK6808789j7257297k026145%Wp525347%K6502902L370688
421.4B9873590N967117k0585252J3538658N175357N105615O0924915%j00000000%sN8111865
438.8E8111865%Tn4196689R274410%Yj3189586%S4J427344N911538O592815K180892
467.7A6112589k86638j0092623j905922L487789Q448529k067185j3034881o61658%
476.4@O30514L539326J018110k655673k136706O090796N623302l484744o71883M07623
486.1H360665l012843m34689L025103j733090l443188k761958%TR12477N281355M964241
496.7A1158073k441856l115615q37256P53324L51282j214388k898286j755278Q73547
505.3H73547J932668J172456L17745Q18860R17323m40743O06536P86100q92284q01725
$$ plain form
399.3 8622346 8622346 8622346 0 0 0 0 0 0 0 0 0 26808789 9551492 7525347 7525347 7525347 7525347 7525347 7525347 0 0 26502902 29873590
421.4 29873590 35840707 15255455 28794113 33969470 39075085 100000000 100000000 0 0 0 0 0 0 0 0 0 0 58111865
438.8 58111865 58111865 58111865 3915176 13189586 13189586 13189586 13189586 13189586 13189586 13189586 13189586 0 0 0 0 0 0 0 0 0 0 0 0 0 0 0 1427344 7338882 13931697 16112589
467.7 16112589 15825951 5733328 3827406 7315195 15763724 13696539 661658 0 0
476.4 0 630514 4169840 5187950 2532277 395571 6486367 12109669 8624925 7953042 8360665
486.1 8360665 5347822 4913133 7938236 6205146 2761958 0 0 0 912477 6193832 11158073
496.7 11158073 8716217 5600602 4763346 5516670 5867952 4653564 1755278 0 873547
505.3 873547 2806215 3978671 4296416 5115276 6032599 5591856 6198392 6984492 6092208 5290483
515E290483q95102q23057m22332n34392p70151O7340Q16259Q89237O25927M19383J161656
525.6E825251M41657j074720o47395R9577J89661m91565n76279m93752n45131o0742
535.2B666562L51648K69791L93538O17940N26532O62398L43971n63665p43611p40553
544.9C784551o14308k94881k19655k80416J58834P48427Q05155M22936K79891R4451
554.5D884985k86327m1357K48352J08962n33984j105235m15491K41515L97480J02824
564.2C601724j30408J89420J62263J28950N35401L58899k70610k86374j403q8081l38821
574.8C860960o73765l34555K54458L07220K94046K99233J40119q5293R8252M91549
584.4D652224J42882k64864j49483j66818l21356n95079m28182K36083M28196K83021
$$ plain form
515 5290483 4395381 3572324 3149992 2615600 1845449 1912789 2729048 3618285 4244212 4663595 5825251
525.6 5825251 6266908 5192188 4544793 4644370 4834031 4342466 3766187 3272435 2727304 2666562
535.2 2666562 3018210 3288001 3681539 4299479 4826011 5488409 5832380 5268715 4525104 3784551
544.9 3784551 3170243 2875362 2655707 2375291 2534125 3282552 4087707 4510643 4790534 4884985
554.5 4884985 4598658 4557301 4805653 4914615 4380631 3275396 2859905 3101420 3498900 3601724
564.2 3601724 3471316 3660736 3822999 3951949 4487350 4846249 4575639 4289265 4287862 4199781 3860960
574.8 3860960 3187195 2852640 3107098 3414318 3708364 4007597 4147716 4062423 4160675 4652224
584.4 4652224 4795106 4530242 4380759 4213941 3892585 3297506 2869324 3105407 3533603 3816624
594.1C816624m0757m4765L23315M57960L51209p7084l17963m36326k51869n134k36405
604.7C538805j96035j52252Q057K79549M35253M95895J20357P3715Q7347q2075r2564
615.3D516052l62383m19873k77574k07949L803J54150J0102L5014J07319K09873M83088
625.9D251622L19202R7958j26481l68660j54951j834j40364k75099l79669k46221K69393
636.5C244896M02092J68690K06524K36677J13806m6885r6412M3016L8514l33189o01519
647.1C376210l39173L4971J99427J04199M7330J72576K04248L68216L70749J0928r6715
657.7D452966j06904k50124k94669l15011l22970j46223l811J66273L04913L03914
667.4C788354O78164n2437j67555J4180J12345j15210l18537m13976l59245j59359
$$ plain form
594.1 3816624 3775867 3731102 4054417 4512377 4863586 4786502 4468539 4032213 3780344 3775210 3538805
604.7 3538805 3342770 3190518 3198575 3478124 3913377 4409272 4529629 4603344 4690691 4608616 4516052
615.3 4516052 4153669 3733796 3456222 3248273 3252076 3406226 3416328 3451342 3558661 3768534 4251622
625.9 4251622 4570824 4668782 4542301 4173641 4018690 4016856 3876492 3601393 3221724 2975503 3244896
636.5 3244896 3646988 3815678 4022202 4258879 4372685 4325800 4229388 4272404 4310918 3977729 3376210
647.1 3376210 3037037 3072008 3271435 3375634 3422964 3595540 3799788 4168004 4538753 4549681 4452966
657.7 4452966 4346062 4095938 3801269 3486258 3163288 3017065 3013254 3179527 3484440 3788354
667.4 3788354 4466518 4414081 4246526 4260706 4373051 4257841 3939304 3525328 3166083 3006724
677C006724j8368K46402L30309J19170K7504J31771K59695K55886Q534k42980j81429
687.6C943218j27717p4192n5406k45605r4378J37432J24318J36514J76529J83012J98816
698.2D302541J11401K9514L1102j94578l21904k42499j55655j272k3118N926J54258
708.8C695716K09878J99052K12425K33393R9203j08771k85911k55833j28816p3456
718.5C796880l0944o4586r94J24024J90199J49148N2262j6714Q0221K73569J29402
729.1D682467r1267j86002k77087j95000j11679j43157l9970J54882J72097J23054
738.7D088338R3803J39325K37085J65080n0729k01056q0531J3961j13338l07212k71513
749.3C713213R1486K09306K32131K41039J14918J32268L4540l0829j4495j53480k08375
$$ plain form
677 3006724 2988356 3234758 3565067 3684237 3711741 3843512 4103207 4359093 4367627 4124647 3943218
687.6 3943218 3815501 3741309 3685903 3440298 3345920 3483352 3607670 3744184 3920713 4103725 4302541
698.2 4302541 4413942 4443456 4474558 4279980 3958076 3715577 3559922 3558650 3535532 3541458 3695716
708.8 3695716 3905594 4104646 4317071 4550464 4649667 4540896 4254985 3999152 3870336 3796880
718.5 3796880 3765936 3701350 3700356 3824380 4014579 4163727 4215989 4199275 4279496 4553065 4682467
729.1 4682467 4591200 4405198 4128111 3933111 3821432 3678275 3638305 3793187 3965284 4088338
738.7 4088338 4182141 4321466 4558551 4723631 4672902 4471846 4391315 4405276 4291938 3984726 3713213
749.3 3713213 3804699 4014005 4246136 4487175 4602093 4734361 4768901 4738072 4723577 4570097 4361722
760D361722j66679j39383l0887O0054M8274J17049N8279J7274J60895J48823R3775
770.6D729196N2049p5191q7766K2664k5810o9693p9767k14646j20010O6606J87796
781.2D385428K08253J76622K07455Q8073k4707o8415r0228k07942k66000q4917k0066
791.8D303556J37355K42675J04616P2383J23449J81586J06461n1210j80111j71502
801.4D869258j5116N9276M8463o3506j53963j46703L3734K33498K06003J21099l9620
812E152423q348P7605l5016m257p4313k03159j29929j0546K1580l6301l3820j2640
823.6D703279R8532K72474K57568J41251j9837o6344m8961j17505j06472j22609j95613
834.2D795763j10649j9497k6382Q6201J71174N3682K531L1705L8838j1976o8691j35736
$$ plain form
760 4361722 4195043 4055660 4024773 4084827 4133101 4250150 4308429 4325703 4486598 4635421 4729196
770.6 4729196 4781245 4706054 4618288 4640952 4615142 4545449 4465682 4251036 4131026 4197632 4385428
781.2 4385428 4593681 4770303 4977758 5065831 5041124 4972709 4882481 4674539 4408539 4323622 4303556
791.8 4303556 4440911 4683586 4788202 4860585 4984034 5165620 5272081 5220871 5040760 4869258
801.4 4869258 4854142 4913418 4961881 4898375 4744412 4597709 4631443 4864941 5070944 5192043 5152423
812 5152423 5144075 5221680 5186664 5182407 5108094 4904935 4775006 4764460 4786040 4749739 4715919 4703279
823.6 4703279 4801811 5074285 5331853 5473104 5453267 5386923 5337962 5220457 5113985 4991376 4795763
834.2 4795763 4685114 4665617 4639235 4725436 4896610 4950292 4952823 4984528 5023366 5011390 4942699 4806963
845.8D806963k83677k93102j54206k9772L968K0326P4095J06958K01181K03947Q1390
856.4D738071l2289q4909l4973m4189j36507j47791j47661j56810L7487K21335K25500
867D437264J77662P0443P2587J13597J02103P4984l9315j68314j00358O2419O1390
877.6D864462O1174J05538K01680K88214K06918J57419J10694j1372j05461m5811J3767
888.2E847222l2508k3812o0211p0638m783N9624N4940K4450J18791P2056q1957j05567
899.8E797607m3122j4225j09468k29661k86180j66421m707L0178l4343n0190J4194
910.4D903662j6048j4083r722p3501j43186j29133n0203j17052j29869p7010o8728
921D075127m3896J7712L8397k842K8355j2664K5501J56306J18520L1431k4262K0219
$$ plain form
845.8 4806963 4523286 4230184 4075978 4046206 4050174 4070500 4144595 4251553 4452734 4656681 4738071
856.4 4738071 4705782 4620873 4585900 4541711 4405204 4257413 4109752 3952942 3990429 4211764 4437264
867 4437264 4614926 4685369 4757956 4871553 4973656 5048640 5009325 4841011 4740653 4803072 4864462
877.6 4864462 4925636 5031174 5232854 5521068 5727986 5885405 5996099 5984727 5879266 5833455 5847222
888.2 5847222 5814714 5790902 5730691 5660053 5655270 5714894 5769834 5794284 5913075 5985131 5903174 5797607
899.8 5797607 5754485 5740260 5630792 5401131 5114951 4948530 4943823 4974001 4939658 4889468 4903662
910.4 4903662 4887614 4873531 4863809 4790308 4647122 4517989 4467786 4350734 4220865 4143855 4075127
921 4075127 4031231 4048943 4087340 4084498 4112853 4100189 4125690 4281996 4400516 4431947 4407685 4427904
932.6D427904L7750k4909K4111J17110Q1123K0525J08216J93757K67564K27296J0195
943.2E490642o2430j7058N4040K8797p8641m2830K8477M7705m629K1271J50943R6626
954.8E712913o696L9983J05031P0956n2413j65866j74549j16432o0796j8442p1567
965.4E262122j19504r3479n9474J3360n064q1438j23292j26235L7003L8869j53581
976D589287j62802j22670q0892m2603q898N3974k304q9398m8514J6774K1169N570p0424
988.5D058269p7548j7371m3261p7259p1451K023J5642L1378J01416J07386R2937K4204
1000.1D146365N946k0396j9399O2986L5385M678j6809P816N1538K3636M0985J4423
1011.7D337154n3441o1707r8518j27700q5781r9159j08775o9462r5308q8123p3234
$$ plain form
932.6 4427904 4465654 4440745 4464856 4581966 4663089 4683614 4791830 4985587 5253151 5480447 5490642
943.2 5490642 5428212 5411154 5465194 5493991 5415350 5372520 5400997 5448702 5444073 5465344 5616287 5712913
954.8 5712913 5706217 5746200 5851231 5922187 5869774 5703908 5529359 5412927 5352131 5333689 5262122
965.4 5262122 5142618 5049139 4989665 5003025 4997961 4916523 4793231 4666996 4703999 4742868 4589287
976 4589287 4426485 4303815 4222923 4180320 4171422 4225396 4223092 4133694 4085180 4101954 4123123 4128693 4058269
988.5 4058269 3980721 3963350 3920089 3842830 3771379 3773402 3789044 3820422 3921838 4029224 4122161 4146365
1000.1 4146365 4152311 4131915 4112516 4175502 4210887 4215565 4198756 4206572 4258110 4281746 4322731 4337154
1011.7 4337154 4283713 4222006 4123488 3995788 3910007 3810848 3702073 3632611 3537303 3449180 3375946
1022.3C375946o1929l9987n2488n8925m1717l6075o6743n3377n668L1394k7534l7120
1033.8B925777n9836j73691m8108O3211O5179O198k7295O7108P4332Q0655j5517r7734
1045.4B860279o7353l5237K1257j0918k2590k0579L2067L1020r654Q5405J09463M0255
1057C013415l0688L63L3776M0191N0758o3926j32298m8899P0796O6185J7642J441k701
1069.5C016055O8823J51015Q7681m1155J7309N6884Q669N11J6018j6046j21457o7270
1081.1C177037J2491O0053R9415O5831O9137J7627k3032r320L6621K411j04639m8679
1092.7C354953K5235K5599J8734P649l5530p0059m6883M9712P7553m5899n0939n9985
1104.2C250140m4425N2608m6189j38529m6406M7601J5607J6423P0387J00623M137j23015
$$ plain form
1022.3 3375946 3314017 3274030 3221542 3162617 3120900 3084825 3018082 2964705 2959037 2990431 2962897 2925777
1033.8 2925777 2865941 2692250 2644142 2707353 2772532 2778730 2751435 2818543 2892875 2973530 2958013 2860279
1045.4 2860279 2792926 2757689 2778946 2768028 2745438 2724859 2756926 2787946 2778292 2863697 2973160 3013415
1057 3013415 2982727 2983090 3016866 3057057 3107815 3043889 2911591 2862692 2933488 2999673 3017315 3018756 3016055
1069.5 3016055 3084878 3235893 3323574 3282419 3299728 3356612 3365281 3365792 3381810 3365764 3244307 3177037
1081.1 3177037 3189528 3249581 3348996 3414827 3483964 3501591 3478559 3469239 3505860 3508271 3403632 3354953
1092.7 3354953 3380188 3405787 3424521 3432170 3396640 3326581 3279698 3329410 3406963 3361064 3310125 3250140
1104.2 3250140 3205715 3258323 3212134 3073605 3027199 3074800 3090407 3106830 3177217 3277840 3281977 3158962
1115.8C158962r651J03472R2800J0913l3794K2131N9602J18165J35099P9138O0460
1126.4C797297J35542J03443N4943Q3823N3680J19792J49212R5484M4411L4663J07595
1137D779885Q7418K6849N012L0377O7447O0760K9066n033L0799O9383O3091P953m2829
1149.6E210178m1374m2684M908M4828K784j6309K7028N2814N5349K2320j0265K8562
1161.1E338139M0766L5770K4175J6080o305n9258j0005N247q769J2735l3511o191N9374
1173.7E408247N7915L9376k224j4786K1138l0035q9242j5617j4104j34965j53833j1069
1185.3E060801J02766M7253k1679m356R746j5903l4378o9535r8861q0504p4157n4002
1196.8D767191k8898o966p604k6985j2192O472K5918K3160J2630l3872q8040m7818
$$ plain form
1115.8 3158962 3149311 3252783 3345583 3356496 3322702 3344833 3404435 3522600 3657699 3736837 3797297
1126.4 3797297 3932839 4036282 4091225 4175048 4228728 4348520 4497732 4593216 4637627 4672290 4779885
1137 4779885 4867303 4894152 4899164 4929541 4996988 5057748 5086814 5081781 5112580 5181963 5245054 5253007 5210178
1149.6 5210178 5168804 5126120 5131028 5175856 5178640 5162331 5189359 5242173 5297522 5319842 5309577 5338139
1161.1 5338139 5378905 5414675 5438850 5454930 5448625 5389367 5379362 5384609 5375840 5388575 5355064 5348873 5408247
1173.7 5408247 5466162 5505538 5503314 5488528 5509666 5479631 5390389 5374772 5360668 5225703 5071870 5060801
1185.3 5060801 5163567 5210820 5189141 5184785 5194531 5178628 5144250 5074715 4975854 4895350 4821193 4767191
1196.8 4767191 4738293 4731327 4723723 4696738 4684546 4691018 4716936 4740096 4752726 4718854 4630814 4582996
1208.4D582996J7097l151l8734Q39L945L3892P4102K6411j8823n2489K769O3894L7302
1220.9D730050J4230k5836n1133j9617M581J1831K7576J2550K4566N1375K8176J4515
1232.5D822864N412P187J477k1503l1259j3384J1837q917j8645P197N9445P0615O432
1245D898758j5730K6592O4305M9703J0702l0318l9818p175J7084M3202P0060N2482
1256.6E139847m117l975M0825L6621L748K3307L9945p481j9211M927n265l4952l8240
1269.2E175979k5773o415M8758M7292K4921K0307L976J6434p363k4818k8514n1608
1280.7E193176j9941N004o486j6915j1373J1908L8861K9397q649j4114K825J9923j5258
1293.3E208358n0324m589J2317j3475l1186m3109j2775J8767J0100N197J4229K3031
$$ plain form
1208.4 4582996 4600093 4596942 4558208 4559047 4562992 4596884 4670986 4697397 4678574 4626085 4628854 4692748 4730050
1220.9 4730050 4744280 4718444 4667311 4647694 4652275 4664106 4691682 4704232 4728798 4780173 4808349 4822864
1232.5 4822864 4828276 4835463 4836940 4815437 4784178 4770794 4782631 4773714 4755069 4762266 4821711 4892326 4898758
1245 4898758 4883028 4909620 4973925 5023628 5034330 5004012 4964194 4957019 4974103 5017305 5087365 5139847
1256.6 5139847 5135730 5131755 5172580 5209201 5212949 5236256 5276201 5268720 5249509 5254436 5249171 5214219 5175979
1269.2 5175979 5150206 5143791 5192549 5239841 5264762 5285069 5289045 5305479 5298116 5273298 5244784 5193176
1280.7 5193176 5173235 5178239 5171753 5154838 5143465 5155373 5194234 5223631 5214982 5200868 5203693 5223616 5208358
1293.3 5208358 5158034 5153445 5165762 5152287 5121101 5077992 5065217 5083984 5094084 5099281 5113510 5136541
1304.8E136541K3531J0574k0025n0015o3145n8360k4863k1211l7932m2065l3262K6704
1316.4D846472N7250M7707J5747k4639k7552o5889p2014l9178k7667k4588j3375K1786
1328D694060M2209M5354J7051J7052N220k7885p414M574k559k4158j4554j4941j8613
1340.5D715396K0864O804j875R037N7483P2863M3754J5937l5136l1242n411j4235n0761
1353.1D803478m6915J577J1968L4148N2535L8260K1932N0053O1398M3514m3271r4289
1364.6D934388k8862k9004n4574m0718Q143K6059p10J1811L0775P1343M6205k7758
1376.2D947098k3331Q310J6289k2734l5601l4407m0937l3142j6361N974J4429K8068
1387.8D813655k915n417j6775p946J4940l1935o2829p4845o6156l6380k7578l4816
$$ plain form
1304.8 5136541 5160072 5170646 5150621 5100606 5037461 4979101 4954238 4933027 4895095 4853030 4819768 4846472
1316.4 4846472 4903722 4951429 4967176 4942537 4914985 4849096 4777082 4737904 4710237 4685649 4672274 4694060
1328 4694060 4736269 4781623 4798674 4815726 4820946 4793061 4785647 4790221 4787662 4763504 4748950 4734009 4715396
1340.5 4715396 4736260 4743064 4741189 4750226 4807709 4880572 4924326 4940263 4905127 4873885 4868474 4854239 4803478
1353.1 4803478 4756563 4758140 4770108 4804256 4856791 4895051 4916983 4967036 5028434 5071948 5028677 4934388
1364.6 4934388 4905526 4876522 4821948 4781230 4789373 4815432 4814722 4826533 4857308 4928651 4974856 4947098
1376.2 4947098 4923767 4932077 4948366 4925632 4890031 4855624 4814687 4781545 4765184 4771158 4785587 4813655
1387.8 4813655 4810740 4805323 4788548 4780602 4795542 4763607 4700778 4625933 4559777 4523397 4495819 4461003
1399.3D461003k239K5745J1106J3935K2915J091n7993n7719k7413l4498k9793l3212
1410.9D292928m1596j6344K4876K5401k1829P052K1755M1485J0890l4855L5545O794
1422.5D352102l3347j03896l5411O032n944K7398k292K5800O7939O8266M7655R588
1434.1D423890J4668K4636k3559q9408k9625m0093o946L3049L9693O4530M6896M2793
1445.6D500524K0164M4343K1301m1322m7861o8205l3299k9902l658p0647j10694M1536
1457.2D222280M8368R0356M2496O4048R978K4157O1386n958L1945k3586j2951p215
1468.8D545304N0308O8357K2274J06433R0005J37907P1908J75721Q9341K1129O0075
1479.4E438762K6999P4436M5020R7285Q1987M5745P7040P7622J59666J02541K15941
$$ plain form
1399.3 4461003 4458764 4484509 4495615 4509550 4532465 4533556 4475563 4417844 4390431 4355933 4326140 4292928
1410.9 4292928 4251332 4234988 4259864 4285265 4263436 4270488 4292243 4333728 4344618 4309763 4345308 4352102
1422.5 4352102 4318755 4214859 4179448 4185480 4179536 4206934 4204642 4230442 4298381 4366647 4414302 4423890
1434.1 4423890 4438558 4463194 4439635 4350227 4320602 4280509 4273563 4306612 4346305 4410835 4457731 4500524
1445.6 4500524 4520688 4565031 4586332 4545010 4497149 4428944 4395645 4365743 4362085 4291438 4180744 4222280
1457.2 4222280 4270648 4361004 4403500 4467548 4477526 4501683 4563069 4557111 4589056 4565470 4552519 4545304
1468.8 4545304 4595612 4663969 4686243 4792676 4882681 5020588 5092496 5268217 5357558 5378687 5438762
1479.4 5438762 5465761 5540197 5585217 5682502 5764489 5810234 5887274 5964896 6124562 6227103 6443044
1490F443044M1221j8709M5789K4704N9036L2791Q2662l0520n5295M7605P8750J14093
1501.6F865171N2654L3754L4575J57335K97125k5151r1675j63668j3552k5683J2111
1512.2G132996K6294j9530J8133O4475J84280L8417k3392K7023J85957O7661k69706
1522.8G432608l8731l6513m7817k6909j6506O0803R0650O2731L3811O6404R7338K6785
1534.3G704654o8716l3275K171q2918l30900j03919K96757J37349j2934j838N4770
1545G561201Q0864n490j962q00K4264l2066m3027J5636k0179q6537j0375K5891o2624
1557.5G444796j80780K97497R0762L4270o442r34K074l1196n1976n2852j510K682Q038
1570G554429J3391j4272L060J4762M6384J38430N9781j38360p8462m9324l2232j5446
$$ plain form
1490 6443044 6484265 6465556 6511345 6536049 6595085 6627876 6710538 6680018 6624723 6672328 6751078 6865171
1501.6 6865171 6917825 6951579 6986154 7143489 7440614 7415463 7323788 7160120 7146568 7120885 7132996
1512.2 7132996 7159290 7139760 7157893 7222368 7406648 7445065 7421673 7448696 7634653 7702314 7432608
1522.8 7432608 7393877 7357364 7309547 7282638 7266132 7326935 7417585 7480316 7514127 7580531 7677869 7704654
1534.3 7704654 7635938 7602663 7604834 7521916 7191016 7087097 7383854 7521203 7508269 7506431 7561201
1545 7561201 7642065 7636575 7634613 7633813 7658077 7626011 7582984 7598620 7578441 7491904 7481529 7507420 7444796
1557.5 7444796 7264016 7561513 7652275 7686545 7680103 7679169 7681243 7650047 7598071 7545219 7543709 7546391 7554429
1570 7554429 7567820 7553548 7556608 7571370 7617754 7756184 7815965 7677605 7599143 7549819 7517587 7502141
1581.6G502141j703k1444j2254K5911J5580l741j9697j3282J9951J4178j8584l1113
1593.2G455943k8230m0153j7699j8907l0266j7630j6501j2925j5604m013P660N469
1604.7G267144r365k3328k7723m4338n1668o1036m8635o4253n2438J36L3581O6963
1616.3F985040p0297p0769q339l7700p3495m9911n6344j01297k3798k7174j4636k5166
1627.9F426114n2811l3732j4603n441k0531k109M9826l727j72530m8010m5719n5831
1639.5F020896n7459l7646L275j1442K0045L5165K2344N8713q894p2055o3417k7226
1651E882299n6529l53655J39629J37073L7192N791K3188J5844M3033M6788L1992K9405
1662.6E982050m1866M778R326O340K155J103L660N1186Q7436L0045N5382P4056R7355
$$ plain form
1581.6 7502141 7500438 7478994 7466740 7492651 7508231 7504490 7484793 7471511 7491462 7505640 7487056 7455943
1593.2 7455943 7427713 7387560 7369861 7350954 7320688 7303058 7286557 7273632 7258028 7254015 7261675 7267144
1604.7 7267144 7257779 7234451 7206728 7162390 7110722 7049686 7001051 6936798 6884360 6884496 6918077 6985040
1616.3 6985040 6914743 6843974 6835635 6797935 6724440 6674529 6618185 6516888 6493090 6465916 6451280 6426114
1627.9 6426114 6373303 6339571 6324968 6319527 6298996 6296887 6346713 6342986 6170456 6122446 6076727 6020896
1639.5 6020896 5963437 5925791 5929066 5917624 5937669 5972834 5995178 6053891 6044997 5972942 5909525 5882299
1651 5882299 5825770 5472115 5611744 5748817 5786009 5791800 5814988 5830832 5873865 5920653 5952645 5982050
1662.6 5982050 5940184 5944962 5954288 5960628 5962783 5963886 5967546 6018732 6106168 6136213 6191595 6265651 6363006
1675.1F363006J7491N406M3923L4526N2588J0362K609N425l6332J90871L5143K8327
1686.7F753345Q4713J32067P1827J4055r390J5513N5891N3720O1613P2977K4525q088
1698.3G322768N971J09012R4346L0714K9322K5120J5032M7467P7588M183j0110J0516
1709.9G761929J1263K0112M0114M8312P7057K1339N549P7313M7291q459k244o498O008
1722.4H099086L2461J9902Q095Q965J0341L7218M3740O6641M1060K0324M8935P6607
1734H513375p9393o3492J8336J2642J582O869K6578M1176J9189K2122M370J5897L4965
1746.5H574216K1234L6866J5578J3610J7994j9104j6752J6638J9800J8033N5155l067
1758.1H750201k0740k8903J0869P6028K479j411j335J3246K2693L765j4014M21J0532
$$ plain form
1675.1 6363006 6380497 6385903 6429826 6464352 6516940 6527302 6529911 6535336 6499004 6689875 6725018 6753345
1686.7 6753345 6838058 6970125 7041952 7056007 7046617 7062130 7118021 7171741 7233354 7306331 7330856 7322768
1698.3 7322768 7328739 7437751 7532097 7562811 7592133 7617253 7632285 7679752 7757340 7761523 7751413 7761929
1709.9 7761929 7773192 7793304 7833418 7881730 7958787 7980126 7985675 8062988 8110279 8101820 8099576 8093078 8099086
1722.4 8099086 8131547 8151449 8159544 8168509 8178850 8216068 8259808 8326449 8367509 8387833 8436768 8513375
1734 8513375 8433982 8370490 8388826 8401468 8403050 8409919 8436497 8477673 8496862 8518984 8523354 8539251 8574216
1746.5 8574216 8595450 8632316 8647894 8661504 8679498 8660394 8643642 8660280 8680080 8698113 8753268 8750201
1758.1 8750201 8729461 8700558 8711427 8787455 8789934 8788523 8787188 8800434 8823127 8826892 8812878 8813299 8823831
1770.6H823831J8833M0480l7856J0728M0297J9255k714k3539J3186L0410n650j6185
1782.2H911076M185J2695J3331J7396k892K088J78J9072L6601K6224L1142m3430k3884
1794.7I003782R291K3061J0382J2758l10m9558k2659Q630L7785K5075J8048K597r196
1807.3I069686J0098m187R466M148p898j548l449R547Q31J8982K4343J662j1797j1454
1820.8I108430n129j1649Q891K1662j516k3722L7481N7174o957k1021n317p18r434
1833.3I148175p221p775N822K5651J5119R793m9654k1568L7357K1655L9586j5458j8786
1845.8I182696J9683K6909p951j2411J1755L296q054j9598J0471n786k6754N609J8009
1858.4I197874L2237R552k429m756Q60n498j1343L5446J9177k889L619m897P360o195
$$ plain form
1770.6 8823831 8842664 8883144 8845288 8856016 8896313 8915568 8912854 8889315 8902501 8932911 8927261 8911076
1782.2 8911076 8915261 8927956 8941287 8958683 8955791 8957879 8958057 8977129 9013730 9039954 9071096 9027666 9003782
1794.7 9003782 9013073 9036134 9046516 9059274 9058964 9009406 8986747 8995377 9033162 9058237 9076285 9078882 9069686
1807.3 9069686 9079784 9075597 9085063 9089211 9081313 9079765 9076316 9085863 9086694 9105676 9130019 9131681 9119884 9108430
1820.8 9108430 9103301 9091652 9100543 9122205 9120689 9096967 9134448 9191622 9184665 9163644 9158327 9157609 9148175
1833.3 9148175 9140954 9133179 9139001 9164652 9179771 9189564 9139910 9118342 9155699 9177354 9216940 9201482 9182696
1845.8 9182696 9202379 9229288 9221337 9208926 9220681 9223977 9215923 9196325 9206796 9201010 9174256 9179865 9197874
1858.4 9197874 9230111 9239663 9237234 9232478 9233338 9227840 9216497 9251943 9271120 9268231 9271850 9266953 9274313 9268118
1871.9I268118j1738l931j1725r513K2831R339o1N982J664J6616q880j7180j3988j7222
1885.4I230312l807R120Q353L568L2909N378Q941R862j250L1400o421l6625k5509o991
1898.9I259240r091j4023M270J481R621J7627J2887j0749o351P733k099O612q817m989
1912.4I263352K390J3640J3318r949L531j0541j9451k25Q748K0676K3795q841k9171
1924.9I271272j6556n828J1879J5491J4663q984k8480L899J1894P229p791o133p84
1937.5I261771j8378j4721l319J9742J8670L397m307n342K848L31o972k0831j4799
1950I218090j0483Q687J2055o704k086j5400J931Q133J508k788k1435M12J7119J1557
1963.5I220596L044J0079J056q102p178j3883m029j8679O912L1976K127j3978J39Q218
$$ plain form
1871.9 9268118 9256380 9252449 9240724 9231211 9254042 9263381 9263320 9269302 9270966 9287582 9278702 9261522 9247534 9230312
1885.4 9230312 9226505 9235625 9243978 9247546 9280455 9285833 9294774 9304636 9303386 9334786 9328365 9291740 9266231 9259240
1898.9 9259240 9250149 9236126 9240396 9241877 9251498 9269125 9282012 9271263 9264912 9272645 9270546 9277158 9268341 9263352
1912.4 9263352 9265742 9279382 9292700 9282751 9286282 9275741 9256290 9256065 9264813 9285489 9309284 9300443 9271272
1924.9 9271272 9254716 9248888 9260767 9276258 9290921 9281937 9253457 9257356 9269250 9276479 9268688 9262555 9261771
1937.5 9261771 9243393 9228672 9225353 9245095 9263765 9267162 9262855 9257513 9260361 9260692 9253720 9232889 9218090
1950 9218090 9207607 9216294 9228349 9221645 9219559 9204159 9206090 9214223 9215731 9212943 9191508 9191920 9209039 9220596
1963.5 9220596 9223640 9233719 9234775 9226673 9219495 9205612 9201583 9182904 9189816 9221792 9223919 9209941 9210080 9218298
1977I218298j2751K823L320J87L583J0219K7555j3776j9918r111N582M701l1043j0416
1990.5I179253O411J4871J68M36J2070J4637K5340M029q951k1048j9942r528O343R5
2004I204184k1935R912K440j895K2159J1936K63J509p594k8923p206J255K365L441
2017.5I191911j3811j4305j7108Q860O906k0417k0790J825K1481J0166L594j3511j9724
2030I125077k9429k0580J1668o476k8979j7426K8559L2824P530N125p036j7250k5464
2042.6I058143p622j0145k8864j5146K963J3813O582N266J2151R848j210m314o977
2055.1I034488j9499k5020k1533j1818j2339O888J1806m597L794J5075N551r495R544
2067.6H982845q664j0157J5252k3731k2580n633k1917k3393j070O083J9925M3763J3864
$$ plain form
1977 9218298 9205547 9208370 9211690 9211877 9215460 9225679 9253234 9239458 9219540 9210429 9216011 9220712 9189669 9179253
1990.5 9179253 9185664 9200535 9200703 9201139 9213209 9227846 9253186 9257215 9248264 9227216 9207274 9197746 9204089 9204184
2004 9204184 9182249 9192161 9194601 9192706 9214865 9226801 9227064 9228573 9220979 9192056 9184850 9186105 9188470 9191911
2017.5 9191911 9178100 9163795 9146687 9155547 9162453 9142036 9121246 9123071 9144552 9154718 9158312 9144801 9125077
2030 9125077 9095648 9075068 9086736 9080260 9051281 9033855 9062414 9095238 9102768 9107893 9100857 9083607 9058143
2042.6 9058143 9050521 9040376 9011512 8996366 8999329 9013142 9019724 9024990 9037141 9046989 9045779 9041465 9034488
2055.1 9034488 9014989 8989969 8968436 8956618 8944279 8951167 8962973 8958376 8962170 8977245 8982796 8973301 8982845
2067.6 8982845 8974181 8964024 8979276 8955545 8932965 8927332 8905415 8882022 8880952 8887035 8906960 8950723 8964587
2080.2H964587O246o841k2525j1403k3749j5378j4987k5072m962K5424J9181N681Q603
2092.7H904805J4889J7044j6364j1793j4955k8685j1011m943J8581R589p372O9J6145
2105.2H885999R182j3886r413j7683j112R710J2202L163k0061o865n647N924n445j4232
2118.7H831836K434M291J0082m511m817J363N330r937k1234j338J1358J4341j3787
2131.3H825411o618O276K762p656l6239j6633Q4K6963L3321j363o939l305q493q742
2144.8H798829P108r511M457R129k0561l333j0519L621Q694j3263M093L2160L6095
2157.3H846999r303k9234j9663M006N667k0883j6904o507K2370K7984J6938K2769J8741
2169.9H862980l314l4307j3681J758k4511k7877j1191N846J4630K02K987L9512L7833
$$ plain form
2080.2 8964587 8970833 8963992 8941467 8930064 8906315 8890937 8875950 8850878 8845916 8871340 8890521 8896202 8904805
2092.7 8904805 8919694 8936738 8920374 8908581 8893626 8864941 8853930 8848987 8867568 8877157 8869785 8869854 8885999
2105.2 8885999 8895181 8881295 8871882 8854199 8853087 8862797 8874999 8878162 8858101 8851236 8845589 8851513 8846068 8831836
2118.7 8831836 8834270 8838561 8848643 8844132 8839315 8840678 8846008 8836071 8814837 8813499 8824857 8839198 8825411
2131.3 8825411 8818793 8825069 8827831 8820175 8783936 8767303 8767387 8794350 8827671 8826308 8819369 8816064 8807571 8798829
2144.8 8798829 8805937 8796426 8800883 8810012 8789451 8786118 8775599 8779220 8787914 8774651 8778744 8810904 8846999
2157.3 8846999 8837696 8808462 8788799 8792805 8798472 8777589 8760685 8754178 8776548 8804532 8821470 8844239 8862980
2169.9 8862980 8859666 8825359 8811678 8813436 8788925 8761048 8749857 8755703 8770333 8770535 8773522 8813034 8850867
2182.4H850867J447j5732N644J4104k1424m2742k7547o763N137L5186K9826Q527O066
2194.9H842596j7706j0454P997J4647L354p835l552k816r40k2881n836P057n683J5269
2208.4H813217K1039N675k0808j4409j767J859l225k0353P102J7390N499p875j0813
2221H792531J0976O387j7323p082K2787L012j312P806j858J218j1786o158j143O449
2234.5H804504R442j0226j24J0862P107j545o149j0889K327J0217j5444j9912q467
2247H771703J3246K2667M018p810L841J0411J129L701M403O835k2395l5149R21J17
2260.5H777638j5249q809J7328J9877J1688M561j1641r219j3445L294J0082J088l672
2273H783521k2196j8755r391J0617J4420J841M485k53q968j0307N010J725j9918k3140
$$ plain form
2182.4 8850867 8852314 8836582 8842226 8856330 8834906 8792164 8764617 8757854 8762991 8798177 8828003 8836530 8842596
2194.9 8842596 8824890 8814436 8822433 8837080 8840434 8832599 8829047 8826231 8825291 8802410 8796574 8803631 8797948 8813217
2208.4 8813217 8834256 8839931 8819123 8804714 8802947 8804806 8801581 8781228 8788330 8805720 8811219 8803344 8792531
2221 8792531 8803507 8809894 8792571 8785489 8808276 8811288 8809976 8817782 8815924 8817142 8805356 8799198 8798055 8804504
2234.5 8804504 8813946 8803720 8803596 8814458 8821565 8820020 8813871 8802982 8805309 8815526 8800082 8780170 8771703
2247 8771703 8784949 8807616 8811634 8803824 8807665 8818076 8819205 8822906 8827309 8834144 8811749 8776600 8777521 8777638
2260.5 8777638 8762389 8753580 8770908 8790785 8802473 8807034 8795393 8786174 8772729 8776023 8786105 8787193 8783521
2273 8783521 8761325 8742570 8733179 8743796 8758216 8760057 8764542 8764289 8755321 8745014 8750024 8751749 8731831 8708691
2286.5H708691l330j23j1774j2621j0373J9295J7661L281J7160P079j4118l0735j4696
2299.1H675397O382n799k6437k2299J97K8058L7919j6648l5353o488L664K799j0255
2311.6H631137j2346q833r99j4097n500Q975k745j6505l9773j069O222K1446O1982
2324.2H627895J0213l3362m2131m0293n3211j9747J069j0232n711l9869J158L0320
2335.7H426099K1590J2251J8868L1977K3807J0085m2385l6977l3177j7599J4917L7434
2347.3H466890K8132j4079J1456J0200r343j5187m0110k0775m0216K6131N1640m064
2358.9H450675m0783k2878j9115r0590l9692K3320J33359R0610j7536O5j3752r305
2370.4H444378n4541k0798K9484r833j8149L0846M3123o89K3103J5748j484o84k0620
$$ plain form
2286.5 8708691 8705361 8705238 8693464 8680843 8670470 8689765 8707426 8710707 8727867 8734946 8720828 8690093 8675397
2299.1 8675397 8681779 8675980 8649543 8627244 8627441 8655499 8693418 8676770 8641417 8634929 8638593 8641392 8631137
2311.6 8631137 8618791 8609958 8608959 8594862 8589362 8598337 8595592 8579087 8539314 8538245 8544467 8565913 8627895
2324.2 8627895 8638108 8604746 8562615 8522322 8469111 8449364 8450433 8440201 8434490 8394621 8395779 8426099
2335.7 8426099 8447689 8459940 8478808 8510785 8534592 8544677 8502292 8465315 8432138 8414539 8429456 8466890
2347.3 8466890 8495022 8480943 8492399 8502599 8493256 8478069 8437959 8417184 8376968 8403099 8454739 8450675
2358.9 8450675 8409892 8387014 8367899 8277309 8237617 8260937 8394296 8484906 8467370 8467435 8453683 8444378
2370.4 8444378 8389837 8369039 8398523 8388690 8370541 8401387 8444510 8443821 8466924 8482672 8481188 8480504 8459884
2383H459884Q666L800j1383Q032m958k7317j0876L464M761K0625m90j4490j2489J411
2396.5H428640J7442N285J3309j5429k8943n203p87j2662l7364k863J9837J2225Q984
2409H402471l665L213j3916j5700J828q962j4614j1234p491j0968q325J0766J3699
2421.6H337102l688j5775k0804p339J894r961p534n217o332O823O786j7528k6680j6735
2435.1H215012N369K2424J223j1549p724o531j837N107m672k9351k1867j1248j041
2447.6H153315K882n968m746j5803o407N744j759L559K0151l812m3032k3168j3332
2460.1H067624n599l887k4923O222K8921Q605p178j0328j0187N002L592j8794j4365
2472.7H024705j9665k8082j2075P793K725L938J1475m809j63q346l967N755q717p866
$$ plain form
2383 8459884 8468550 8472350 8460967 8468999 8464041 8436724 8425848 8429312 8434073 8454698 8454208 8439718 8427229 8428640
2396.5 8428640 8446082 8451367 8464676 8449247 8420304 8415101 8414314 8401652 8364288 8361425 8381262 8393487 8402471
2409 8402471 8398806 8402019 8388103 8372403 8374231 8365269 8350655 8339421 8331930 8320962 8312637 8323403 8337102
2421.6 8337102 8333414 8317639 8296835 8289496 8291390 8281429 8273895 8268678 8262346 8269169 8275955 8258427 8231747 8215012
2435.1 8215012 8220381 8242805 8244028 8232479 8224755 8218224 8216387 8221494 8216822 8187471 8165604 8154356 8153315
2447.6 8153315 8156197 8150229 8145483 8129680 8123273 8129017 8127258 8130817 8150968 8147156 8104124 8080956 8067624
2460.1 8067624 8062025 8058138 8033215 8039437 8068358 8076963 8069785 8059457 8049270 8054272 8057864 8039070 8024705
2472.7 8024705 8005040 7976958 7964883 7972676 7975401 7979339 7990814 7986005 7985842 7977496 7973529 7979284 7970567 7962701
2486.2G962701k4958j1095M209p237j1528j7366P83o558j1529J4226J2463n372r011
2498.7G889728K315Q3k0851l3258j6031K568J0231J6988m66j4492O118Q011r108L216
2512.2G845052n168k7935l2274j2138J8263k403l277J3615m515p363N698N727j6972
2524.7G776310k8096k4249R420K2099j3663k890Q426j552j0748o726J7590K41j8344
2537.3G727818j714M539j2446j5923l153m455j0042k475J6746K2463r523m2719q113
2549.8G661003K5996J5214O137j6137k1861k1724j9484K03J5235K0201K179k67o396
2562.4G660299j7025j1736j4708j1848j0590Q057J3315j2452j1530M525J210j0215
2573.9G587302q809j7982k5971j0944L88o681K994K2412L152j1935n779j704k1042
$$ plain form
2486.2 7962701 7937743 7926648 7930857 7923620 7912092 7894726 7895509 7888951 7877422 7891648 7904111 7898739 7889728
2498.7 7889728 7892043 7892126 7871275 7838017 7821986 7824554 7834785 7851773 7851307 7836815 7842933 7850944 7841836 7845052
2512.2 7845052 7839884 7811949 7779675 7767537 7785800 7783397 7780120 7793735 7789220 7781857 7787555 7793282 7776310
2524.7 7776310 7748214 7723965 7733385 7755484 7741821 7738931 7747357 7745805 7735057 7728331 7745921 7746162 7727818
2537.3 7727818 7726104 7730643 7718197 7702274 7699121 7694666 7684624 7682149 7698895 7721358 7711835 7669116 7661003
2549.8 7661003 7686999 7702213 7708350 7692213 7670352 7648628 7629144 7629347 7644582 7664783 7666962 7666695 7660299
2562.4 7660299 7643274 7631538 7616830 7604982 7594392 7602449 7615764 7603312 7591782 7596307 7597517 7587302
2573.9 7587302 7578493 7560511 7534540 7523596 7523984 7517303 7520297 7542709 7545861 7533926 7528147 7526443 7505401
2586.5G505401l6915j4371o711q692m417K935p452k7828j8579m066J4160J780j6901
2599G378344j4677k3397n906o97j2702j2058k0935k1658k3686k5607j2679j083M590
2611.5G207849q560k3534q716o994l1806n1529l8500P647P712k4532j9297r99k321
2624.1G006420p842m503j6595j8679j8577l8655k4883K035j174k1879k4269J53L411
2636.6F834963j513j196l1550m0841j6187j6611j5811J698o77l1284l2463J4885J0912
2649.1F674325l9292l1713l764l729P242O883n167j4836l1171j4745q413j5092K060
2661.7F522588N86j3989j2798j536l081R178O958k3084j5862j3166j9444j8108j2478
2674.2F405764J360J917J510r361j1872n2M100p50o479k7j7551k9719k239M362j4054
$$ plain form
2586.5 7505401 7468486 7454115 7447404 7438712 7434295 7437230 7429778 7401950 7383371 7379305 7393465 7395245 7378344
2599 7378344 7363667 7340270 7334364 7333667 7320965 7308907 7287972 7266314 7242628 7217021 7204342 7203259 7207849
2611.5 7207849 7199289 7175755 7167039 7160045 7128239 7076710 7038210 7045857 7053569 7029037 7009740 7008741 7006420
2624.1 7006420 6998578 6994075 6977480 6958801 6940224 6901569 6876686 6878721 6877547 6855668 6831399 6831552 6834963
2636.6 6834963 6833450 6832254 6800704 6759863 6743676 6727065 6711254 6712952 6712275 6680991 6648528 6663413 6674325
2649.1 6674325 6635033 6603320 6599556 6595827 6603069 6609952 6604785 6589949 6558778 6544033 6535620 6520528 6522588
2661.7 6522588 6523174 6509185 6496387 6494851 6491770 6500948 6507906 6484822 6468960 6455794 6436350 6418242 6405764
2674.2 6405764 6407124 6409041 6410551 6401190 6389318 6389266 6393366 6392616 6386137 6386110 6368559 6338840 6336601 6340963 6326909
2688.7F326909n150l84j6259q371n300l329N888l975j2038j2437j1547k834R639m136
2702.2F256676k5447l2959k7972k689M227q757p628N607J527n804p832k1081k1927
2714.7F105941j4685r053k2497k3806j1000j3794K622P84q040j3307j4047o05j7408
2727.3E961105j8599r316q544k5028l8932J853J8949l985k1390j6665p666n465J309
2739.8E827626j1821j3957j0322j7749k4691k0860R96j2871k8744l303P465j021L236
2752.3E693984n87j3202j6310k2636j1657n32j8079l7579k8834N053J5512N804m16
2764.9E570521j1460k4133k0369j241j683k3643l5665k2167j5618j6792j0790j4105
2776.4E372855K19L013k1172k2642j8110k2230j9810q966M966J3738l388k2290k6440
$$ plain form
2688.7 6326909 6321759 6321375 6305116 6296745 6291445 6288116 6294004 6290029 6277991 6265554 6254007 6251173 6260812 6256676
2702.2 6256676 6231229 6198270 6170298 6167609 6171836 6163079 6155451 6161058 6162585 6156781 6148949 6127868 6105941
2714.7 6105941 6091256 6082203 6059706 6035900 6024900 6011106 6013728 6014512 6006472 5993165 5979118 5978513 5961105
2727.3 5961105 5942506 5933190 5924646 5899618 5860686 5862539 5881488 5877503 5856113 5839448 5831782 5826317 5827626
2739.8 5827626 5815805 5801848 5791526 5773777 5749086 5728226 5729222 5716351 5687607 5684304 5691769 5690748 5693984
2752.3 5693984 5693397 5680195 5663885 5641249 5629592 5629060 5610981 5573402 5544568 5549621 5565133 5570937 5570521
2764.9 5570521 5559061 5534928 5514559 5513318 5511635 5487992 5452327 5430160 5414542 5397750 5386960 5372855
2776.4 5372855 5373074 5376087 5354915 5332273 5314163 5291933 5272123 5263157 5268123 5281861 5278473 5256183 5229743
2789E229743m0698k6009j2436k0739o931j2415j2370l222j3393k121q137l1180l5187
2801.5E004905k9437j3714j4461j8714j2250j4281r192o10j5686l8772l9782k6998
2813.1D771008j2849r327q144k73j6546l1671k4760l1289l5065j9833j6011j9808j1878
2825.6D533554j2765j6223q024k0552l7258k1583j8115m2100l6976q305j911j2788
2837.2D296954j6454n625k50k1857m1414l8444k7433j8794k7086k5092J295K1258J1004
2849.7D108062k4561l1562k1934l0316k6123l056j2930l7631j4098j2301k4472k5550
2861.3C843528m2388k8298k7956k0457L762L248J1794r523l6712l3233k1597k4450
2872.9C617718l9494l1170p715J0895k360j1170l805N114Q185j2857J711n476l1266
$$ plain form
2789 5229743 5189045 5163036 5150600 5129861 5122930 5110515 5098145 5094923 5081530 5079409 5071272 5040092 5004905
2801.5 5004905 4975468 4961754 4947293 4928579 4916329 4902048 4892856 4892246 4876560 4837788 4798006 4771008
2813.1 4771008 4758159 4748832 4740688 4740415 4723869 4692198 4667438 4636149 4601084 4581251 4565240 4545432 4533554
2825.6 4533554 4520789 4504566 4496542 4475990 4438732 4417149 4399034 4356934 4319958 4311653 4309742 4296954
2837.2 4296954 4280500 4274875 4274625 4252768 4211354 4172910 4145477 4126683 4099597 4074505 4075800 4097058 4108062
2849.7 4108062 4083501 4051939 4030005 3999689 3973566 3970510 3957580 3919949 3905851 3893550 3869078 3843528
2861.3 3843528 3801140 3772842 3744886 3724429 3728191 3731439 3743233 3733710 3696998 3663765 3642168 3617718
2872.9 3617718 3578224 3547054 3539339 3550234 3547874 3536704 3532899 3538013 3546198 3533341 3535052 3529576 3498310
2885.4C498310n862J1041J8864Q063J290K4493K5658J1708J5464K008j5903J4716J9227
2897.9C629077M355Q514J0859J6582M355k334j0611q30J3266K172N544l991n422r70
2911.4C670566O01j1089l0285m165O205k464j8701l1550k1427r619Q958p771j9331
2924C529928j8097l2381l0286l3013j3473P262m581K714J8890N596j9415k7289j8826
2936.5C367029o825l96l355J420J6297R960J460L59l409O083O422M705N763J3635L6154
2951C455302K6487K436Q529J6076R72L680K0488J4565j906l210J7403L4152N3617N4187
2964.5C702778K1247O609K6462N1314L7084J4486J4086L0719M5435K5350J6111K7103
2976.1D018784K4332K5922L2999K5916L3269L9347K1915J6008N598J4910K5661K172
$$ plain form
2885.4 3498310 3492448 3503489 3522353 3530416 3531706 3556199 3581857 3593565 3609029 3611037 3595134 3609850 3629077
2897.9 3629077 3633432 3641946 3652805 3669387 3673742 3671408 3660797 3659967 3673233 3675405 3680949 3676958 3671536 3670566
2911.4 3670566 3671167 3660078 3629793 3625628 3631833 3629369 3610668 3579118 3557691 3548072 3557030 3549259 3529928
2924 3529928 3511831 3479450 3449164 3416151 3402678 3409940 3405359 3408073 3426963 3432559 3413144 3385855 3367029
2936.5 3367029 3360204 3359808 3356453 3357873 3374170 3384130 3385590 3385949 3382540 3388623 3395045 3399750 3405513 3419148 3455302
2951 3455302 3481789 3484225 3492754 3508830 3509802 3513482 3533970 3548535 3546629 3543419 3560822 3594974 3648591 3702778
2964.5 3702778 3724025 3730634 3757096 3808410 3845494 3859980 3874066 3904785 3950220 3975570 3991681 4018784
2976.1 4018784 4043116 4069038 4102037 4127953 4161222 4200569 4222484 4238492 4244090 4259000 4284661 4286833
2987.6D286833j1117r735N464J3961K2167K4449Q490R903Q176n659j1257l886p225
3000.2D330564j6750r922k889r329j6610l874J17K150Q58j0044J150k469j7576j5811
3013.7D229565m428l651k1254k4368l238L873j9452j3769J354j2756k3135j2026M517
3026.2D101232j3466k0424j1176q948Q380r08k2600k5666k4548j1332m515k0499k0140
3038.7C925390N25Q272l515j6165n833j4450k6486k1509k8850k0824K062K2092j203
3051.3C819506k5660q362K719L666k7267l8422j6419l939L340j0602l650r707l0231
3063.8C654972j1155n929j8484j2687l185l5R478j845k0482j5440k4140j9822N668
3076.4C536914r970l0941k0156m207J8710O675j4158k602k0764l7971k7045j168J3309
$$ plain form
2987.6 4286833 4275716 4265981 4271445 4285406 4307573 4332022 4340512 4350415 4358591 4352932 4341675 4337789 4330564
3000.2 4330564 4313814 4303892 4301003 4291674 4275064 4271190 4271307 4273457 4274315 4264271 4265421 4262952 4245376 4229565
3013.7 4229565 4225137 4221486 4200232 4175864 4172626 4176499 4157047 4143278 4144632 4131876 4108741 4096715 4101232
3026.2 4101232 4087766 4067342 4056166 4047218 4055598 4054690 4032090 4006424 3981876 3970544 3966029 3945530 3925390
3038.7 3925390 3925915 3934187 3930672 3914507 3908674 3894224 3867738 3846229 3817379 3796555 3798617 3820709 3819506
3051.3 3819506 3793846 3785484 3788203 3791869 3764602 3726180 3709761 3705822 3709162 3698560 3694910 3685203 3654972
3063.8 3654972 3643817 3637888 3619404 3606717 3603532 3603497 3612975 3611130 3590648 3575208 3551068 3531246 3536914
3076.4 3536914 3526944 3496003 3475847 3471640 3490350 3497025 3482867 3480265 3459501 3421530 3394485 3393317 3406626
3088.9C406626L31j081r973j9112p763M14r730j5766k2377k9369O409J7777M99q017
3102.4C308868r950J4969J608k3221j6448j4705j9887k6478j0696P937K334q85l123
3114.9C210323p885J1350P870l4209m7617k2314J0151J9871J5437N058j7395k6090
3126.5C124550q985Q016l608j6268k4288j6421K196l66M200K429k703n444j1076r229
3140C043003m801L05r979r504o131L706J3053j1740j4078j6025k7362m295J1645n35
3153.5B967262n80J3306Q198J171l95j3445l0589k1946n328K755J4741N097N16L753
3167B944516k01K914q202k9043k8114Q0J6761O855j9585j0999J8811J4844J4877l429
3180.5B920085k3745k2155j1457L191m373l794L06R858p928k2351J0504J4600J2479
$$ plain form
3088.9 3406626 3406957 3405876 3395903 3376791 3369028 3369442 3359712 3343946 3321569 3292200 3298609 3316386 3316885 3308868
3102.4 3308868 3298918 3313887 3315495 3292274 3275826 3261121 3241234 3214756 3204060 3211997 3214331 3213446 3210323
3114.9 3210323 3202438 3213788 3221658 3187449 3139832 3117518 3127669 3147540 3162977 3168035 3150640 3124550
3126.5 3124550 3115565 3123581 3119973 3103705 3079417 3062996 3065192 3064826 3069026 3071455 3068752 3063308 3052232 3043003
3140 3043003 3038202 3038507 3028528 3019024 3012893 3016599 3029652 3017912 3003834 2987809 2960447 2956152 2967797 2967262
3153.5 2967262 2966682 2979988 2988186 2989357 2988962 2975517 2944928 2922982 2917654 2920409 2935150 2940247 2940763 2944516
3167 2944516 2944315 2947229 2939027 2909984 2881870 2881950 2898711 2905566 2885981 2874982 2893793 2908637 2923514 2920085
3180.5 2920085 2896340 2874185 2862728 2865919 2861546 2857752 2858058 2867916 2859988 2837637 2848141 2862741 2875220
3193B875220j2790l3572j4693m485P122m28K569Q125k667N856J1310l260j1084k494
3206.5B824729q446q49P438K287K386j8527j6367p017j4079n51J0927J4617R843O22
3220B807013M626j1578k4395M344K285k0722j6711N733K4960O725j232L440m802l383
3233.5B776303J432q65k227M068n017p511n134n877l517r000N728N323q076j3612p768
3248B724250K0597K2280J2263o00j6098j2453P407R498j6389k0656q117P719N749k208
3261.5B733242J3623K797k5257p109K6310Q802p462k468N630Q633j0816k1556k8787
3274B695582O394K6884o872j0966n000Q124J712p742J961N071J3924Q845J6204r711
3287.5B744410l7943j4859p127J9923K5100L379J3919J3545L167j4203k8554k0353
$$ plain form
3193 2875220 2862430 2828858 2814165 2809680 2816802 2816374 2818943 2827068 2824401 2830257 2841567 2838307 2827223 2824729
3206.5 2824729 2816283 2815434 2822872 2825159 2827545 2809018 2792651 2785634 2771555 2771004 2781931 2796548 2806391 2807013
3220 2807013 2811639 2800061 2775666 2780010 2782295 2761573 2744862 2750595 2775555 2782280 2781048 2784488 2779686 2776303
3233.5 2776303 2777735 2776870 2774643 2778711 2773694 2766183 2761049 2755172 2751655 2742655 2748383 2753706 2745630 2732018 2724250
3248 2724250 2744847 2767127 2779390 2778790 2762692 2750239 2757646 2767144 2750755 2730099 2721982 2729701 2735450 2733242
3261.5 2733242 2746865 2749662 2724405 2717296 2743606 2752408 2744946 2742478 2748108 2756741 2745925 2724369 2695582
3274 2695582 2701976 2728860 2721988 2711022 2706022 2714146 2715858 2708116 2710077 2715148 2729072 2737917 2754121 2744410
3287.5 2744410 2706467 2691608 2684481 2704404 2729504 2732883 2746802 2760347 2763514 2749311 2720757 2700404
3299.1B700404j7395q740K1652K6315M184q734l159J5654P384k0895k0794L170J2735
3311.7B711781M665o394j2970O454K3331J1111k70m724k2712k5644J765L866j1850
3324.2B678409p553J4837L2265K1225M656j4879k3653o784N72j111l478n649N2L278
3337.7B692187Q318J5209N524q431j669R459K742N32m57r728n779K204J904q156o970
3352.2B696889N249k240j5131j0729P652K7474L0538o306j6702J669j6818q961o387
3364.7B686197k0695j1219R873M3321K7467L672m170m965J1611j0021k4940j4088q651
3377.2B683392m272J0408K2551J9242L274k3949k898J7750M475j0305j6934J8135K8319
3389.8B749188J3451j3934l1375k15r401k2954j4320m647J8368J9975K1043K1756P96
$$ plain form
3299.1 2700404 2683009 2674269 2695921 2722236 2726420 2717686 2714527 2730181 2737565 2716670 2695876 2699046 2711781
3311.7 2711781 2716446 2710052 2697082 2703536 2726867 2737978 2737708 2732984 2710272 2684628 2686393 2690259 2678409
3324.2 2678409 2670856 2685693 2717958 2739183 2743839 2728960 2705307 2698523 2699095 2697984 2694506 2688857 2688909 2692187
3337.7 2692187 2700505 2715714 2721238 2712807 2711138 2720597 2723339 2723871 2723414 2713686 2707907 2710111 2712015 2703859 2696889
3352.2 2696889 2702138 2699898 2684767 2674038 2681690 2709164 2739702 2733396 2716694 2718363 2701545 2692584 2686197
3364.7 2686197 2665502 2654283 2664156 2707477 2734944 2738616 2734446 2729481 2741092 2731071 2706131 2692043 2683392
3377.2 2683392 2679120 2689528 2712079 2731321 2734595 2710646 2707748 2725498 2729973 2719668 2702734 2720869 2749188
3389.8 2749188 2762639 2748705 2717330 2717115 2707714 2684760 2670440 2665793 2684161 2704136 2725179 2746935 2747731
3402.3B747731o445Q80j4707k1635j0244O889K3131J2140R944N783r568l801R68L05
3415.8B741371J459J532l936L997J9956L628k2801j9398L96j0289k4200J121J8522
3428.3B711358P429Q650K8738M2100K6683o962k2339l0750l5169k0436l96J1919J7716
3440.9B738541J5950J3173J4336j586K25K2647L382k6036k6635n778Q642O540P195
3453.4B770596J0607J3335J1350K0248J666o336Q955j8574j7518R465P894p671j1356
3466B792661M24l087k543J6008L6337K7151O740j1551j8338N241R42j844M493k9676
3479.5B822958l9722Q769L2590J6613K1543K9148K3659J3063Q432j6233k5653k643
3491B892524j8654j0659K869o341J449N345K3448J2416K3677L8986L841k537r166L36
$$ plain form
3402.3 2747731 2741286 2742166 2727459 2705824 2695580 2702469 2725600 2737740 2747684 2753467 2743899 2740098 2741066 2741371
3415.8 2741371 2742830 2744362 2740426 2744423 2764379 2768007 2745206 2725808 2726204 2715915 2691715 2692836 2711358
3428.3 2711358 2718787 2727437 2756175 2798275 2824958 2817996 2795657 2764907 2729738 2709302 2708906 2720825 2738541
3440.9 2738541 2754491 2767664 2782000 2780414 2780639 2803286 2806668 2780632 2753997 2748219 2756861 2763401 2770596
3453.4 2770596 2781203 2794538 2805888 2826136 2827802 2821466 2830421 2811847 2794329 2803794 2811688 2804017 2792661
3466 2792661 2793085 2789998 2787455 2803463 2839800 2866951 2873691 2862140 2843802 2849043 2849985 2848141 2852634 2822958
3479.5 2822958 2783236 2792005 2824595 2841208 2862751 2891899 2915558 2928621 2937053 2920820 2895167 2892524
3491 2892524 2873870 2863211 2866080 2859739 2861188 2866533 2889981 2902397 2926074 2965060 2968901 2966364 2957198 2957534
3504.5B957534K4333M133k8197j1264R680J0682L2125J3672M993J4706Q417J0420J6395
3517.1C067629L0421n080l8591j2861J7393J4263P146K6904J7631K3413K5834O481
3528.6C180583q976K212J9632m876J6894J2020o037K2218Q086Q856P123J6175L3766
3541.2C307676K2336K0071N225K894J7983K1667K2615J9136K111J1581L3099J7044
3552.7C503438R337j0089J9933P1484M6295J2354J1217K4786K6041J4624R796K6958
3564.3C766174M0367L1043K8100q6K2500M7410L1908L0301M6189M7509J2143n795k106
3576.9D095657J7587M5665M2383L7687L6483N2665N6082M1797N0252M4859Q794K7911
3588.4D557822L7625K3073K7121M1728M4769K5628L9365N3455M2499M9338L9610N2098
$$ plain form
3504.5 2957534 2981867 2986000 2957803 2946539 2956219 2966901 2999026 3012698 3017691 3032397 3040814 3051234 3067629
3517.1 3067629 3098050 3092970 3054379 3041518 3058911 3073174 3080320 3107224 3124855 3148268 3174102 3180583
3528.6 3180583 3171607 3173819 3193451 3188575 3205469 3217489 3211452 3233670 3241756 3250612 3257735 3273910 3307676
3541.2 3307676 3330012 3350083 3355308 3358202 3376185 3397852 3420467 3439603 3441714 3453295 3486394 3503438
3552.7 3503438 3512775 3502686 3522619 3594103 3640398 3652752 3663969 3688755 3714796 3729420 3739216 3766174
3564.3 3766174 3806541 3837584 3865684 3865598 3888098 3935508 3967416 3997717 4043906 4091415 4103558 4097763 4095657
3576.9 4095657 4113244 4158909 4201292 4238979 4275462 4328127 4384209 4426006 4476258 4521117 4529911 4557822
3588.4 4557822 4595447 4618520 4645641 4687369 4732138 4757766 4797131 4850586 4893085 4942423 4982033 5034131
3600E034131O9616N8040L7027K4776L7417L9243M9925M8730N4799L3887K4895P1325
3611.6E583811N7356O8038J10427P5156L5828N9012M1899P23N5826L3488O658J7581
3623.1F145803N8913J06657R4486Q4937R8306J60642l4307l4390K7466K4341N8329
3633.8F791183M7363L8733N8156O5722O5252M7859M0474M3398Q9062P1790L9370L9865
3645.3G438227P0275J57593J8725L0977J09057M5572j7175r030M4372O1158R8172R1899
3656.9H139822Q895K4788N8200O1136L1050M5208K8161K7435M7636M1149M9660O1665
3668.5H624805R1581Q2037M1034n813K3453J03264K50024M7285j29570k3941k1906
3679.1I082253j9146P744L5385O0413K4398J5399K0667N7066J62919J80763r9823k9597
$$ plain form
3600 5034131 5103747 5161787 5198814 5223590 5261007 5300250 5350175 5398905 5453704 5487591 5512486 5583811
3611.6 5583811 5641167 5709205 5819632 5894788 5930616 5989628 6031527 6032250 6088076 6121564 6128222 6145803
3623.1 6145803 6204716 6311373 6405859 6490796 6589102 6749744 6715437 6681047 6708513 6732854 6791183
3633.8 6791183 6838546 6877279 6935435 7001157 7066409 7114268 7154742 7198140 7287202 7358992 7398362 7438227
3645.3 7438227 7508502 7666095 7684820 7715797 7824854 7870426 7853251 7844221 7888593 7949751 8047923 8139822
3656.9 8139822 8148717 8173505 8231705 8292841 8323891 8369099 8397260 8424695 8472331 8513480 8563140 8624805
3668.5 8624805 8716386 8798423 8839457 8833644 8857097 8960361 9210385 9257670 9128100 9104159 9082253
3679.1 9082253 9063107 9070851 9106236 9166649 9191047 9206446 9227113 9284179 9447098 9627861 9528038 9498441
3690.6I498441p063p2326K443N080L124K5718q867R479L8142N4130P3351O5302j8128
3703.2I668826k2550N127o335j1377k9335n529M1045L2297O7254J1385l720n350k677
3715.7I739061K0178L7208M3505k3113k8995J1376K8067j5906k4774k3021J1542M7143
3727.3I822271j2849K1572O0301O7509M8162j01520l2353n2819m7769M0556J166L665
3738.9I817892M4899Q5626N2523m289M7078J40644k07981l7899L4993k0002k3400n362
3750.4I924722K010P0139J3066l7289j1185L1670j1054o299M6534J7335m3112l5123
3762I961414k8816k1810J6614J5997j2489J7186L9989L2990j0251n346l921K1892J8460
3774.5A0041909j4145o068k3172k0043L257j0734j7424M290L9359M6956K5331N20m036
$$ plain form
3690.6 9498441 9491378 9419052 9421495 9426575 9429699 9455417 9446550 9456029 9494171 9548301 9621652 9686954 9668826
3703.2 9668826 9646276 9651403 9645068 9633691 9604356 9598827 9639872 9672169 9739423 9750808 9747088 9741738 9739061
3715.7 9739061 9759239 9796447 9839952 9816839 9787844 9799220 9827287 9811381 9786607 9763586 9775128 9822271
3727.3 9822271 9809422 9830994 9891295 9958804 10006966 9905446 9873093 9820274 9772505 9813061 9814227 9817892
3738.9 9817892 9862791 9948417 10000940 9996651 10043729 10184373 9976392 9938493 9973486 9953484 9930084 9924722
3750.4 9924722 9926732 9996871 10009937 9972648 9961463 9993133 9982079 9975780 10022314 10039649 9996537 9961414
3762 9961414 9932598 9910788 9927402 9943399 9930910 9948096 9988085 10021075 10010824 10005478 10001557 10023449 10041909
3774.5 10041909 10027764 10021696 9998524 9978481 9981738 9971004 9953580 9957870 9997229 10044185 10069516 10070036 10066000
3787.1A0066000m1153l0399K7071K8247o623k5051k2490j3967L3226L5492l904K1120
3798.7A0067569O23M4128R3902o3475n2809m5651l242N9511J3661p6095j4969K94j1969
3811.2A0011478P402K6337K7900M9267J00675l0163n6307j0649R477j2906r4100K786
3822.8A0031197J1046J3825K7991M4149P069m0031o162N2239Q7319o2344p7754J3501
3834.3A0102045K2178L920K3608L3115r3445k5222M2999m067L3182J3726l5814l480
3845.9A0112745K775k2343j1941J6467l1748j8998R000M449J26920m1556k9175j049
3857.5A0115546J6050J3310L30K3706k5851q7430k4889M7728P682j8365n489L7228
3869.1A0099556J08398Q175o0575l5692J0955l1895l0801O551L2176K2757p383Q067
$$ plain form
3787.1 10066000 10024847 9994448 10021519 10049766 10043143 10018092 9995602 9981635 10014861 10050353 10046449 10067569
3798.7 10067569 10068192 10112320 10206222 10142747 10089938 10044287 10041045 10100556 10114217 10038122 10023153 10023447 10011478
3811.2 10011478 10018880 10045217 10073117 10122384 10223059 10192896 10136589 10125940 10135417 10122511 10028411 10031197
3822.8 10031197 10042243 10056068 10084059 10128208 10135277 10095246 10089084 10141323 10228642 10166298 10088544 10102045
3834.3 10102045 10124223 10128143 10151751 10184866 10091421 10066199 10109198 10105131 10138313 10152039 10116225 10112745
3845.9 10112745 10115520 10093177 10081236 10097703 10065955 10046957 10055957 10060406 10187326 10145770 10116595 10115546
3857.5 10115546 10131596 10144906 10145236 10168942 10143091 10055661 10030772 10078500 10086182 10067817 10062328 10099556
3869.1 10099556 10207954 10216129 10155554 10119862 10130817 10098922 10068121 10074672 10106848 10129605 10122222 10130289
3880.6A0130289m4771j7697J2352O99K5762J3741J974l036j3072K0203M9692l8316
3892.2A0137820n0533J1926j2790k8697j246K3561K7154j8784J8065M4466m650k168
3903.8A0144124O162k1101k9286l4874j5949m234k9727j0585K7143M8240J6313k3183
3915.3A0073043K5494L14o5353l7713q982R842r981Q650N6162L7364n2586k2690J781
3927.9A0015345l586K6013n662r105J26J7375J4786m5410l3176L538R786J460m895
3940.4I986595n605J9680K9984J0542J2265k3600J185O25l2675k478l2821l6414N204
3953I932487K8548N375K7937K8306k6929p695k8726o453M8340J7433k0852l6618r092
3965.5I952061j3819j7263J2717Q360j7166j2020r77k0687K5742M4463O665N128j6420
$$ plain form
3880.6 10130289 10085518 10067821 10080173 10080872 10106634 10120375 10122349 10119313 10106241 10126444 10176136 10137820
3892.2 10137820 10087287 10099213 10086423 10057726 10056480 10080041 10107195 10088411 10106476 10150942 10146292 10144124
3903.8 10144124 10150286 10129185 10099899 10065025 10049076 10044842 10015115 10004530 10031673 10079913 10096226 10073043
3915.3 10073043 10098537 10098851 10033498 9995785 9986803 9996645 9986664 9995314 10051476 10088840 10036254 10013564 10015345
3927.9 10015345 10011759 10037772 10032110 10023005 10023131 10040506 10055292 10009882 9976706 9980244 9990030 9991490 9986595
3940.4 9986595 9980990 10000670 10030654 10041196 10053461 10029861 10031046 10031671 9998996 9996518 9963697 9927283 9932487
3953 9932487 9961035 9966410 9994347 10022653 9995724 9988029 9959303 9952850 10001190 10018623 9997771 9961153 9952061
3965.5 9952061 9938242 9920979 9933696 9942056 9924890 9912870 9911893 9891206 9916948 9961411 9968076 9973204 9956784
3978I956784k4702n539r63k0556j6703K0210K7326K893K329O130j4628j6758k4215
3990.6I891608r34K3363P984l399j6014k193q302o252M746o586
4000.2I884021
$$ plain form
3978 9956784 9932082 9926543 9925580 9905024 9888321 9908531 9935857 9938750 9941079 9947209 9932581 9915823 9891608
3990.6 9891608 9890674 9914037 9922021 9918622 9902608 9900415 9892113 9885861 9890607 9884021
4000.2 9884021
##END=$$ End of the data block
