##TITLE=$$ Begin of the data block
##JCAMP-DX=5.00 $$ ACD/SpecManager v 10.08
##SPECTROMETER/DATA SYSTEM=Varian
##DATE=16 Apr 2013 14:54:04
##DATA TYPE=INFRARED SPECTRUM
##DATA CLASS=XYDATA
##ORIGIN=
##OWNER=
##NPOINTS=3735
##FIRSTX=399.26403809
##LASTX=4000.35498047
##MAXX=4000.35498047
##MINX=399.26403809
##MAXY=157.06990051
##MINY=10.33451557
##XFACTOR=1.0000000000
##YFACTOR=0.000001000000000
##FIRSTY=12.16693783
##DELTAX=0.96440572
##XUNITS=1/CM
##YUNITS=TRANSMITTANCE
##XYDATA=(X++(Y..Y))
399.3A2166938K6444405j1517437O416657Q5607960p4477814k2109804J5548116q241569
$$ 12166938 38611343 27093906 33510563 119118523 44640709 22530905 38079021 29837452
407B9837452n118040O087572m631237R736092P402851p509434P859650N29773J014580
$$ 29837452 24719412 30806984 26175747 35911839 43314690 35805256 43664906 44194679 45209259
415.7D5209259p409428m324676J9263714J04331032j06447011r530109l946365j2973965
$$ 45209259 37799831 33475155 52738869 157069901 50622890 41092781 37146416 24172451
423.4B4172451K1904617J5679230r074345J506665p504521R786270k042923p286506
$$ 24172451 46077068 61756298 52681953 54188618 46684097 56470367 54427444 47140938
431.1D7140938J4499931r970283q495240q177002m715156J7061436P420051n622463
$$ 47140938 61640869 51670586 43175346 34998344 30283188 47344624 54764675 49142212
438.8D9142212n681500j4686904N86607P890108J514324O697387r277420l559745l623890
$$ 49142212 43460712 28773808 29360415 37250523 38764847 45462234 36184814 32625069 29001179
447.5B9001179j1556477L89187L388130J2363079L885216j2843908M404152k631989
$$ 29001179 17444702 17833889 21222019 33585098 37470314 24626406 29030558 26398569
455.2B6398569l207283J3324194N76981J547931L943085j4952118o89787P367777j745735
$$ 26398569 23191286 36515480 37092461 38640392 42583477 27631359 26941572 34309349 32563614
463.9C2563614N207905Q891578q449791j8920980L846447P733534k243658n943926
$$ 32563614 37771519 46663097 38213306 19292326 23138773 30872307 28628649 22684723
471.6B2684723J114321M163683p305769M709056O072241j207117J3489744m143726
$$ 22684723 23799044 27962727 20656958 25366014 31438255 30231138 43720882 39577156
479.3C9577156r288341j438557l392235N394466P278630L018066m892334j1456812
$$ 39577156 30288815 28850258 25458023 30852489 38131119 41149185 36256851 24800039
487B4800039k755317O099220L031935l011200r056797L157293M629103q965834N851814
$$ 24800039 22044722 28143942 31175877 28164677 19107880 22265173 26894276 17928442 23780256
495.7B3780256O090332m871820L049602k065521J724514M015288n115340O72331K86594
$$ 23780256 29870588 24998768 28048370 25982849 27707363 31722651 26607311 27279642 27566236
504.4B7566236N69993N023279m458399K322330O316767p704326M39090p12911j047766
$$ 27566236 28136229 33159508 28701109 31023439 37340206 29635880 30074970 29362059 28314293
513.1B8314293J520018m928708K893326M769026m091927j672729L636831K771738l819244
$$ 28314293 29834311 24905603 27798929 32567955 28476028 26803299 30440130 33211868 29392624
521.7B9392624j09503o95265j981355L976244N042495m026060l293485Q40774l270084
$$ 29392624 29283121 28587856 26606501 30582745 35625240 31599180 28305695 29146469 25876385
530.4B5876385q05163L632126K843165k682881l951011L53752J659706L116045k839112
$$ 25876385 25071222 28703348 31546513 28863632 24912621 25266373 26926079 30042124 27203012
539.1B7203012l292461L64454Q20999J120993m29142L148539j346176r56389N277660
$$ 27203012 23910551 24275005 25096004 26216997 25787855 28936394 27590218 26633829 31911489
547.8C1911489l904611l059412J712887R5207J193342L83202l046925n71209L17669
$$ 31911489 28006878 24947466 26660353 26755560 27948902 28332104 25285179 24713970 25031639
556.5B5031639j67114k29927R0627K753935l201578k284050J859638o76330L819031
$$ 25031639 24864525 24634598 24725225 27479160 24277582 21993532 23853170 23176840 26995871
565.1B6995871L1978k242981L129771K05915n4554R83868M02403k133437j589367J521635
$$ 26995871 27027849 24784868 27914639 28120554 28066000 29049868 29452271 27318834 25729467 27251102
574.8B7251102k177700k045290M261532R85525k562553K161501J001242j193308k028979
$$ 27251102 25073402 23028112 27289644 28275169 25712616 27874117 28875359 27682051 25653072
583.5B5653072k741890R6121K824429L022310m38471q8321P07651j266310r50224n81110
$$ 25653072 22911182 23007303 25831732 28854042 28415571 28327250 29034901 27768591 26818367 26237257
593.1B6237257j154131j005548J350301J629862r49028j504228M20471K089653N08867
$$ 26237257 25083126 24077578 25427879 27057741 26108713 24604485 25024956 27114609 27623476
601.8B7623476j344299P57452Q86768k506269J263118K450858j66102j48580l762852
$$ 27623476 26279177 27036629 27923397 25417128 26680246 29131104 28965002 28816422 25053570
610.5B5053570J03197K599920J065132J118971k432018N34967J725508j482716K57565
$$ 25053570 25156767 27756687 28821819 29940790 27508772 28043739 29769247 28286531 28544096
619.2B8544096O0606j042366J076109J839743m06184j207309r07984q01626j051138
$$ 28544096 28604702 27562336 28638445 30478188 30072004 28864695 27956711 27155085 26103947
627.8B6103947O80969M77524j145994J116132m37690p83629J95850r54813P36508Q63373
$$ 26103947 26784916 27262440 26116446 27232578 26794888 26011259 26207109 25252296 25988804 26852177
637.5B6852177O81133k26893j080411L71875N10216n26342q11261J67941O75151m171
$$ 26852177 27533310 27306417 26226006 26597881 27108097 26581755 25770494 25938435 26613586 26609415
647.1B6609415j135872Q20721J746075q17431l72328K08573m01465M57878J795481
$$ 26609415 25473543 26294264 28040339 27222908 26850580 27059153 26657688 27115566 28911047
655.8B8911047r53424k014712J515000M91807l67919Q11330m0512j390987j181170
$$ 28911047 27957623 25942911 27457911 27949718 27581799 28393129 28352617 26961630 25780460
664.5B5780460P67439L65656l2808m59631j815846J679762Q86111k055458p7679P82499
$$ 25780460 26547899 26913555 26880747 26421116 24605270 26285032 27171143 25115685 25038006 25820505
674.1B5820505q72257l2837M06700J286583K82471p92546r73247j621899K123225J206729
$$ 25820505 24948248 24915411 25322111 26608694 26891165 26098619 25125372 23503473 25626698 26833427
683.8B6833427j694412J502083k21558j450679K197954J076935q26096J095886N81690
$$ 26833427 25139015 26641098 26419540 24968861 27166815 28243750 27417654 28513540 29095230
692.4B9095230m55162j027073n93994J557369J413193O22549j018713q1665R19958
$$ 29095230 28640068 27612995 27019001 28576370 29989563 30612112 29593399 29511734 30431692
701.1C0431692j112432J023201J600160j55651m61210j539503l13172J620325J509377
$$ 30431692 29319260 30342461 31942621 31786970 31325760 29786257 29473085 31093410 32602787
709.8C2602787k46017k37320R87506o37039j439954O37617N21419o09260m70717K3031
$$ 32602787 32356770 32119450 33106956 32469917 31029963 31667580 32188999 31579739 31109022 31132053
719.5C1132053J329087K29919o17367K8611O67926P31118j096104K74826P36546p02572
$$ 31132053 32461140 32691059 32073692 32102303 32770229 33501347 32405243 32680069 33416615 32714043
729.1C2714043j40065J01380N38807l20690j52226P63088k2785N1201J12968L95642
$$ 32714043 32573978 32675358 33214165 32893475 32741249 33504337 33481552 33532753 33645721 34041363
738.7C4041363J221328J92330k04598J485058Q1757o63975L88744n12249P4681K33288
$$ 34041363 35262691 35455021 35250423 36735481 36817238 36153263 36542007 36029758 36104439 36337727
748.4C6337727K66429P7969j95496L19645p98469J08051Q58761K45159O24493K28069
$$ 36337727 36604156 36682125 36486629 36806274 36007805 36115856 36974617 37219776 37844269 38072338
758C8072338k1568K3227M22459L86131L3268J013428M81289k98504J230648k78904
$$ 38072338 38050770 38073997 38496456 38882587 38915855 39929283 40410572 40112068 41342716 41063812
767.7D1063812p56458N81314j404221o3377N25833m76177J700146J007835r75242j565503
$$ 41063812 40307354 40888668 39484447 39421070 39946903 39470726 41170872 42178707 41203465 39637962
777.3C9637962J39710O38840j587471M24869K302326Q61542J86527q03806m95750J145458
$$ 39637962 39777672 40416512 38829041 39253910 41556236 42417778 42604305 41800499 41304749 42450207
787D2450207R62612L10863l72142L57788R85370l15361R60491J086125m42017j57119
$$ 42450207 43412819 43723682 43351540 43709328 44694698 44379337 45339828 46425953 45983936 45826817
796.6D5826817k96967k95197L23273M73564J74027Q14270Q0135j082260l63071P41729
$$ 45826817 45529850 45234653 45557926 46031490 46205517 47019787 47099922 46017662 45654591 46396320
806.2D6396320J456047Q98320M46792j091583q00240k57324j206058N10883J241303
$$ 46396320 47852367 48750687 49197479 48105896 47305656 47048332 45842274 46353157 47594460
814.9D7594460J498699q17768k206028n86907r09073N75257p6035q9836Q36899q48728
$$ 47594460 49093159 48275391 46069363 45482456 44573383 45148640 45072605 44982769 45819668 44970940
824.6D4970940P75230J891491M51080r76940k228R84776j47522k62325n63404m2794
$$ 44970940 45746170 47637661 48088741 47111801 47109573 48094349 47946827 47684502 47121098 47078304
834.2D7078304L77289j029568k064064j311908r49177j666966j311538n11345R4795
$$ 47078304 47455593 46426025 44361961 43050053 42100876 40433910 39122372 38611027 38705822
842.9C8705822j220139j335823Q7899l70617m1596r98733j471840K83684M1183J30497
$$ 38705822 37485683 36149860 36237759 35867142 35825546 34826813 33354973 33638657 33679840 33810337
852.5C3810337N35477l95256p26609l39275L27522K59549K7507L67939o54026K45060
$$ 33810337 34345814 33950558 33223949 32884674 33212196 33471745 33499252 33867191 33213165 33458225
862.2C3458225J175118m67350O84437N09494k31743J315129J500507J536049O14315
$$ 33458225 34633343 34165993 34850430 35359924 35128181 36443310 37943817 39479866 40094181
870.9D0094181J283337J663517L02650J391804J373169J579819K376560J540634J402279
$$ 40094181 41377518 43041035 43343685 44735489 46108658 47688477 50065037 51605671 53007950
879.5E3007950J175518J557365J337864o95724j92616Q31356Q22796J347061K0794
$$ 53007950 54183468 55740833 57078697 56382973 56190357 57021713 57844509 59191570 59212364
888.2E9212364j93371N79403j153263j247036m18171m31537L3077j008457o66943p08568
$$ 59212364 59018993 59598396 58445133 57198097 56779926 56348389 56381466 55373009 54706066 53997498
897.9E3997498k647923r53159j122692j751954o32907k292344j178161m95159j798554
$$ 53997498 51349575 50396416 49273724 47521770 46888863 44596519 43418358 42923199 41124645
906.5D1124645o89316l97625q32290j406616j062352l05397m29527k02164p52002o05149
$$ 41124645 40435329 40037704 39205414 37798798 36736446 36431049 36001522 35799358 35047356 34442207
916.2C4442207p8556j195694j380453L50069J108402q3827j299790j058590N35065
$$ 34442207 34363651 33167957 31787504 32137573 33245975 33162148 31862358 30803768 31338833
924.9C1338833P43744K65838P63600J017143J025044J35219P37396K244187J815551
$$ 31338833 32082577 32348415 33112015 34129158 35154202 35289421 36026817 38271004 40086555
933.6D0086555J458397J590722K058647L055675K178398N72537J425243J160256L58814
$$ 40086555 41544952 43135674 45194321 48249996 50428394 51000931 52426174 53586430 53945244
942.2E3945244J287315R88056J59108N2429P39517R83753k82146j242069m15284K30763
$$ 53945244 55232559 56220615 56379723 56432152 57171669 58155422 57873276 56631207 56215923 56446686
951.9E6446686n44838k78126k88513o02585n15808j143898j089043j284927j337574
$$ 56446686 55901848 55623722 55335209 54732624 54216816 53072918 51983875 50698948 49361374
960.6D9361374j233791j835110j397347j215187j333149j236316j155529p75441j679157
$$ 49361374 48127583 46292473 44895126 43679939 42346790 41110474 39954945 39179504 37500347
969.2C7500347j874760o25423k72629m37790p80651p28096k75486p85738j031008k27159
$$ 37500347 35625587 35000164 34727535 34289745 33509094 32780998 32505512 31719774 30688766 30461607
978.9C0461607k06663q53584r77406l2690M22470p95673j112133p32312n09655j24559
$$ 30461607 30254944 29401360 28423954 28391264 28813734 28018061 26905928 26173616 25663961 25539402
988.5B5539402k65341j65304K1580Q3586j93476k35684O14340J55827l46787O16019
$$ 25539402 25274061 25108757 25130337 25213923 25020447 24784763 25399103 25554930 25208143 25824162
998.2B5824162P24153O33036P72529Q15062J062788L99788r8030p3412O03943Q60489
$$ 25824162 26548315 27181351 27953880 28768942 29831730 30231518 30133488 30060076 30664019 31524508
1007.8C1524508m09066l80756j42120q98777q98924j157479j259866p73573q98760
$$ 31524508 31115442 30734686 30592566 29693789 28794865 27637386 26377520 25603947 24705187
1016.5B4705187j020971j334307r72134m29119j170437n03542k92959j329666m12294
$$ 24705187 23684216 22349909 21377775 20948656 19778219 19274677 18981718 17652052 17239758
1025.2A7239758r63927r71521N24120n64706o86744k55636l86071P691j14524Q447
$$ 17239758 16275831 15304310 15828430 15263724 14576980 14321344 13935273 13942964 13828440 13836887
1034.8A3836887k66274l85573M7550J80434K94075j84635j006786j54681M64846m15931
$$ 13836887 13570613 13185040 13232590 13413024 13707099 13522464 12515678 12360997 12825843 12409912
1044.5A2409912K07488L99654l75647l779O75046K79295l73842J56852K98404P09893
$$ 12409912 12617400 13017054 12641407 12637628 13312674 13591969 13218127 13374979 13673383 14383276
1054.1A4383276P21455j927j16287p5222P42079K49992J6403R71634J32450j3866Q60391
$$ 14383276 15104731 15102804 14986517 14911295 15653374 15903366 15919769 16891403 17023853 17009987 17870378
1064.7A7870378L76742K91885M44266O5834P53629N77092M71244P60788L61411N14507
$$ 17870378 18247120 18539005 18983271 19049105 19802734 20379826 20851070 21611858 21973269 22487776
1074.4B2487776m00618M35177Q27742o56164M77878K1290l52354Q40477k88794m74563
$$ 22487776 22087158 22522335 23350077 22693913 23171791 23193081 22840727 23681204 23392410 22917847
1084B2917847l42736o01785N20866M30229J04805k08088o85518K06411n01184m44572
$$ 22917847 22575111 21973326 22494192 22924421 23029226 22821138 22135620 22342031 21840847 21396275
1093.6B1396275L16799q68767P2422K60097q47839m43958k32279k47128q88456n62734
$$ 21396275 21713074 20844307 20916729 21176826 20328987 19885029 19652750 19405622 18517166 17954432
1103.3A7954432K94668m7955j5495J19055k29609O9836L04260l09635k04142L10427
$$ 17954432 18249100 18201145 18185650 18304705 18075096 18144932 18449192 18139557 17935415 18245842
1112.9A8245842M94049K7853J89714R40512N04753J87743J98514R04208J244463J067447
$$ 18245842 18739891 18767744 18957458 19897970 20402723 20590466 20788980 21693188 22937651 24005098
1122.6B4005098J476944J577631J464428P27873J395931K284117J510838J701526K409680
$$ 24005098 25482042 27059673 28524101 29251974 30647905 32932022 34442860 36144386 38554066
1131.2C8554066K099327J896316J388958J106613K202534J578880M95953P95853J277237
$$ 38554066 40653393 42549709 43938667 45045280 47247814 48826694 49322647 50118500 51395737
1139.9E1395737J401245J103378P20673M8443P85911J101894k23899j55388Q85582
$$ 51395737 52796982 53900360 54621033 54669476 55455387 56557281 56333382 56177994 57063576
1148.6E7063576K90233j05522R38118K76234R0004O89052l36895j047264j41735P14916
$$ 57063576 57353809 57248287 58186405 58462639 58552643 59241695 58904800 57857536 57715801 58430717
1158.3E8430717J17650J71562j83628n30758J33732n24670q39710k73526l9287k42825
$$ 58430717 58548367 58719929 58536301 58005543 58139275 57614605 56774895 56501369 56462082 56219257
1167.9E6219257k09716k24446n31585m10630p46223q21552j95591j32828o92841p81536
$$ 56219257 56009541 55785095 55253510 54842880 54096657 53275105 53079514 52946686 52253845 51472309
1177.5E1472309m17053o65787j275894j262180p15412p11934p04929n59650o93982
$$ 51472309 51055256 50389469 49113575 47851395 47135983 46424049 45719120 45159470 44465488
1186.2D4465488n96801j053711j111889m21429o24527n56454l44661m14452j80279
$$ 44465488 43868687 42814976 41703087 41281658 40657131 40100677 39756016 39341564 39161285
1194.9C9161285n28164l83159k39937p39338m56829l50189j73893K06631L2184Q9508
$$ 39161285 38633121 38249962 38010025 37270687 36813858 36463669 36289776 36496407 36528591 36618099
1204.5C6618099j33766l14930j67602m85642j05148M27433J85783J40991K68315K31098
$$ 36618099 36484333 36169403 36001801 35516159 35411011 35838444 36024227 36165218 36433533 36664631
1214.2C6664631k00214m28444m2881J03748R918O2538J34484J93985L8784r2217N7003
$$ 36664631 36464417 36035973 35993092 36096840 36106758 36169296 36303780 36497765 36536549 36444332 36501335
1224.8C6501335J04115N2631k49950r3987L29533k827j9291N3570j4904K0843k12635
$$ 36501335 36605450 36658081 36408131 36314144 36643677 36640850 36621559 36675129 36660225 36681068 36468433
1235.4C6468433j27678N6408L82260M60621k2141Q4973L04225J41945J78604P6272
$$ 36468433 36340755 36397163 36779423 37240044 37217903 37302876 37607101 37749046 37927650 38003922
1245C8003922J83021O64475N36399L35690l5069j78146J76373J17649K95589j3130
$$ 38003922 38186943 38851418 39387817 39723507 39688438 39510292 39686665 39804314 40099903 40086773
1254.7D0086773O0940N43258L9784L0128r8240k77141l945j76906k7928K34284N5138
$$ 40086773 40147713 40690971 40730755 40760883 40662643 40385502 40381557 40204651 40176723 40411007 40466145
1265.3D0466145l8300k63325k79178q5213l28022J09714Q6163l47061L87882J16047
$$ 40466145 40427845 40164520 39885342 39800129 39472107 39581821 39667984 39320923 39708805 39824852
1274.9C9824852m17904j13743J2558j05072m15222k38701P3387J67622O8573j56765
$$ 39824852 39406948 39293205 39305763 39200691 38785469 38546768 38620155 38787777 38856350 38699585
1284.6C8699585k93869l81882j91093J46576L49548O3747j16386o2744j04797q7956
$$ 38699585 38405716 38023834 37832741 37979317 38328865 38392612 38276226 38213482 38108685 38020729
1294.2C8020729k52823k36519q2348P5013j72371j98307J75239k69462n08354l20271
$$ 38020729 37767906 37531387 37449039 37524052 37351681 37153374 37328613 37059151 36550797 36230526
1303.9C6230526p5138k23301m55231L1807K1252J175l5362m68579m10511n5771J0296
$$ 36230526 36155388 35932087 35476856 35508663 35529915 35531090 35495728 35027149 34616638 34560867 34571163
1314.5C4571163j57345O3465j63242m35337n8872j26095k14424L3707Q2145l22933
$$ 34571163 34413818 34477283 34314041 33878704 33819832 33693737 33479313 33513020 33595165 33272232
1324.1C3272232j34251O1753j76941J56761L5503j31538O9443m1348q2577K3728L7449
$$ 33272232 33137981 33199734 33022793 33179554 33215057 33083519 33152962 33111614 33029037 33052765 33090214
1334.7C3090214M1851K17216K28314J66710k1099n7888J37184J54934J54983N2418
$$ 33090214 33132065 33349281 33577595 33744305 33723206 33665318 33802502 33957436 34112419 34164837
1344.4C4164837q1577n9578J48841P527J0223R1221M6131J12137k28474J3596J13400
$$ 34164837 34083260 34023682 34172523 34180050 34190273 34281494 34327625 34439762 34211288 34224884 34338284
1355C4338284J2561K74506q7456n3104J12942j18657j61403j63006j90579J66146J24206
$$ 34338284 34350845 34625351 34537895 34484791 34597733 34479076 34317673 34154667 33964088 34130234 34254440
1365.6C4254440o0344J10290k33585j84288K441j41174p0213k38381j50532k88292
$$ 34254440 34194096 34304386 34070801 33886513 33888954 33747780 33677567 33439186 33288654 33000362
1375.2C3000362J00331J43909k31613Q5178j01909j35472k6023m3732j45771k86186
$$ 33000362 33100693 33244602 33012989 33098167 32996258 32860786 32834763 32791031 32645260 32359074
1384.9C2359074k9183j297l59615k81645J05133k64805l51978j09938k30135J40015
$$ 32359074 32329891 32328594 31968979 31687334 31792467 31527662 31175684 31065746 30835611 30975626
1394.5C0975626k18102k12352j71551m84385m33084M9803J84402l91329j61487M8014
$$ 30975626 30757524 30545172 30373621 29889236 29456152 29505955 29690357 29299028 29137541 29185555
1404.2B9185555j47042j67835l84251o7194Q0534K53655J70028J6707n5668j94202
$$ 29185555 29038513 28870678 28486427 28419233 28499767 28753422 28923450 28940157 28884489 28690287
1413.8B8690287o2874j6354K95420K22938K68341m74102j63690L57941o3235J77674
$$ 28690287 28627413 28611059 28906479 29129417 29397758 28923656 28759966 29117907 29054672 29232346
1423.4B9232346r5334J02370N5099L8328M36079k26757J46700M62576Q2873J42538
$$ 29232346 29137012 29239382 29294481 29332809 29768888 29542131 29688831 30151407 30234280 30376818
1433.1C0376818L13453J64858Q5236K51928N7196N27796J64734J32051O3396J41526
$$ 30376818 30690271 30855129 30940365 31192293 31249489 31777285 31942019 32074070 32137466 32278992
1442.7C2278992M14928j93924J06461j38123n3299L5412k70439L7235k73262n3421
$$ 32278992 32693920 32499996 32606457 32468334 32415035 32450447 32180008 32217243 31943981 31890560
1452.4C1890560j94628N7711n4815m85094m13546o2160N61449L2795O69681J8292K38845
$$ 31890560 31695932 31753643 31698828 31213734 30800188 30738028 31299477 31332272 32001953 32020245 32259090
1463C2259090N13779l23387O68297J80244P59178N42427P58584Q63266M38137J535972
$$ 32259090 32772869 32449482 33117779 33298023 34057201 34599628 35358212 36221478 36659615 38195587
1472.6C8195587j02051J225964R22878J140869J154416R02297J342507R77970J266804
$$ 38195587 38093536 39319500 40242378 41383247 42537663 43439960 44782467 45760437 47027241
1481.3D7027241J122417J311936R73285J490044J287170N16735J713337M54640J227695
$$ 47027241 48149658 49461594 50434879 51924923 53212093 53728828 55442165 55896805 57124500
1490E7124500Q59513P20394J129055N34637N75180J0475Q02704P84851M38042L50758
$$ 57124500 57984013 58704407 59833462 60368099 60943279 60953754 61756458 62541309 62979351 63330109
1499.6F3330109N85479N27611L31589Q18237J17890P28584k45659j095085J954719
$$ 63330109 63915588 64443199 64774788 65593025 65710915 66439499 66193840 65098755 67053474
1508.3F7053474M36676J040520L42148Q57971L2120l24089L78456K23740N25886l73428
$$ 67053474 67490150 68530670 68872818 69730789 69762909 69438820 69817276 70041016 70566902 70193474
1518G0193474N55855L76983Q3046M81285k36480M02374J80580L47435N9586L03932
$$ 70193474 70749329 71126312 71209358 71690643 71454163 71856537 72037117 72384552 72444138 72748070
1527.6G2748070J09924L69843M67643j72371O12915M63929k62711m6821Q1748L10959
$$ 72748070 72857994 73227837 73695480 73523109 74136024 74599953 74337242 74290421 74372169 74683128
1537.2G4683128n7991Q47336j289459l31787P48352q6174K46101O60607K49694j36245
$$ 74683128 74625137 75472473 74183014 73851227 74599579 74513405 74759506 75420113 75669807 75533562
1546.9G5533562K6077k50191P9933N86708L63968J49445m31175j84265L65715N08873
$$ 75533562 75559639 75309448 75389381 75976089 76340057 76489502 76058327 75874062 76239777 76748650
1556.5G6748650j43250p78366L086243k370362j37428N6694O9252M7051n0171R9197
$$ 76748650 76605400 75827034 78913277 76542915 76405487 76462181 76531433 76578484 76528313 76627510
1566.2G6627510O1455J73584l9635k57385K09267K69706k144p6820J13144K31697K95967
$$ 76627510 76688965 76862549 76822914 76565529 76774796 77044502 77042358 76965538 77078682 77310379 77606346
1576.8G7606346l86825k85546J4336K54669m55971o97799K5123J98380J34514m7089
$$ 77606346 77219521 76933975 76948311 77202980 76747009 76049210 76074333 76272713 76407227 76360138
1586.4G6360138q0429k88216m47578k79488m33853k03255K86743l0975n16807p8965
$$ 76360138 76279709 75991493 75543915 75264427 74830574 74627319 74914062 74883087 74366280 74287315
1596.1G4287315N9746l46527m97307l75458k75177j72630r315l27439m58778l63060
$$ 74287315 74347061 74000534 73503227 73127769 72852592 72679962 72670647 72343208 71884430 71521370
1605.7G1521370l64655n03013n59601l98132l43621m91920o71547k30209k46804m74365
$$ 71521370 71156715 70653702 70094101 69695969 69352348 68860428 68188881 67958672 67711868 67237503
1615.4F7237503q81683j226311p904l98743k34337l73588m33571q58494j057964J76769
$$ 67237503 66355820 65129509 65121605 64722862 64488525 64114937 63681366 62822872 61764908 61941677
1625F1941677k06325m81038j093727k11136O6006m63478m94530o96708k19731o9839
$$ 61941677 61735352 61254314 60160587 59949451 60015457 59551979 59057449 58360741 58141010 58071171
1634.6E8071171j273648l09158P30290k87548m64837O8139j77803n2914m44554J03661
$$ 58071171 56797523 56488365 57218655 56931107 56466270 56534409 56356606 56303692 55859138 55962799
1644.3E5962799M94022k04872J55396n05055P8022J75282L20843N62000R07211j250721
$$ 55962799 56456821 56251949 56407345 55902290 55980312 56155594 56476437 57038437 57945648 56694927
1653.9E6694927j33198M24466J70425L82442L02632M51927M38301M81896M06135j27434
$$ 56694927 56561729 56986195 57156620 57539062 57841694 58293621 58731922 59213818 59619953 59492519
1663.6E9492519J098507P60376L50426L85677L08533O46706L41373O30081Q01308P57195
$$ 59492519 60591026 61351402 61701828 62087505 62396038 63042744 63384117 64014198 64815506 65572701
1673.2F5572701Q40728J272705k38014o4850N75012J92032N69626J162842P86217Q36395
$$ 65572701 66413429 67686134 67448120 67383270 67958282 68150314 68719940 69882782 70668999 71505394
1682.9G1505394J618637k13097q39836P96364O11160L56949M92455L41484P15263O64849
$$ 71505394 73124031 72910934 72071098 72867462 73478622 73835571 74328026 74669510 75384773 76049622
1692.5G6049622N10360P94007R37950j9226j46927N17380P75741j42189M23401O60454
$$ 76049622 76559982 77353989 78291939 78272713 78125786 78643166 79418907 79276718 79700119 80360573
1702.1H0360573M86015N90416J46813q385J40259L30566L12180M70245N77324R9037
$$ 80360573 80846588 81437004 81583817 81575432 81715691 82046257 82358437 82828682 83406006 83505043
1711.8H3505043R6245K62436j85402K11822J014008N08972l57933J02470K33025J93184
$$ 83505043 83601288 83863724 83678322 83890144 84904152 85413124 85055191 85157661 85390686 85583870
1721.4H5583870J2070L73657p523n4146O10337K13981O1959O0150l55065L56774O68045
$$ 85583870 85595940 85969597 85962074 85907928 86518265 86732246 86794205 86854355 86499290 86856064 87524109
1732H7524109K62604q08113m79577R79943N28793J5648J75102j17538Q285M01566J91894
$$ 87524109 87786713 86978600 86499023 87478966 88007759 88023407 88198509 88080971 88089256 88490822 88682716
1742.7H8682716M83559K20100J22895R6779j84037J29196N87761N89936n1461k22206
$$ 88682716 89166275 89386375 89509270 89606049 89422012 89551208 90138969 90728905 90677444 90455238
1752.3I0455238l7758k43392M5791r2209n71830K77580M75479J25526K13280J98639
$$ 90455238 90417480 90174088 90219879 90127670 89555840 89833420 90308899 90434425 90647705 90846344
1761.9I0846344J82816n1255k05307O1013k2400M58793K31018j60392N70854M32480
$$ 90846344 91029160 90977905 90772598 90833611 90811211 91270004 91501022 91340630 91911484 92343964
1771.6I2343964k24778p77359j33026J69930j05683K03720L14034J93817J53381k45071
$$ 92343964 92119186 91341827 91208801 91378731 91273048 91476768 91790802 91984619 92138000 91892929
1781.2I1892929l14560j7105m7584J05468N05249L48908J94542j16875j83128r117
$$ 91892929 91578369 91561264 91513680 91619148 92124397 92473305 92667847 92550972 92367844 92358727
1790.9I2358727L44070J27777k68623L52676J80161J3862K26654p5851k33437j37466
$$ 92358727 92702797 92830574 92561951 92914627 93094788 93108650 93335304 93259453 93026016 92888550
1800.5I2888550q5228j36658K19025K40371q018K50587J38337m18808p0908L12805
$$ 92888550 92803322 92666664 92885689 93126060 93118042 93368629 93506966 93088158 93017250 93330055
1810.2I3330055k43774k21657K15576L38249L58063J65138o2187l24837k63862l0808
$$ 93330055 93086281 92864624 93080200 93418449 93776512 93941650 93879463 93554626 93290764 93259956
1819.8I3259956J22017K64374N6641k4063M1427m67132k87484J16631K7046K41936
$$ 93259956 93381973 93646347 93702988 93678925 93720352 93253220 92965736 93082367 93109413 93351349
1829.4I3351349J83746n8571J18958j36650J4129J75034J30531k0202l22007J66916
$$ 93351349 93535095 93476524 93595482 93458832 93472961 93647995 93778526 93758324 93436317 93603233
1839.1I3603233L01072J27319L6667j41732k4932m23066j60728K62741K39403J23947
$$ 93603233 93904305 94031624 94068291 93926559 93901627 93478561 93317833 93580574 93819977 93943924
1848.7I3943924j4992j66321L4172O3523n3749J84448O8695m6860K41448K32353M3785
$$ 93943924 93928932 93762611 93796783 93860306 93806557 93991005 94059700 94012840 94254288 94486641 94530426
1859.3I4530426K9671j35994l52028k53197P9384L05000J74996J62300P3135l8490
$$ 94530426 94560097 94424103 94072075 93818878 93898262 94203262 94378258 94540558 94613693 94575203
1869I4575203l06076m19769J72035J63849J02768K33459n8281j03752k70508l0082
$$ 94575203 94269127 93849358 94021393 94185242 94288010 94521469 94463188 94359436 94088928 94058846
1878.6I4058846Q3068r3925J11511J03470J55159J33263k3156k82371l06786q3976
$$ 94058846 94141914 94047989 94159500 94262970 94418129 94551392 94528236 94245865 93939079 93855103
1888.3I3855103O4819J82152L9383K09098k21j38733m0725k70462k33399j81503K03369
$$ 93855103 93919922 94102074 94141457 94350555 94350334 94211601 94170876 93900414 93667015 93485512 93688881
1898.9I3688881L04428J72798R9518j76987j53923j21956P477p8789j27922J52192
$$ 93688881 93993309 94166107 94265625 94088638 93934715 93812759 93820236 93741447 93613525 93765717
1908.5I3765717J60385L0800K5978J90391n9768k62414j91597q6868J95732R0340p1938
$$ 93765717 93926102 93956902 93982880 94173271 94113503 93851089 93659492 93572624 93768356 93858696 93786758
1919.1I3786758O3981j519p9559M2633r5291k79846p7774J52282R6688p4219O0600
$$ 93786758 93850739 93849220 93769661 93812294 93717003 93437157 93359383 93511665 93608353 93534134 93594734
1929.7I3594734j24443l31528m5021K2995J40007J37497j6594j35788j17813J67313
$$ 93594734 93470291 93138763 93093742 93116737 93256744 93394241 93377647 93241859 93124046 93291359
1939.4I3291359J27609l3340j95824k82432l4806p0602j11954J6182k15141k13127
$$ 93291359 93418968 93385628 93189804 92907372 92872566 92801964 92690010 92706192 92491051 92277924
1949I2277924P2830j46652n2742J56410O5971J4359o4637P4395m9538j75102p7629
$$ 92277924 92350754 92204102 92151360 92307770 92373741 92388100 92323463 92397858 92348320 92173218 92095589
1959.6I2095589m341J47125K55806J75308q2085j47812l11943k40043P3333J96915
$$ 92095589 92091248 92238373 92494179 92669487 92587402 92439590 92127647 91887604 91960937 92157852
1969.3I2157852J41716k14813n7716O1340J50848P8614l95890r3765K23434J70586
$$ 92157852 92299568 92084755 92027039 92088379 92239227 92317841 91921951 91828186 92051620 92222206
1978.9I2222206J73515K51664o4957l30460K5483j5595Q522J94817J96663J5945j47171
$$ 92222206 92395721 92647385 92582428 92251968 92277451 92261856 92270378 92465195 92661858 92677803 92530632
1989.5I2530632J05949p949j60401m4006j02814j03981R0004K24487J51368P5569j34903
$$ 92530632 92636581 92628632 92468231 92424225 92321411 92217430 92307434 92531921 92683289 92758858 92623955
2000.1I2623955p0770m5708j71456l43p8598q3664K40654K05818k21054k03552n9105
$$ 92623955 92553185 92507477 92336021 92335678 92257080 92173416 92414070 92619888 92398834 92195282 92136177
2010.7I2136177l01308j60026K19452J15318j87393j66062j30622j6716R1102j52366
$$ 92136177 91834869 91674843 91894295 92009613 91822220 91656158 91525536 91508820 91599922 91447556
2020.4I1447556j69274J1879j5838k50649N11L01804j40366k21794L6064K1408n6877
$$ 91447556 91278282 91290161 91274323 91023674 91024185 91325989 91185623 90963829 90999893 91021301 90964424
2031I0964424k0332R033q7784j59889k19528q8768n1316j39061j06758K2782J17843
$$ 90964424 90944092 90953125 90865341 90705452 90485924 90397156 90345840 90206779 90100021 90122803 90240646
2041.6I0240646r9136j88461j68351j18522q3092l212K65831J55007o8116j73195j57386
$$ 90240646 90141510 89953049 89784698 89666176 89583084 89579872 89845703 90000710 89932594 89759399 89602013
2052.2H9602013q8936j67984P7247J52367j29982q0879n3711j28693R140o0798k03110
$$ 89602013 89513077 89345093 89422340 89574707 89444725 89363846 89310135 89181442 89190582 89129784 88926674
2062.8H8926674k21878j19858K58530J43112l4744J54754m2694k68478q1497K03651
$$ 88926674 88704796 88584938 88843468 88986580 88951836 89106590 89063896 88795418 88713921 88917572
2072.5H8917572L9642j62216K05650M35402R3338k93754l33428k19619R1034K21878
$$ 88917572 88957214 88794998 89000648 89436050 89529388 89235634 88902206 88682587 88773621 88995499
2082.1H8995499n8037r3544L6888O3400O3332K8442j62338j93024m9759N654J90078
$$ 88995499 88937462 88843918 88880806 88944206 89007538 89035980 88873642 88680618 88630859 88636513 88826591
2092.7H8826591J17737J37719J32049k28264j03081r3360l6988K63932J13342L0792
$$ 88826591 88944328 89082047 89214096 88985832 88882751 88789391 88752403 89016335 89129677 89160469
2102.4H9160469J25877J38360j85174k43080J4893j71509q339J62316p294J94862K07192
$$ 89160469 89286346 89424706 89239532 88996452 89011345 88839836 88831497 88993813 88986519 89181381 89388573
2113H9388573j08185j40434M6074p805o4881K9648m8378l0731J47751J07040o5964
$$ 89388573 89280388 89139954 89186028 89178223 89113342 89142990 89094612 89063881 89211632 89318672 89252708
2123.6H9252708n4847n3040L5958J11343j11588P33P5943n4917Q149l5683J46622J45416
$$ 89252708 89197861 89144821 89180779 89292122 89180534 89181267 89257210 89202293 89210442 89174759 89321381 89466797
2135.1H9466797q2214L8681j64978k02256J67748N4359j6006J05552N1972N7899J06285
$$ 89466797 89384583 89423264 89258286 89056030 89223778 89278137 89262131 89367683 89419655 89477554 89583839
2145.8H9583839R4033j10771m3892J40998N4024J53359J22215J43188L6065j69251
$$ 89583839 89677872 89567101 89523209 89664207 89718231 89871590 89993805 90136993 90173058 90003807
2155.4I0003807J04309j8059l6033J30531k6260R2018l273j57150L3950J39382J37985
$$ 90003807 90108116 90090057 90054024 90184555 90158295 90250313 90247040 90089890 90123840 90263222 90401207
2166I0401207Q3702m2419L5934J65016J18973J97426R5322J8272L9329n2375M5837
$$ 90401207 90484909 90442490 90478424 90643440 90762413 90959839 91055161 91073433 91112762 91060387 91106224
2176.6I1106224o1508l5195J48430J47301J46256k0737q6655j04271o3247R8556R1828
$$ 91106224 91044716 91009521 91157951 91305252 91451508 91430771 91344116 91239845 91176598 91275154 91366982
2187.2I1366982m8043j32004L0404O9259j2749J46599O9237k50458j13800J32950L20328
$$ 91366982 91318939 91186935 91217339 91286598 91273849 91420448 91489685 91239227 91125427 91258377 91578705
2197.8I1578705M73823j1612k76229j21415k28523j76262J47377N21576J87432l74642
$$ 91578705 92052528 92040916 91764687 91643272 91414749 91238487 91385864 91907440 92094872 91720230
2207.5I1720230j46477M1787N8677J02104j60369j79337O5216j0727O0074L27858J76079
$$ 91720230 91573753 91615540 91674217 91776321 91615952 91436615 91501831 91491104 91551178 91879036 92055115
2218.1I2055115j25038j54923p0625p0229J70731L60733J2863j18065J4641j31027
$$ 92055115 91930077 91775154 91704529 91634300 91805031 92165764 92178627 92060562 92075203 91944176
2227.7I1944176j74301L0822K343j28174J50085J60088k62429j27838P1846O8978K06032
$$ 91944176 91769875 91800697 91803040 91674866 91824951 91985039 91722610 91594772 91666618 91735596 91941628
2238.3I1941628P5790k4941j34376m6547J62834j10397P4775K80343L3447j9585p9017
$$ 91941628 92017418 91992477 91858101 91811554 91974388 91863991 91938766 92219109 92252556 92232971 92153954
2248.9I2153954j572L4981Q331p8537k31712j01738P8392J98234J8471j60812O034
$$ 92153954 92152382 92187363 92195694 92117157 91885445 91783707 91862099 92060333 92078804 91917992 91924026
2259.5I1924026K7756q9447l1074J29570J13846K6504r1820j66198j2070J6098j36528
$$ 91924026 91951782 91862335 91831261 91960831 92074677 92101181 92009361 91843163 91831093 91847191 91710663
2270.2I1710663k2911J64642p6797k02866q6525j75171j19842J83212L01964m0146
$$ 91710663 91687752 91852394 91775597 91572731 91486206 91311035 91191193 91374405 91676369 91636223
2279.8I1636223l36281k92328n2666L42575J96541j98616P2037K24770r003m2503j35857
$$ 91636223 91299942 91007614 90954948 91297523 91494064 91295448 91367485 91592255 91583252 91540749 91404892
2290.4I1404892j86638j80588j94122J01341K74811K80922Q7326k97104l24592k48200
$$ 91404892 91218254 91037666 90843544 90944885 91219696 91500618 91587944 91290840 90966248 90718048
2300I0718048q1474J58348Q2931N4482P6218j16288r4429P4753O516j36002j8219K05940
$$ 90718048 90636574 90794922 90877853 90932335 91008553 90892265 90797836 90872589 90879105 90743103 90724884 90930824
2311.6I0930824L6232K869j5976j53557Q9523j51969l01583J01532J81442Q9577j6685
$$ 90930824 90967056 90969925 90953949 90800392 90889915 90737946 90436363 90537895 90719337 90808914 90792229
2322.2I0792229j5862k99606l56918Q5273J78047J38184K27219J42280O8764L31589
$$ 90792229 90776367 90476761 90119843 90205116 90383163 90521347 90748566 90890846 90959610 91291199
2331.9I1291199o6155m50409J5030O85700L95088r05419o70784n5435L57216M58679
$$ 91291199 91225044 90774635 90789665 91475365 91870453 90965034 90294250 90238815 90596031 91054710
2341.5I1054710k85659R0164J03248k80967K35634J52122k57973P744J56166o20643
$$ 91054710 90769051 90859215 90962463 90681496 90917130 91069252 90811279 90819023 90975189 90354546
2351.2I0354546m28475O52901K87346L5545M61601J13160m26323j81977q86833j127205
$$ 90354546 89926071 90578972 90866318 90901863 91363464 91476624 91050301 90868324 89981491 88854286
2360.8H8854286L48046O54861Q8028j33545p889j92840k09374O5087q9974M92760L98346
$$ 88854286 89202332 89857193 89945221 89811676 89803787 89610947 89401573 89466660 89376686 89869446 90267792
2371.4I0267792l92700q17J88050m7890j87401l93799j53320J07391J04386J45240
$$ 90267792 89875092 89874275 90062325 90014435 89827034 89433235 89279915 89387306 89491692 89636932
2381.1H9636932N2002j15455k65061j47728J69571n3421k17064J59874J34087j97754
$$ 89636932 89688934 89573479 89308418 89160690 89330261 89276840 89059776 89219650 89353737 89155983
2390.7H9155983j83792J1558J7075L2410l6744l53759j34644J31035L7460k1186k38633
$$ 89155983 88972191 88983749 89000824 89033234 88996490 88642731 88508087 88639122 88676582 88655396 88416763
2401.3H8416763j32774q8646j64650J7075m3404J4420o8451k73590q3565Q7082J05903
$$ 88416763 88283989 88195343 88030693 88047768 88004364 88018784 87950333 87676743 87593178 87680260 87786163
2411.9H7786163m7752k43950j44928J7998j40228j18470r6130k25433J5182k1370j23077
$$ 87786163 87738411 87494461 87349533 87367531 87227303 87108833 87012703 86787270 86802452 86781082 86658005
2422.5H6658005j8753l6232j38405k26448k05696m35807j95663J35803o5201O2066
$$ 86658005 86639252 86603020 86464615 86238167 86032471 85596664 85401001 85536804 85471603 85533669
2432.2H5533669k7184k34978o2187J8936p4493j43738j49963r2232P7804O7566j12449
$$ 85533669 85506485 85271507 85209320 85228256 85153763 85010025 84860062 84767830 84845634 84913200 84800751
2442.8H4800751l37891l35754r4689J2093j92597m32334l0388J65085K2453P7797j36917
$$ 84800751 84462860 84127106 84032417 84044510 83851913 83419579 83389191 83554276 83576729 83654526 83517609
2453.4H3517609k83585l50349j56426J07430m0734n7907O4247L1639j41662j71967
$$ 83517609 83234024 82883675 82727249 82834679 82793945 82736038 82800285 82831924 82690262 82518295
2463H2518295j14326o8146j07536k30683k08953j05202J67274P6477k28058j21322
$$ 82518295 82403969 82335823 82228287 81997604 81788651 81683449 81850723 81927200 81699142 81577820
2472.7H1577820K006m6341j27159J1521J7746r5932j09475j66084p2471k4460N7579
$$ 81577820 81579826 81533485 81406326 81417847 81435593 81339661 81230186 81064102 80991631 80967171 81024750
2483.3H1024750K5131j76315k24701j40312Q2107M2290r0592r3284j45691m3900M4381
$$ 81024750 81049881 80873566 80648865 80508553 80590660 80632950 80542358 80449074 80303383 80259483 80303864
2493.9H0303864o7399j09458n7580j07826j9981J7105k02377j88546R896J29112J24138
$$ 80303864 80236465 80127007 80069427 79961601 79941620 79958725 79756348 79567802 79577698 79706810 79830948
2504.5G9830948j5656j54380j31211j3778L784r1774q0727m5250j98181l8574J11793
$$ 79830948 79815292 79660912 79529701 79515923 79519707 79427933 79347206 79301956 79103775 79065201 79176994
2515.1G9176994j69754j02394M3442j04805r4284q209M7828k9869k07473m9218M3732
$$ 79176994 79007240 78904846 78948288 78843483 78749199 78740990 78788818 78758949 78551476 78502258 78545990
2525.7G8545990n4306R0645K3392m28J37223p9995j63902p9376q6174n6870m5517j1917
$$ 78545990 78491684 78582329 78605721 78605293 78742516 78662521 78498619 78419243 78333069 78276199 78230682 78218765
2537.3G8218765L670j48743j37886M9614p431m6493p1282j00754n1757o0891M8874
$$ 78218765 78222435 78073692 77935806 77985420 77977989 77931496 77860214 77759460 77707703 77646812 77695686
2547.9G7695686Q3893M4762j10146j79260p4471j38084Q1177N7243k20917j64703k21764
$$ 77695686 77779579 77824341 77714195 77534935 77460464 77322380 77403557 77460800 77239883 77075180 76853416
2558.5G6853416p0991O9885j8387l0204j63361j98769j76185j69411k7618P8804P3448
$$ 76853416 76782425 76852310 76833923 76803719 76640358 76441589 76265404 76095993 76068375 76147179 76220627
2569.1G6220627j26213l65517j30623J32332r7999o0608L2318j77460k12189k24983
$$ 76220627 76094414 75728897 75598274 75730606 75632607 75571999 75604317 75426857 75214668 74989685
2578.7G4989685l5011j221j88690J0048j2581j62552j41136r2613m4823k04865j65649
$$ 74989685 74954674 74953453 74764763 74774811 74762230 74599678 74458542 74365929 74321106 74116241 73950592
2589.4G3950592j38344j97952O4262N3879j64398j09177j16722j98433j17599r0439
$$ 73950592 73812248 73614296 73678558 73732437 73568039 73458862 73342140 73143707 73026108 72935669
2599G2935669j23817j78216k40966j49819r2460j33004k06970j63231l2394l0815j28426
$$ 72935669 72811852 72633636 72392670 72242851 72150391 72017387 71810417 71647186 71614792 71583977 71455551
2609.6G1455551k20787j11504j82197k84470j00174j54396j53801l868o9771j49826
$$ 71455551 71234764 71123260 70941063 70656593 70556419 70402023 70248222 70244354 70174583 70024757
2619.3G0024757p0114o7367j54297r4788j53778j81740k5734k5787j91727j38343O416
$$ 70024757 69954643 69887276 69732979 69638191 69484413 69302673 69276939 69251152 69059425 68921082 68927498
2629.9F8927498k14111k38099o7344k3506m2504j89178j42090r8496l5041O172q5381
$$ 68927498 68713387 68475288 68407944 68384438 68341934 68152756 68010666 67912170 67877129 67883301 67797920
2640.5F7797920k9716j44799k47291p4051O9366n3787j30707j07246j37382O9801M7798
$$ 67797920 67768204 67623405 67376114 67302063 67371429 67317642 67186935 67079689 66942307 67012108 67059906
2651.1F7059906p5790o2371j21452l868M8210R003j40999j99455j02845q8386L1639
$$ 67059906 66984116 66921745 66800293 66796425 66844635 66853638 66712639 66513184 66410339 66321953 66353592
2661.7F6353592N615r6306j90788p2189J42029n1072j36581j47545j38168J8997J07963
$$ 66353592 66359207 66262901 66072113 65999924 66141953 66090881 65954300 65806755 65668587 65687584 65795547
2672.3F5795547N608j83365L5118N4306j30241m7783j09077k8077j3748j28051j6457
$$ 65795547 65801155 65617790 65652908 65707214 65576973 65529190 65420113 65392036 65378288 65250237 65233780
2682.9F5233780k4506j25663j32294p8697p8484o4545q445k4071o0646o2325p5218
$$ 65233780 65209274 65083611 64951317 64872620 64794136 64729591 64721146 64697075 64636429 64574104 64498886
2693.5F4498886j17912m3205l4813q4221j46080j63285M1356o5972j88263j46801j61812
$$ 64498886 64380974 64337769 64302956 64218735 64072655 63909370 63950726 63884754 63696491 63549690 63387878
2704.1F3387878m6508k40891j57997J80973r6970l00575j20102m3541j30352k06024
$$ 63387878 63341370 63100479 62942482 63123455 63026485 62725910 62605808 62562267 62431915 62225891
2713.8F2225891k09381r9453j09001j98441j30600k4833L7670j40793k07222k20844
$$ 62225891 62016510 61917057 61808056 61609615 61479015 61454182 61491852 61351059 61143837 60922993
2723.4F0922993k38682l0602p8083j38912k19093j74381j02284k31979p5951k02701
$$ 60922993 60684311 60653709 60575626 60436714 60217621 60043240 59940956 59708977 59633026 59430325
2733E9430325j67977K6459j98753j46901j1398l6735k00146j88122n5115o5998k6237
$$ 59430325 59262348 59288807 59090054 58943153 58931755 58895020 58694874 58506752 58451637 58385639 58359402
2743.7E8359402j42815j85745j83693j58287n3295k7481r7058k67727j23928n7495
$$ 58359402 58216587 58030842 57847149 57688862 57635567 57608086 57511028 57243301 57119373 57061878
2753.3E7061878j71928o7063j11770k73075j49254N2574j42159j85237J7521p0622
$$ 57061878 56889950 56822887 56711117 56438042 56288788 56341362 56199203 56013966 56031487 55960865
2762.9E5960865k24842l01228k04952j20205j34933k0535o8893k77352j64722j24508
$$ 55960865 55736023 55434795 55229843 55109638 54974705 54954170 54885277 54607925 54443203 54318695
2772.6E4318695k34917o9088j23222j30295j45210l39336j51730j69628k30652j45035
$$ 54318695 54083778 54014690 53891468 53761173 53615963 53276627 53124897 52955269 52724617 52579582
2782.2E2579582j61972j72127k51072j11209k24545l41469m0973j36650l45761k90947
$$ 52579582 52417610 52245483 51994411 51883202 51658657 51317188 51276215 51139565 50793804 50502857
2791.9E0502857k51404k69771k17735j22391k27413l42602k81750k42706j63853j09466
$$ 50502857 50251453 49981682 49763947 49641556 49414143 49071541 48789791 48547085 48383232 48273766
2801.5D8273766k37259k53952l09601l75973k33047k80049k52910j31913k89673m49790
$$ 48273766 48036507 47782555 47472954 47096981 46863934 46583885 46330975 46199062 45909389 45459599
2811.2D5459599m74537k19246o7059k77389k51679k64313l71078k62547k71816j67610
$$ 45459599 44985062 44765816 44698757 44421368 44169689 43905376 43534298 43271751 42999935 42832325
2820.8D2832325k19929m92180l09494j79367k73033k80331k01164j59393l76110l78433
$$ 42832325 42612396 42120216 41810722 41631355 41358322 41077991 40876827 40717434 40341324 39962891
2830.4C9962891k65389l32607j98086k01534l82229k99168k60940k97878k45339k41554
$$ 39962891 39697502 39364895 39166809 38965275 38583046 38283878 38022938 37725060 37479721 37238167
2840.1C7238167k10846k78408l33653k79770l05172k68009l66287n08522l52818j75231
$$ 37238167 37027321 36748913 36415260 36135490 35830318 35562309 35196022 34687500 34334682 34159451
2849.7C4159451k15584l36689l25856k49118l00892n00378m32453k61957l59226l85802
$$ 34159451 33943867 33607178 33281322 33032204 32731312 32230934 31798481 31536524 31177298 30791496
2859.4C0791496l22342k80277m21575l81474j88059n07414n82731l16801l49031l93313
$$ 30791496 30469154 30188877 29767302 29385828 29197769 28690355 28107624 27790823 27441792 27048479
2869B7048479l56403l99435l85849k73592l45093l31850j72503k08902k45466j72520
$$ 27048479 26692076 26292641 25906792 25633200 25288107 24956257 24783754 24574852 24329386 24156866
2878.7B4156866j23209j38071o6151j9455r359J15648N9420l4243J50286K20793J08658
$$ 24156866 24033657 23895586 23829435 23809980 23800621 23916269 23975689 23941446 24091732 24312525 24421183
2889.3B4421183K08711J92366J5896J02136L25068K76157j9150J22025L30957K33609
$$ 24421183 24629894 24822260 24838156 24940292 25265360 25541517 25522367 25644392 25975349 26208958
2898.9B6208958K07449J45080J21227J29683J34903N9063K0227k2897j59224J6995
$$ 26208958 26416407 26561487 26682714 26812397 26947300 27006363 27026590 27003693 26844469 26861464
2908.6B6861464M7714o6776J2660j33226l64612j81317j1564l03370l47892j67881
$$ 26861464 26909178 26842402 26855062 26721836 26357224 26175907 26164343 25860973 25513081 25345200
2918.2B5345200k18514l66424l24219r6178j60193l51688l10015J6829m7066l24356
$$ 25345200 25126686 24760262 24436043 24339865 24179672 23827984 23517969 23534798 23487732 23163376
2927.8B3163376j79300k15102j89672j23455j24842k2720j79234j04603J17525J2105
$$ 23163376 22984076 22768974 22579302 22455847 22331005 22308285 22129051 22024448 22141973 22154078
2937.5B2154078Q2464J08219j35874L3520J07048R0677K28710J3579Q8688J08585J51831
$$ 22154078 22236542 22344761 22208887 22242407 22349455 22440132 22668842 22682421 22771109 22879694 23031525
2948.1B3031525M41723J39261j10140L4084L35215L49394K03726L57124L91432M53430
$$ 23031525 23473248 23612509 23502369 23536453 23871668 24221062 24424788 24781912 25173344 25626774
2957.7B5626774M96183L51210K78850M06939M92342N26646N66734N21728O36807N94572
$$ 25626774 26122957 26474167 26753017 27159956 27652298 28178944 28745678 29267406 29904213 30498785
2967.4C0498785O23892P75305O92701P24133Q29132R43439Q15846O70200P44160O71428
$$ 30498785 31122677 31897982 32590683 33314816 34143948 35087387 35903233 36573433 37317593 37989021
2977C7989021O63285P85778R69970R07956N01655M84734O77509O82846P00752M88140
$$ 37989021 38652306 39438084 40408054 41316010 41817665 42302399 42979908 43662754 44363506 44851646
2986.7D4851646L31116L40771K82493M99039M92214L04200K44743K8892O8978K02881
$$ 44851646 45182762 45523533 45806026 46305065 46797279 47101479 47346222 47375114 47444092 47646973
2996.3D7646973J90014J85649J61492J09901q3374m0802R3128j56120q3683J41152
$$ 47646973 47836987 48022636 48184128 48294029 48210655 48169853 48262981 48106861 48023178 48164330
3006D8164330J6700N5504J7632K3964k7443l53379k68180j73180n2372J03195p1140
$$ 48164330 48181030 48236534 48254166 48278130 48250687 47897308 47629128 47455948 47403576 47506771 47435631
3016.6D7435631j10348j53263j60347o9069k14142l75313k54581j28708r3784j03703
$$ 47435631 47325283 47172020 47011673 46942604 46728462 46353149 46098568 45969860 45876076 45772373
3026.2D5772373j78665j17371k33028k51930j70979k08332q5247k37820k40284j98802
$$ 45772373 45593708 45476337 45243309 44991379 44820400 44612068 44526821 44289001 44048717 43849915
3035.9D3849915l28022j71944j38806j16828j52451k83085l01823k26249m5113j22482
$$ 43849915 43521893 43349949 43211143 43094315 42941864 42658779 42356956 42130707 42085594 41963112
3045.5D1963112k75528k20676k21360j78356r0042l15117l41694k03121k76802j16612
$$ 41963112 41687584 41466908 41245548 41067192 40977150 40662033 40320339 40117218 39840416 39723804
3055.1C9723804j55006l02536k24903j95644k18739l05389j65165k54544m42642j86958
$$ 39723804 39568798 39266262 39041359 38845715 38626976 38321587 38156422 37901878 37459236 37272278
3064.8C7272278q3199r2876j12827k74182l46157k87376k19067l06065l35506j93836
$$ 37272278 37189079 37096203 36983376 36709194 36363037 36075661 35856594 35550529 35215023 35021187
3074.4C5021187j82419j89239k31602k77474q8859k39594l99612m8512P740k81967
$$ 35021187 34838768 34649529 34417927 34140453 34051594 33812000 33412388 33363876 33371616 33089649
3084.1C3089649l04474k35531l65501k89637j17778j95649k54037j31232j42456l29599
$$ 33089649 32785175 32549644 32184143 31894506 31776728 31581079 31327042 31195810 31053354 30723755
3093.7C0723755k19757k39742k77983j23051j93426j92396k62057j63427j03470l20039
$$ 30723755 30503998 30264256 29986273 29863222 29669796 29477400 29215343 29051916 28948446 28628407
3103.4B8628407k58984j50686r1395k03619k78265j77654j17426j83294k61114r2989
$$ 28628407 28369423 28218737 28127342 27923723 27645458 27467804 27350378 27167084 26905970 26812981
3113B6812981j49023k24766k43420l66295j79252m3745k32142l03757p5586o5517j34457
$$ 26812981 26663958 26439192 26195772 25829477 25650225 25606480 25374338 25070581 24994995 24929478 24795021
3123.6B4795021j34243k49399k88988j75390O0285j19852k30602j31506k65152j79182
$$ 24795021 24660778 24411379 24122391 23947001 24007286 23887434 23656832 23525326 23260174 23080992
3133.3B3080992j84435j72846j7061n2531k27394k43934n9952j44678j61282K4260
$$ 23080992 22896557 22723711 22706650 22654119 22426725 22182791 22122839 21978161 21816879 21841139
3142.9B1841139r6352k89650j35412j42979j77229K0550k14317l26887j91046M8460
$$ 21841139 21744787 21455137 21319725 21176746 20999517 21020067 20805750 20478863 20287817 20336277
3152.5B0336277J62395k11578k22389j49260j27277r1826k28736p8324o9690k35421
$$ 20336277 20498672 20287094 20064705 19915445 19788168 19696342 19467606 19389282 19319592 19084171
3162.2A9084171j54052j210p0533k30332j80069p9765k5730R99j27580k33778o5346
$$ 19084171 18930119 18928909 18858376 18628044 18447975 18368210 18342480 18343479 18215899 17982121 17916775
3172.8A7916775m3028j16120k5753j5592r9573k42518j61207m0937p3170q3839j60361
$$ 17916775 17873747 17757627 17731874 17716282 17616709 17374191 17212984 17172047 17098877 17015038 16854677
3183.4A6854677j71728o7633r637p0832o7190k7931k5482n7497j80994j22700J8507
$$ 16854677 16682949 16615316 16605679 16534847 16467657 16439726 16414244 16356747 16175753 16053053 16071560
3194A6071560l9078j95373k10472j09853O3262M9607k10806j72233r3798k1146L2087
$$ 16071560 16032482 15837109 15626637 15516784 15580046 15629653 15418847 15246614 15152816 15131670 15163757
3204.6A5163757j89730j34734N8609N1058j8761j51072q6927J16756q8376k21791l8285
$$ 15163757 14974027 14839293 14897902 14948960 14930199 14779127 14692200 14808956 14720580 14498789 14460504
3215.2A4460504n0695p3711j48651j24948j01438N6381J27147k86045r8568Q9530k6291
$$ 14460504 14409809 14336098 14187447 14062499 13961061 14017442 14144589 13858544 13759976 13849506 13823215
3225.8A3823215p0177j56501Q9983J6126p4377j29766j99078J13636N3375o6405q1822
$$ 13823215 13753038 13596537 13686520 13702646 13628269 13498503 13299425 13413061 13466436 13400031 13318209
3236.4A3318209j75578L8507J21311j40641j50646j05104j10522l2147q8362N6139
$$ 13318209 13142631 13181138 13302449 13161808 13011162 12906058 12795536 12763389 12675027 12731166
3246.1A2731166Q751l0692N8073r8404m9798j29347j14317j5667k1222K6962q4259
$$ 12731166 12739917 12709225 12767298 12668894 12619096 12489749 12375432 12359765 12338543 12365505 12281246
3256.7A2281246K8118M3551j67666j90917m6038L1490L2577l4214j2858J27023j42783
$$ 12281246 12309364 12352915 12185249 11994332 11948294 11979784 12012361 11978147 11965289 12092312 11949529
3267.3A1949529j04388M5695j3290O2314j24043K2849j7050j74727P5676M8595M0068
$$ 11949529 11845141 11890836 11877546 11939860 11815817 11838666 11821616 11646889 11722565 11771160 11811228
3277.9A1811228r9919j66120M3388K8855M2516R1864n0209r7498r9530p9567L6179
$$ 11811228 11711309 11545189 11588577 11617432 11659948 11751812 11701603 11604105 11504575 11425008 11461187
3288.5A1461187j9131O8440o9931j79750O0454q4780J7557L2692q2736j3129j40243
$$ 11461187 11442056 11510496 11440565 11260815 11321269 11236489 11254046 11286738 11204002 11190873 11050630
3299.1A1050630O0364P7970o5631J1682r9653p5289R2004L3803j0386r0100k29143
$$ 11050630 11110994 11188964 11123333 11135015 11035362 10960073 11052077 11085880 11075494 10985394 10756251
3309.7A0756251L0934J54142q889j53238j12869R6395M2630M7448K720K0310K9058
$$ 10756251 10787185 10941327 10932438 10779200 10666331 10762726 10805356 10852804 10855524 10875834 10904892
3320.3A0904892j62485M6145R9692K0367R5348o0597j52443l2933Q079k765l6066p2747
$$ 10904892 10742407 10788552 10888244 10908611 11003959 10943362 10790919 10757986 10766065 10763300 10727234 10654487
3331.9A0654487J2668j27216o7253J07002J022K9945p246O7842O41l6656O7884n8673
$$ 10654487 10667155 10539939 10472686 10579688 10580710 10610655 10603409 10671251 10671892 10635236 10703120 10644447
3343.5A0644447L2620o8808n3465J20669j20824r7585J17869j3414j13286j1817N7593
$$ 10644447 10677067 10608259 10554794 10675463 10554639 10457054 10574923 10561509 10448223 10436406 10493999
3354.1A0493999R4203j07156o3777O7809k0148R2513p0022p1645O8584J7023o9700
$$ 10493999 10588202 10481046 10417269 10485078 10464930 10557443 10487421 10415776 10484360 10501383 10431683
3364.7A0431683r7167K38125J17393j46149j2689J65119P7379j71279m4740K7133p067
$$ 10431683 10334516 10572641 10690034 10543885 10531196 10696315 10773694 10602415 10557675 10584808 10577741
3375.3A0577741J6641k3527j06845N4915J75708L692O1879n6607j06948j07275N525
$$ 10577741 10594382 10570855 10464010 10518925 10694633 10698325 10760204 10703597 10596649 10489374 10494899
3385.9A0494899J76608j46897N721M2972k2899J79265l8805m548J48002p4219l08260
$$ 10494899 10671507 10524610 10530331 10573303 10550404 10729669 10690864 10686316 10834318 10760099 10451839
3396.5A0451839o657J96507n2341q7960Q7121J59625o649J25924R1429q4239k2082
$$ 10451839 10445182 10641689 10589348 10501388 10588509 10748134 10741485 10867409 10958838 10874599 10852517
3407.1A0852517o8822O0079J0459L6805P7607n1423J44162J69172k9638j17578M613
$$ 10852517 10783695 10843774 10854233 10891038 10968645 10917222 11061384 11230556 11200918 11083340 11087953
3417.7A1087953Q4852k6793o8617M4370k8956j57283L2989J58651J01804q1465j229
$$ 11087953 11172805 11146012 11077395 11121765 11092809 10935526 10968515 11127166 11228970 11147505 11146276
3428.3A1146276J04102M1413J94937K266m4597R8022o266j3847N5815J03126n6482
$$ 11146276 11250378 11291791 11486728 11488994 11444397 11542419 11536153 11522306 11578121 11681247 11624765
3439A1624765q6430J9435J10297J26957p4276j08920J9118K5897k497R1318P3039J48385
$$ 11624765 11538335 11557770 11668067 11795024 11720748 11611828 11630946 11656843 11654346 11745664 11818703 11967088
3450.5A1967088m856m6008J89549n7689J4253K0238Q2266K51622j85455r4222J42185
$$ 11967088 11962232 11916224 12105773 12048084 12062337 12082575 12164841 12416463 12231008 12136786 12278971
3461.1A2278971K47515Q7493k21815N7532J23306J02146L7775j42355J14890K67943
$$ 12278971 12526486 12613979 12392164 12449696 12573002 12675148 12712923 12570568 12685458 12953401
3470.8A2953401j0826N604O6835M855J07516l6035Q3985J07415P726J19084K9388J30378
$$ 12953401 12942575 12948179 13015014 13019869 13127385 13091350 13175335 13282750 13290476 13409560 13438948 13569326
3482.3A3569326j62756j22551K66222J04772Q5876N8588Q3345L6100j77308R4303L06311
$$ 13569326 13406570 13284019 13550241 13655013 13740889 13799477 13882822 13918922 13741614 13835917 14142228
3493A4142228L0299L4513K27523J25163r6882j73660L12772M42429J35656j1267j62341
$$ 14142228 14172527 14207040 14434563 14559726 14462844 14289184 14601956 15044385 15180041 15168774 15006433
3503.6A5006433O8141M688J19408K13015Q4283K38031m4615m6259J44749J22062Q4328
$$ 15006433 15074574 15079262 15198670 15411685 15495968 15733999 15689384 15643125 15787874 15909936 15994264
3514.2A5994264J09460J19600J35359K53599j6260Q3597J73309l7145O1698M4238K4095
$$ 15994264 16103724 16223324 16358683 16612282 16596022 16679619 16852928 16815783 16877481 16921719 16945814
3524.8A6945814Q7786M92216M13973l4195J5129O8586K69768J25038m4584N3965Q7190
$$ 16945814 17033600 17525816 17939789 17905594 17920723 17989309 18259077 18384115 18339531 18393496 18480686
3535.4A8480686K41879L52014J60994Q1222P0301j06372J96563L21940J53351K27779
$$ 18480686 18722565 19074579 19235573 19316795 19387096 19280724 19477287 19799227 19952578 20180357
3545B0180357K98700M28284J83523K02883K61322J73676R8155J34142K89568r180J68133
$$ 20180357 20479057 20907341 21090864 21293747 21555069 21728745 21826900 21961042 22250610 22241430 22409563
3555.6B2409563L38627L61986K49624N8314K18191K78168M44955K02032M39213M82842
$$ 22409563 22748190 23110176 23359800 23418114 23636305 23914473 24359428 24561460 25000673 25483515
3565.3B5483515J56959N27750k37188K46601M69200L09479L50750K49508M85201J54836
$$ 25483515 25640474 26168224 25931036 26177637 26646837 26956316 27307066 27556574 28041775 28196611
3574.9B8196611L26641N17840M62480L91814J04871L76500L51322L01943L27320O33486
$$ 28196611 28523252 29041092 29503572 29895386 30000257 30376757 30728079 31030022 31357342 31990828
3584.6C1990828N29249J66431O50150L25783O01559P79774O05449L49053K24151N91481
$$ 31990828 32520077 32686508 33336658 33662441 34264000 35043774 35649223 35998276 36222427 36813908
3594.2C6813908M86328O12297M69410M25285P22370O47389M10804M68045P92247O53187
$$ 36813908 37300236 37912533 38381943 38807228 39529598 40176987 40587791 41055836 41848083 42501270
3603.9D2501270N90344N26359N00100N85075N05615N01679O96449P52155L14091M96490
$$ 42501270 43091614 43617973 44118073 44703148 45208763 45710442 46406891 47159046 47473137 47969627
3613.5D7969627O11382P69344R24259N51499O70650N92503P67170O37184O04500O90124
$$ 47969627 48581009 49350353 50274612 50826111 51496761 52089264 52856434 53493618 54098118 54788242
3623.1E4788242N16167Q86993R08848Q41027P49084O04862M56131L53714P05715P45034
$$ 54788242 55304409 56191402 57100250 57941277 58690361 59295223 59751354 60105068 60810783 61555817
3632.8F1555817O00380M10431O24393N71720O62834R09401O00022O18858O94054R06417
$$ 61555817 62156197 62566628 63191021 63762741 64425575 65334976 65934998 66553856 67247910 68154327
3642.4F8154327O24611M40003O80534N44289P14737Q82995R94133O81412N66559K68738
$$ 68154327 68778938 69218941 69899475 70443764 71158501 72041496 73035629 73717041 74283600 74552338
3652.1G4552338K63870O02836O00159O51711L61862O94717N99953M42047O34186N03937
$$ 74552338 74816208 75419044 76019203 76670914 77032776 77727493 78327446 78769493 79403679 79907616
3661.7G9907616N88821K76550M30169M29336L14537O74164M18129J044815J165222
$$ 79907616 80496437 80772987 81203156 81632492 81947029 82621193 83039322 84084137 85249359
3670.4H5249359l51311k97378L48999J029686J765350M78020q63342K7565L91403J67427
$$ 85249359 84898048 84600670 84949669 85979355 87744705 88222725 87359383 87386948 87778351 87945778
3680H7945778Q1139L14155L41538K59697L87825M5112K39678N45524J30562J66313
$$ 87945778 88026917 88341072 88682610 88942307 89330132 89375244 89614922 90160446 90291008 90457321
3689.7I0457321J95122K24220K32567L58002Q1329J34361M12850Q911q6075J67244
$$ 90457321 90652443 90876663 91109230 91467232 91548561 91682922 92095772 92104683 92018608 92185852
3699.3I2185852M44466L92456l815k73437K09144K47963j80351K02705L65006L90373
$$ 92185852 92630318 93022774 93018959 92745522 92954666 93202629 93022278 93224983 93589989 93980362
3709I3980362k74910K1912R13665n92620j08078P3356j53046J7533J65657M47777J42021
$$ 93980362 93705452 93727364 94641029 94048409 93940331 94013687 93860641 93878174 94043831 94491608 94633629
3719.6I4633629j74309L21693M41063n28968K17308M61120j3458l9047k37198K65335
$$ 94633629 94459320 94781013 95222076 94693108 94910416 95371536 95358078 95319031 95081833 95347168
3729.2I5347168J8730J62254N03067l94020L64014O7772p58415P217P02400j3191l83179
$$ 95347168 95365898 95528152 96031219 95637199 96001213 96068985 95310570 95317787 96020187 96006996 95623817
3739.8I5623817K78489j37070J52511R08043J070267j823891l25187M28772J82960
$$ 95623817 95902306 95765236 95917747 96825790 97896057 96072166 95746979 96175751 96358711
3748.5I6358711K8786n65369N06241L50929j336914J40328M35478K75009n7800J60408
$$ 96358711 96387497 95822128 96328369 96679298 95342384 95482712 95918190 96193199 96135399 96295807
3758.2I6295807N32928k60841n33897P5950L11638J12854K08840J21170k70791K8939
$$ 96295807 96828735 96567894 96033997 96109947 96421585 96534439 96743279 96864449 96593658 96622597
3767.8I6622597K18872J43104k91244n2628j2184K8839J83060R8091R7687M9591K17895
$$ 96622597 96841469 96984573 96693329 96640701 96628517 96657356 96840416 96938507 97036194 97085785 97303680
3778.4I7303680N5863o83968r643M11201L4317j02455n5351P797K23541j58661K5269
$$ 97303680 97359543 96675575 96665932 97077133 97111450 97008995 96953644 96961441 97184982 97026321 97051590
3789I7051590L48312j38626K3674Q7136j84105m2473o5827m12010j19041L74611L29139
$$ 97051590 97399902 97261276 97284950 97372086 97187981 97145508 97079681 96667671 96548630 96923241 97252380
3799.6I7252380M33525K07192r40445j4175K60330R5138J07918q6143p7012R6932J15692
$$ 97252380 97685905 97893097 96952652 96938477 97198807 97293945 97401863 97315720 97238708 97335640 97451332
3810.2I7451332l7506k34451p7065Q1635N22430O90666r63676j10840L57491K87071
$$ 97451332 97413826 97179375 97102310 97183945 97706375 98397041 97433365 97322525 97680016 97967087
3819.9I7967087l02918q56178K42493m2816J49780O08467N16434m44771m41513J75247
$$ 97967087 97664169 96807991 97050484 97007668 97157448 97765915 98282349 97837578 97396065 97571312
3829.5I7571312K44072K71789m99877q3008Q45947j02860q56452K15850L00545k77992
$$ 97571312 97815384 98087173 97587296 97504288 98350235 98247375 97390923 97606773 97907318 97629326
3839.2I7629326K04353m71077p1312O43448n87n82550j74385j1887k52602R6192L47908
$$ 97629326 97833679 97362602 97291290 97934738 97934151 97351601 97177216 97165329 96912727 97008919 97356827
3849.8I7356827O4735L51212J32202P97417k42623j134910j13701j47507J41754N4863
$$ 97356827 97421562 97772774 97904976 98702393 98459770 97324860 97211159 97063652 97205406 97260269
3859.4I7260269K14585M06929l40966m52575O4323K00005k16034k0371K73361M50783
$$ 97260269 97474854 97881783 97540817 97088242 97152565 97352570 97136536 97116165 97389526 97840309
3869.1I7840309l03268n69924j26754Q9088Q27423l49998m50371J91459j27784K11662
$$ 97840309 97537041 96967117 96840363 96929451 97756874 97406876 96956505 97147964 97020180 97231842
3878.7I7231842M50783l3066o67694J8166L63029Q0574K10846l87352k31545J09124
$$ 97231842 97682625 97649559 96981865 97000031 97363060 97443634 97654480 97267128 97035583 97144707
3888.3I7144707K0469N9868j75239m77402R2987M73061J5640j69243K2186m188k64595
$$ 97144707 97165176 97225044 97049805 96572403 96665390 97138451 97154091 96984848 97007034 97002846 96738251
3898.9I6738251o34369L14171M92965J72036P2410n06592j56074l4516j42219l8529
$$ 96738251 96103882 96418053 96911018 97083054 97155464 96648872 96492798 96458282 96316063 96277534
3908.6I6277534p3791o1226l2417K17186N2696j81465J81061J27128m95720n23201
$$ 96277534 96203743 96142517 96110100 96327286 96379982 96198517 96379578 96506706 96010986 95487785
3918.2I5487785O1913L99025J33270O3698J87881j40998m95095k30308J14929K86522
$$ 95487785 95549698 95948723 96081993 96145691 96333572 96192574 95697479 95467171 95582100 95868622
3927.9I5868622R6229n14816l62587J28662J206m7570J70975L4775k00363K1202J17653
$$ 95868622 95964851 95450035 95087448 95216110 95217316 95169746 95340721 95375496 95175133 95196335 95313988
3938.5I5313988J5960N4810R4795J30120l04627k66891o4408j73668J75888J90392
$$ 95313988 95329948 95384758 95479553 95609673 95305046 95038155 94973747 94800079 94975967 95166359
3948.1I5166359k5879J10298m2854j7830L3646k02149k65747j51253N2437K86499J73844
$$ 95166359 95140480 95250778 95207924 95190094 95223740 95021591 94755844 94604591 94657028 94943527 95117371
3958.7I5117371q8242L2860L05656q6029l81477L4515O6368o7306j55945k87125o5971
$$ 95117371 95029129 95061989 95367645 95281616 94900139 94934654 95001022 94933716 94777771 94490646 94424675
3969.3I4424675l5034j57265r8411L387p4356O584O1707k30454O7772K47147m0177
$$ 94424675 94389641 94232376 94133965 94137352 94062996 94069580 94131287 93900833 93968605 94215752 94175575
3980I4175575j47178k31705k9282J07514m814o4316k4735M6135j5495K1347L4508M104
$$ 94175575 94028397 93796692 93767410 93874924 93870110 93805794 93781059 93827194 93811699 93833046 93867554 93871658
3991.5I3871658k1873p8278J32920K060l72269k18414K3323K82791J88057
$$ 93871658 93849785 93771507 93904427 93906487 93534218 93315804 93339127 93621918 93809975
4000.2I3809975
$$ 93809975
##END=$$ End of the data block
