##TITLE=GLI $$ Begin of the data block
##JCAMP-DX=5.00 $$ ACD/SpecManager v 10.08
##DATE=14 Dec 2016 11:32:28
##DATA TYPE=INFRARED SPECTRUM
##DATA CLASS=XYDATA
##ORIGIN=Marcelo Quint
##OWNER=
##NPOINTS=1765
##FIRSTX=399.77209473
##LASTX=3997.72216797
##MAXX=3997.72216797
##MINX=399.77209473
##MAXY=0.75647819
##MINY=0.28447890
##XFACTOR=1.0000000000
##YFACTOR=1.000000000000000e-9
##FIRSTY=0.71356040
##DELTAX=2.03965425
##XUNITS=1/CM
##YUNITS=ARBITRARY UNITS
##XYDATA=(X++(Y..Y))
399.8G13560402p43270m14311Q1300k54512o75678o50823l97980j54138Q3149l96669
420.2G10037470j048327j162529j018524o90698o01590o78241r98378j056910q41737
438.5G01940536q12411p60913m92572k95878m75705p24852p80523m55677m12643p99894
458.9F95929468q60274o05703m07517l26573m7565J01566Q35J16706M73082P19428
479.3F95093453P84516Q71539R19760R18746R67323J126409J172960R18686P06077
497.7G03479469O47127N69463L84867M3512k51591l65377m20630n44667n60701n02944
518.1G02478528n62191l95775j98304p4566J83642L81112M95792O02781O37770M40657
538.5G03989446L06845J86324k0862j38938k93076m33385n57304n41389n24700n22136
$$ plain form
399.8 713560402 712817132 712402821 712484121 712229609 711553931 710903108 710505128 710350990 710434139 710037470
420.2 710037470 708989143 707826614 706808090 706117392 705515802 704837561 703839183 702782273 701940536
438.5 701940536 701128125 700367212 699874640 699578762 699103057 698378205 697597682 697142005 696729362 695929468
458.9 695929468 695069194 694463491 694055974 693729401 693681836 693783402 693784237 693900943 694374025 695093453
479.3 695093453 695877969 696749508 697669268 698588014 699555337 700681746 701854706 702773392 703479469
497.7 703479469 704126596 704696059 705080926 705124438 704872847 704507470 704086840 703542173 702981472 702478528
518.1 702478528 701916337 701520562 701322258 701247692 701431334 701812446 702308238 702911019 703548789 703989446
538.5 703989446 704296291 704482615 704461753 704322815 704029739 703596354 703039050 702497661 701972961 701450825
558.9G01450825m94957m38094l57628n98669p15375o59645n65529k22921K97606P05957
579.3F98401570Q75831J025796R26018Q10384P08998M84705L17573J62125Q2075m4107
599.7G03750968p6532n1260j0193Q0765K06410M10319L58164K47002N14090J144051
620.1G06573784J544118J499415J343965J103461Q65936O01173M22835L36170K50519
638.4G14541376K56300J67906P2837K7418L9279Q8096L8743K3127R7990K04146K47538
660.8G15804756K10643o07312j956642k13981K516330J949906J116574J048744J093268
679.2G20962286J060188J051426J012027R06527P83205O70314N35905L71456K12133
697.6G27565467J40190J47760J94908L05712M24444N24402O95586Q53896Q73983Q51751
$$ plain form
558.9 701450825 700955868 700517774 700160146 699561477 698846102 698186457 697620928 697398007 697695613 698401570
579.3 698401570 699277401 700303197 701229215 702039599 702748597 703233302 703550875 703713000 703795075 703750968
599.7 703750968 703674436 703623176 703612983 703693748 703900158 704310477 704668641 704915643 705429733 706573784
620.1 706573784 708117902 709617317 710961282 712064743 712930679 713531852 713954687 714290857 714541376
638.4 714541376 714797676 714965582 715038419 715065837 715105116 715193212 715231955 715255082 715353072 715557218 715804756
660.8 715804756 716015399 715408087 713451445 713237464 715753794 717703700 718820274 719869018 720962286
679.2 720962286 722022474 723073900 724085927 724992454 725775659 726445973 726981878 727353334 727565467
697.6 727565467 727705657 727853417 728048325 728354037 728778481 729302883 729998469 730852365 731726348 732578099
718G32578099J004755J294852J309394J090706R34005Q59379Q52883P96497O45280
736.3G41365850N03063M27485L29315K15769J48714L57j90913l28839m01616l44455
756.7G41724730j39118R9123L07262N34951O97911P83086P29084N61118M86553M52578
777.1G46237278M15564M15861M99189N47826M71294M03941M12047M69684M66407M94778
797.5G50833869N70893N76496N10753M36365M11630L65138L33309L41416M48763N24580
817.9G55353212M65930L71575K05577Q1896o4849k31624l03924l15309k89142k53737
838.3G55019605j56522r7155j07229j96815k48730k03430k05219j95205k29419j86264
858.7G53193617m5777J18673L25799M84944O09040N72741M51446K78174P4089j30951
$$ plain form
718 732578099 733582854 734877706 736187100 737277806 738211811 739071190 739924073 740720570 741365850
736.3 741365850 741868913 742296398 742625713 742841482 742990196 742990553 742799640 742470801 742069185 741724730
756.7 741724730 741585612 741684735 741991997 742526948 743224859 744007945 744737029 745298147 745784700 746237278
777.1 746237278 746652842 747068703 747567892 748115718 748587012 748990953 749403000 749872684 750339091 750833869
797.5 750833869 751404762 751981258 752492011 752928376 753340006 753705144 754038453 754379869 754828632 755353212
817.9 755353212 755819142 756190717 756396294 756478190 756413341 756181717 755877793 755562484 755273342 755019605
838.3 755019605 754863083 754765928 754658699 754461884 754213154 754009724 753804505 753609300 753379881 753193617
858.7 753193617 753147840 753266513 753592312 754077256 754686296 755259037 755710483 755988657 756062746 755931795
879.1G55931795m62294q48234j266718j546919j703560j739919j604736j399100j080036
897.5G44280279p51317m45664l30627m30941o45161r29475j129985j316964j415015
915.8G36885130j466691j470268j384973j264155j045704q68023p18891n91457m32432
934.2G27642536l09884l38972l76999m37022m86791o19948q40783j189053j666367
952.5G21376717k037883k316832k460063k567887k644658k671898k754807k816975
968.8G01105714k927423l095030l357172l680826m035055m358590m446208m339636
985.2F70865774m062652l682793l211856k704739k292097j977563j809179j732827
1001.5F49392068j779556j962185k303004k771497l163457l395855l395975l190517
$$ plain form
879.1 755931795 755469501 754621267 753354549 751807630 750104070 748364151 746759415 745360315 744280279
897.5 744280279 743528962 743083298 742752671 742321730 741676569 740747094 739617109 738300145 736885130
915.8 736885130 735418439 733948171 732563198 731299043 730253339 729385316 728666425 728074968 727642536
934.2 727642536 727332652 726993680 726616681 726179659 725692868 725072920 724232137 723043084 721376717
952.5 721376717 719338834 717022002 714561939 711994052 709349394 706677496 703922689 701105714
968.8 701105714 698178291 695083261 691726089 688045263 684010208 679651618 675205410 670865774
985.2 670865774 666803122 663120329 659908473 657203734 654911637 652934074 651124895 649392068
1001.5 649392068 647612512 645650327 643347323 640575826 637412369 634016514 630620539 627430022
1017.8F27430022k817393k329647j812935j306832r11474o11305m06206k94924k45630
1036.1F16693676k45512k75850l39806l56555k70009n8651J76191M15623P78675J208782
1056.5F17726564J625777K003491K284765K202093J553953M33982q34227j719356j866757
1074.9F23410285j268626k72691O61075J283705J581252J630604J477063J176119P73310
1093.3F30452096L16143j29878m27425n05328m09067j58548J89245N25534P92086J056790
1113.7F31701648J294196J393676J349926J269161J322031J479149J731992K168834
1130F43710613K454877K223432J618564Q71778P1585o31094j139641j419782j483798
1148.3F46276534j399696j158178p39575j78337M08352R52899J450777J845479K053500
$$ plain form
1017.8 627430022 624612629 622282982 620470047 619163215 618251741 617640436 617234230 616939306 616693676
1036.1 616693676 616448164 616172314 615832508 615475953 615205944 615147293 615323484 615739107 616517782 617726564
1056.5 617726564 619352341 621355832 623640597 625842690 627396643 627830625 626996398 625277042 623410285
1074.9 623410285 622141659 621868968 622530043 623813748 625395000 627025604 628502667 629678786 630452096
1093.3 630452096 630768239 630638361 630210936 629705608 629296541 629137993 629327238 629852772 630644858 631701648
1113.7 631701648 632995844 634389520 635739446 637008607 638330638 639809787 641541779 643710613
1130 643710613 646165490 648388922 650007486 650879264 650950849 650319755 649180114 647760332 646276534
1148.3 646276534 644876838 643718660 642979085 642800748 643209100 644161999 645612776 647458255 649511755
1166.7F49511755K070426K014220J894295J690686J418233J123190Q79943O78003N13077
1185F61793828L47853J68383l9101k34663l67463m69446m68671l67642j80602O6221
1205.4F60248697L01778M74334N39184N52773M76241L76642L12865K37167J63793P5936
1225.8F63759410N1141N4002P2479J29223J99378L02255L83317M54545M88699N59091
1246.2F66453540O58989O82235O56605N79774N38230M96268M38154L95119L96550M73261
1266.6F71768725N21660O14881P15971P89523Q50559Q39293Q03053P49707P51198P22706
1287F79127276O15299M95493L72768K85089J47998L3319n0128j07646j47342k79010
1307.4F80493116m05728n18382o07729o70195o15716m73439m41909m09544l89814m12941
$$ plain form
1166.7 649511755 651582181 653596401 655490696 657181382 658599615 659722805 660602748 661280751 661793828
1185 661793828 662141681 662310064 662270963 662036300 661668837 661199391 660730720 660363078 660182476 660248697
1205.4 660248697 660550475 661024809 661563993 662116766 662593007 662969649 663282514 663519681 663683474 663759410
1225.8 663759410 663810551 663864553 663937032 664066255 664265633 664567888 664951205 665405750 665894449 666453540
1246.2 666453540 667112529 667794764 668451369 669031143 669569373 670065641 670503795 670898914 671295464 671768725
1266.6 671768725 672290385 672905266 673621237 674410760 675261319 676100612 676903665 677653372 678404570 679127276
1287 679127276 679742575 680238068 680610836 680895925 681043923 681077242 681027114 680919468 680772126 680493116
1307.4 680493116 680087388 679569006 678961277 678291082 677675366 677201927 676760018 676350474 675960660 675547719
1327.8F75547719m40955m21703l32773k43008n7161J91391L42905L11196K01225R0063
1348.2F75188899o6817j70827k33411k97487l97682m87447n16176o48022p78914q05735
1368.6F70786381p53224o22511m96686m69327o58512j129508j183509K37286K177059
1387F67887449K349258J188516N31912L35098P3730r3102k02179k86281j94430k03252
1407.4F71386719k87950l35753m38988n49615m50313k30968l36707l61859j93894k9624
1427.8F68171048K39849L24250K68757O93560R54389M30465J36494P511j70350k61844
1448.2F70794129m17411o37829o25670P450N39184R835p2480O89149J299322J309514
1468.6F72895193J820088L040015L247559K524674K097786J927852J766086J439810
$$ plain form
1327.8 675547719 675106764 674685061 674352288 674109280 674052119 674243510 674586415 674897611 675098836 675188899
1348.2 675188899 675122082 674951255 674717844 674420357 674022675 673535228 673019052 672371030 671592116 670786381
1368.6 670786381 670033157 669410646 668913960 668444633 667786121 666656613 665473104 665710390 667887449
1387 667887449 670236707 671425223 671957135 672292233 672365963 672272861 672070682 671784401 671589971 671386719
1407.4 671386719 671098769 670763016 670324028 669774413 669324100 669093132 668756425 668394566 668200672 668171048
1427.8 668171048 668410897 668735147 669003904 669697464 670651853 671082318 671218812 671226323 671055973 670794129
1448.2 670794129 670376718 669738889 669113219 669120669 669659853 669669688 669597208 670286357 671585679 672895193
1468.6 672895193 674715281 677755296 681002855 683527529 685625315 687553167 689319253 690759063
1484.9F90759063J244306J255334R02652J10925j90556n5135l30507q47757j076818
1503.2F91771507p99596l15309o91712r66250o66678r776P84696J498222K364695K159655
1523.6F95129454J478255J306713Q53478P42913R02831L16918M6849Q38340Q19862
1542G02435613P5698j42217j90675r2507o2167j89901k24709M96387N71489o94274
1562.4G01982737r36568p79450p26164q58008j347840j464606j408755j806140k155006
1580.7F90500200k317608k387702k415657k355635k317369k285362k289772k445340
1597.1F71685755k666175k850652k850592k656043k340078k121985k232134k435625
1613.4F51532471k517581k693176k807140k691746k559006k469778k326489k084553
$$ plain form
1484.9 690759063 692003369 693258703 694161355 694272280 694081724 694026589 693696082 692848325 691771507
1503.2 691771507 690971911 690656602 689964890 688998640 688331962 688322186 689106882 690605104 692969799 695129454
1523.6 695129454 696607709 697914422 698767900 699510813 700413644 700730562 700777411 701615751 702435613
1542 702435613 702511311 702369094 702178419 702085912 702023745 701833844 701609135 702105522 702677011 701982737
1562.4 701982737 701046169 700266719 699540555 698682547 697334707 695870101 694461346 692655206 690500200
1580.7 690500200 688182592 685794890 683379233 681023598 678706229 676420867 674131095 671685755
1597.1 671685755 669019580 666168928 663318336 660662293 658322215 656200230 653968096 651532471
1613.4 651532471 649014890 646321714 643514574 640822828 638263822 635794044 633467555 631383002
1629.7F31383002j632214o85274O09397P38740K82348L91304P24316J596570J761794
1648.1F35169983O66499J552880L308356J645624Q51333J507104K318561K267241J591981
1666.4F50879562J935065K394736J662313J575649J691938Q73804L57032P43329J429856
1684.8F63543284M38154n02765p11978j038253j060248j125455j247167j316786j893222
1703.1F55085564k191365k238631k374709k481639k475143k244651j894236j991212
1719.4F37193978k209068k057135j806676j644909j521111j223862m10020j98722n63801
1737.8F25558674j06811L55840M33325O23107J009763J725614K058208J777112K080083
1756.2F35514915K593517K833844L396511L212630K899468L192425L418386L835142
$$ plain form
1629.7 631383002 629750788 629065514 629674911 630413651 630695999 631087303 631811619 633408189 635169983
1648.1 635169983 635836482 637389362 640697718 642343342 643194675 644701779 647020340 649287581 650879562
1666.4 650879562 652814627 655209363 656871676 658447325 660139263 661013067 661370099 662113428 663543284
1684.8 663543284 663981438 663478673 662766695 661728442 660668194 659542739 658295572 656978786 655085564
1703.1 655085564 652894199 650655568 648280859 645799220 643324077 641079426 639185190 637193978
1719.4 637193978 634984910 632927775 631121099 629476190 627955079 626731217 626321197 626122475 625558674
1737.8 625558674 625451863 625807703 626241028 626864135 627873898 629599512 631657720 633434832 635514915
1756.2 635514915 638108432 640942276 644338787 647551417 650450885 653643310 657061696 660896838
1772.5F60896838L346204K304674K076387K098978J838088J585006J291514R02295
1788.8F76339984J034081J396596R59933N14269O05524P68900O64830M27425L71813
1807.1F83083355M32849M88699L68118K49684K77519K32220J16825J50919K45869J51217
1827.5F85797274K37584K42770l2008m2736J1921j39356j51753K15947K56777j23262
1847.9F86273158j77145j02461r9718j08719r7394o8307j41442k61962k36929L3319
1868.3F85012400Q3566j94311k73347k32458j90497j75476j98781k12968k26140j21534
1888.7F83270454j05440k31445k22266j82450k11477k43723k45393k58922k47300j81973
1909.1F81140065j86562l05176l72529k07365j53899k87473k66075k49923k70068k73168
$$ plain form
1772.5 660896838 664243042 666547716 668624103 670723081 672561169 674146175 675437689 676339984
1788.8 676339984 677374065 678770661 679730594 680244863 680850387 681619287 682284117 682711542 683083355
1807.1 683083355 683516204 684004903 684373021 684622705 684900224 685132444 685249269 685400188 685646057 685797274
1827.5 685797274 686034858 686277628 686245620 686202884 686214805 686075449 685923696 686139643 686396420 686273158
1847.9 686273158 686096013 685993552 685893834 685785115 685687721 685619414 685477972 685216010 684979081 685012400
1868.3 685012400 685095966 684901655 684628308 684395850 684205353 684029877 683831096 683618128 683391988 683270454
1888.7 683270454 683165014 682933569 682711303 682528853 682317376 682073653 681828260 681569338 681322038 681140065
1909.1 681140065 680953503 680648327 680275798 680068433 679914534 679627061 679360986 679111063 678840995 678567827
1929.5F78567827k87473l07680l18348l48210l79563k50935j84298k88963l49701l42488
1949.9F75510168l12209l05116l08037l15309k93791k90096l22282k91467k69770l09706
1970.3F72492385l32356l07619k94805l04758k98143l06785l10957l18527l47257l10242
1990.7F69360936k54929l04521l64840l26037l03626l24726l25799l29375l32952l56674
2011.1F66137457l86417l91305l90291m83870p16150j079083j034081r7870N28156
2029.5F62086546J95325j68622k70426k91169k84612k75612k97248l28422l12328k87235
2049.9F59766197k65777k64048k64049k57969k55048k54214k55168k42829k56240k65837
2070.3F57185018k43246k38061k50221k65300k59638k50161k60472k67744k62380k37286
$$ plain form
1929.5 678567827 678280354 677972674 677654326 677306116 676926553 676675618 676491320 676202357 675852656 675510168
1949.9 675510168 675197959 674892843 674584806 674269497 673975706 673685610 673363328 673071861 672802091 672492385
1970.3 672492385 672160029 671852410 671557605 671252847 670954704 670647919 670336962 670018435 669671178 669360936
1990.7 669360936 669106007 668801486 668436646 668110609 667806983 667482257 667156458 666827083 666494131 666137457
2011.1 666137457 665751040 665359735 664969444 664485574 663769424 662690341 661656260 661558390 662086546
2029.5 662086546 662281871 662113249 661842823 661551654 661267042 660991430 660694182 660365760 660053432 659766197
2049.9 659766197 659500420 659236372 658972323 658714354 658459306 658205092 657949924 657707095 657450855 657185018
2070.3 657185018 656941772 656703711 656453490 656188190 655928552 655678391 655417919 655150175 654887795 654650509
2090.7F54650509k34186k47598k61366k86043k75314k41935k45750k76029k88487k97129
2111.1F51996672k93135k80560k84969k72572k55406k59519k71916k73347k60651k58983
2131.4F49285614k59935k52366k62917k70068k56419k43247k43485k48015k35557k23518
2151.8F46790087k33233k52902k46227k11835j96159k28941l09825l32296k04682p1705
2172.2F44502282q6605j72615k06590j98484j93953k07603k34306k19107j84953j87397
2192.6F42610669k14696k34365k39611k60711k73585k63631k34068k19762k53797k80022
2213F40136421k89023k90394k90573k98977l13162l18230k94506k79248k83658k89798
2233.4F37188852k84255k95281l34561l28183l05474l06725l14653l15667l16023l34502
$$ plain form
2090.7 654650509 654416323 654168725 653907359 653621316 653346002 653104067 652858317 652582288 652293801 651996672
2111.1 651996672 651703537 651422977 651138008 650865436 650610030 650350511 650078595 649805248 649544597 649285614
2131.4 649285614 649025679 648773313 648510396 648240328 647983909 647740662 647497177 647249162 647013605 646790087
2151.8 646790087 646556854 646303952 646057725 645845890 645649731 645420790 645110965 644778669 644573987 644502282
2172.2 644502282 644415677 644243062 644036472 643837988 643644035 643436432 643202126 642983019 642798066 642610669
2192.6 642610669 642395973 642161608 641921997 641661286 641387701 641124070 640890002 640670240 640416443 640136421
2213 640136421 639847398 639557004 639266431 638967454 638654292 638336062 638041556 637762308 637478650 637188852
2233.4 637188852 636904597 636609316 636274755 635946572 635641098 635334373 635019720 634704053 634388030 634053528
2253.8F34053528l35514l37422l33548l22997l29256l25203l20137l09884l09229l05057
2274.2F30825281k88308k66850k52842l01779l79741m59671n21898n37932n39363n55157
2294.6F26721740o07133o50346o64711o98567q13305r64880j011491r68933q86083
2313F19456291r07779j142382j322091j229703r68576q55922r71020r91761p64013
2331.3F10303044o01113o86168p66814o65128l14236M59790J305163O55532j195311
2349.7F08494759k412260k392113j809001j253188o72281n8412M74155R10163J225650
2368F02507472J371741J363755J298427J224697J103163R15467O10710K59161j9134
2386.4F10635459k23279l59058m04358l90887l91901m13000m36068m56750m49658m38332
$$ plain form
2253.8 634053528 633718014 633380592 633047044 632724047 632394791 632069588 631749451 631439567 631130338 630825281
2274.2 630825281 630536973 630270123 630017281 629715502 629335761 628876090 628354192 627816260 627276897 626721740
2294.6 626721740 626114607 625464261 624799550 624100983 623287678 622322798 621311307 620342374 619456291
2313 619456291 618548512 617406130 616084039 614854336 613885760 613029838 612058818 611067057 610303044
2331.3 610303044 609701931 609015763 608248949 607583821 607269585 607729375 609034538 609690070 608494759
2349.7 608494759 606082499 603690386 601881385 600628197 599955916 599897504 600371659 601281822 602507472
2368 602507472 603879213 605242968 606541395 607766092 608869255 609784722 610395432 610654593 610635459
2386.4 610635459 610412180 610053122 609648764 609257877 608865976 608452976 608016908 607560158 607110500 606672168
2406.8F06672168m37021m55380m69327m41432m25935m47094m86195m99964m83453m67539
2427.2F02058828m52161m60803m70043m58121m51505m71592m85838m75525m79162m72129
2447.6E97381949m63008m69983m62294m59194m64916m65453m65452m75765m90069m89533
2468E92676282m73201m63546m74453m81069m78685m68552m57287m67002m73738m70578
2488.4E87968171m54724m45843m64618m65274m52042m56273m69208m67539m56810m50849
2508.8E83384991m35353m27603m30405m33028m41134m45962m53353m62413m56810m36425
2529.2E78962505m19140m05848l94106m09961m33862m37140m21524m05312m07040m05729
2549.6E74822843l95358m04357m31896m20272l85106l81469l91186m02689m09901m04298
$$ plain form
2406.8 606672168 606235147 605779767 605310440 604869008 604443073 603995979 603509784 603009820 602526367 602058828
2427.2 602058828 601606667 601145864 600675821 600217700 599766195 599294603 598808765 598333240 597854078 597381949
2447.6 597381949 596918941 596448958 595986664 595527470 595062554 594597101 594131649 593655884 593165815 592676282
2468 592676282 592203081 591739535 591265082 590784013 590305328 589836776 589379489 588912487 588438749 587968171
2488.4 587968171 587513447 587067604 586602986 586137712 585685670 585229397 584760189 584292650 583835840 583384991
2508.8 583384991 582949638 582522035 582091630 581658602 581217468 580771506 580318153 579855740 579398930 578962505
2529.2 578962505 578543365 578137517 577743411 577333450 576899588 576462448 576040924 575635612 575228572 574822843
2549.6 574822843 574427485 574023128 573591232 573170960 572785854 572404385 572013199 571610510 571200609 570796311
2570E70796311m00484m07576m14729m11392m13119m15862l97027l87728l98576m07875
2590.3E66741943m16278m12405m03881m27723m60029m47213m30763m29452m13537m15027
2610.7E62485635m28438m36425m58837m74810m45724m02987m03285m30465m49597m46022
2631.1E58109045m26829m02748l92974m28259m65632m59015m36485m31001m20630l89755
2651.5E53855717l87668m11511m11093l95298l99411m00603l82006l92556m00424l81112
2671.9E49894035l82304m06862m27663m30703m39763m52459m47452m30882m23253m23968
2692.3E45628726m14848m18961m26829m36008m71353m94063m75109m52757m59969m70876
2712.7E41107953m62532m48704m38214m36425m27127m08113m28378m89533n01454m54724
$$ plain form
2570 570796311 570395827 569988251 569573522 569162130 568749011 568333149 567936122 567548394 567149818 566741943
2590.3 566741943 566325665 565913260 565509379 565081656 564621627 564174414 563743651 563314199 562900662 562485635
2610.7 562485635 562057197 561620772 561161935 560687125 560241401 559838414 559435129 559004664 558555067 558109045
2631.1 558109045 557682216 557279468 556886494 556458235 555992603 555533588 555097103 554666102 554245472 553855717
2651.5 553855717 553468049 553056538 552645445 552250147 551850736 551450133 551068127 550675571 550275147 549894035
2671.9 549894035 549511731 549104869 548677206 548246503 547806740 547354281 546906829 546475947 546052694 545628726
2692.3 545628726 545213878 544794917 544368088 543932080 543460727 542966664 542491555 542038798 541578829 541107953
2712.7 541107953 540645421 540196717 539758503 539322078 538894951 538486838 538058460 537568927 537067473 536612749
2733.1E36612749m27544m29630m28140m10736l93689l83854l92854m32789m58241m62830
2753.5E32392442m52816m35829m36187m33803m16159l97385m12941m41849m20868m13299
2773.9E28131306m84347n32627n12958n09739n08725m65751m30226m78387n80967n99921
2794.3E23027658n48839n67913o46234o60598o23405o08444n96166o32644p09831p34151
2814.7E16699433p27951p10428o92129o98626p34627p83265q11934q20578q17239q14795
2835.1E09087861q36969r63628j167655j285970j308203j299560j258969j113475q69602
2853.4D98983830o76125n74976n63085o52641p57635q32737r04619q74609p63148q22753
2873.8D91561502r91463r95934q87633q34375q21829p92980p46429o89269o27756n81413
$$ plain form
2733.1 536612749 536185205 535755575 535327435 534916699 534523010 534139156 533746302 533313513 532855272 532392442
2753.5 532392442 531939626 531503797 531067610 530633807 530217648 529820263 529407322 528965473 528544605 528131306
2773.9 528131306 527646959 527114332 526601374 526091635 525582910 525117159 524686933 524208546 523627579 523027658
2794.3 523027658 522478819 521910906 521264672 520604074 519980669 519372225 518776059 518143415 517433584 516699433
2814.7 516699433 515971482 515261054 514568925 513870299 513135672 512352407 511540473 510719895 509902656 509087861
2835.1 509087861 508250892 507287264 506119609 504833639 503525436 502225876 500966907 499853432 498983830
2853.4 498983830 498307705 497732729 497169644 496517003 495759368 494926631 494022012 493147403 492384255 491561502
2873.8 491561502 490570039 489574105 488686472 487852097 487030268 486237288 485490859 484801590 484173834 483592421
2894.2D83592421n94050o30468o04302n62578n76586o20275o50824o73174p84755j020521
2914.6D76874888j209199j195193j008689p44283n15372l14623j41740j25825j49191
2933D71470773m5150Q6575J66983K61575L59088L37899J92642J22428K01136J94460
2953.4D73348409R7722J23501K39074L32475L74525L95328M08501M15951M78923N22345
2973.8D76736754M46677M02332L72320J94431N4836Q6903J54585J99765J45405k6851
2994.2D78767157j20879j72555k76864k93553k42739k29717j76459q4907j44214l57121
3014.6D76668149n15908n69463n72443n07950m67599n33581n45859m55558m08739n26220
3035D71564829o89596o08921m36425n26011p51734q10563p14272o96332p54386p46280
$$ plain form
2894.2 483592421 482998371 482367903 481763601 481201023 480624437 480004162 479353338 478680164 477895409 476874888
2914.6 476874888 475665689 474470496 473461807 472717524 472202152 471887529 471745789 471619964 471470773
2933 471470773 471425623 471512198 471679181 471940756 472299844 472637743 472830385 472952813 473153949 473348409
2953.4 473348409 473446131 473569632 473808706 474141181 474515706 474911034 475319535 475735486 476214409 476736754
2973.8 476736754 477183431 477585763 477958083 478152514 478207350 478294253 478448838 478648603 478794008 478767157
2994.2 478767157 478646278 478473723 478196859 477903306 477660567 477430850 477254391 477169484 477025270 476668149
3014.6 476668149 476152241 475582778 475010335 474502385 474034786 473501205 472955346 472499788 472091049 471564829
3035 471564829 470875233 470266312 469829887 469303876 468552142 467741579 467027307 466330975 465576589 464830309
3055.4D64830309p75844q36849p77513o46174n73545o86854q76666q98838p66307n85586
3075.8D57406133n03987o34968q01861q58456q85099q83341q85666r54449r45687q23885
3096.2D49228734p31677p65652q95380r20505p82341p34061q87781r16570p14153o48201
3116.6D41232413q38965j108408j264483j195758j001746q92728r54479j032353r87798
3134.9D31955695q69751q75711j067400j180411j098394r80377q80927q42214j025527
3153.3D23134983j262784j257062j145542j106352j098513j082093j068890j088977
3169.6D14024770j120776j117617j089811j078397j112550j185179j197994j130223
3185.9D04992223j104295j129896j158088j189769j185506j161248j155436j137167
$$ plain form
3055.4 464830309 464054465 463217616 462440103 461793929 461220384 460533530 459656864 458758026 457991719 457406133
3075.8 457406133 456902146 456267178 455465317 454606861 453721762 452838421 451952755 450998306 450052619 449228734
3096.2 449228734 448497057 447731405 446836025 445915520 445133179 444399118 443511337 442594767 441880614 441232413
3116.6 441232413 440393448 439285040 438020557 436824799 435823053 434930325 433975846 432943493 431955695
3134.9 431955695 431085944 430210233 429142833 427962422 426864028 425883651 425002724 424160510 423134983
3153.3 423134983 421872199 420615137 419469595 418363243 417264730 416182637 415113747 414024770
3169.6 414024770 412903994 411786377 410696566 409618169 408505619 407320440 406122446 404992223
3185.9 404992223 403887928 402758032 401599944 400410175 399224669 398063421 396907985 395770818
3202.2C95770818j122922j143038j163363j161337j121790j088172j123339j148253
3218.5C86698604j127392j126796j130492j086414r95010q95500q99524j089036j234949
3236.9C77113491j176744j075775r60141q41916r01580j086831j107007r49621q84384
3255.2C68129492r59873r92597r44554r02266q76426p97272o97494p85797r84818j040429
3275.6C59147966j004934r63509r09061q84741r04382q62419p22110o90729q46952
3294C51359129j011878j082331j031846q30859o52879p76381j107961j319796j292675
3312.3C42252523j161725j127213j155376j112044j019329j020282j170159j293212
3328.7C33193183j277864j200825j084179r78678j068860j244933j296878j324177
$$ plain form
3202.2 395770818 394647896 393504858 392341495 391180158 390058368 388970196 387846857 386698604
3218.5 386698604 385571212 384444416 383313924 382227510 381232500 380337000 379437476 378348440 377113491
3236.9 377113491 375936747 374860972 373900831 373058915 372157335 371070504 369963497 369013876 368129492
3255.2 368129492 367169619 366177022 365232468 364330202 363453776 362656504 361959010 361173213 360188395 359147966
3275.6 359147966 358143032 357179523 356270462 355385721 354481339 353618920 352896810 352206081 351359129
3294 351359129 350347251 349264920 348233074 347402215 346749336 345972955 344864994 343545198 342252523
3312.3 342252523 341090798 339963585 338808209 337696165 336676836 335656554 334486395 333193183
3328.7 333193183 331915319 330714494 329630315 328651637 327582777 326337844 325040966 323716789
3345C23716789j238524j022339j097024j389712j405001j202017j073688j074016j084030
3363.3C13130438r58621q67397j058966j359760j382739j147061r80676r82493j052916
3381.7C03339809j052350r54151q04901o27190o67423r61751j008689o84887n20498
3400B96057969p96050j079797r63420p16895o42031o65039p26134p47501o15508m76003
3420.4B88629591m80920m73827l42309k32935k32577k27333k08407l35902n06461m36544
3440.8B85152376k63632j33574r834n7489j46270o2674L4213J00076J90467J98900
3461.2B85002559J96875L36200M14907K06680m7058j5646K10195L92139M24385L21210
3481.6B87442446K46823L26871M00544L55065L48985M58896N30988M37945M02719N96672
$$ plain form
3345 323716789 322478265 321455926 320358902 318969190 317564189 316362172 315288484 314214468 313130438
3363.3 313130438 312171817 311304420 310245454 308885694 307502955 306355894 305375218 304392725 303339809
3381.7 303339809 302287459 301333308 300528407 299901217 299233794 298272043 297263354 296578467 296057969
3400 296057969 295261919 294182122 293218702 292501807 291859776 291194737 290468603 289721102 289105594 288629591
3420.4 288629591 288148671 287674844 287332535 287099600 286867023 286639690 286431283 286095381 285588920 285152376
3440.8 285152376 284888744 284755170 284745336 284687847 284541577 284478903 284513116 284613192 284803659 285002559
3461.2 285002559 285199434 285535634 285950541 286157221 286110163 286094517 286304712 286696851 287121236 287442446
3481.6 287442446 287689269 288016140 288416684 288771749 289120734 289579630 290110618 290548563 290951282 291547954
3502B91547954N77927K91586L49879O33120O90073N46754M22477M23432N39839P63774
3522.4B96786815P92772O34133O43879O36340N63949P26491Q56549O60509N74112Q15689
3542.8C03691238J087457R74923N71847O24627R13412P93248O79821Q30829P54833
3561.2C10922235M44860R60707K077520J671165N58019N27292R53615J143485J186818
3579.5C20445716R99689P12663J193017K065301J442224N59598J043320J555949J384408
3597.9C31401885J355975J222372O68556Q02428J714199J848966J448244J122624Q44061
3616.2C42429310J817852K421588Q51095n43058K43842L225983L358811Q33750N72085
3634.6C55211258R84222J022935R92924M14639j67161J026601L760278L088027j24425
$$ plain form
3502 291547954 292125881 292417467 292767346 293400466 294090539 294637293 295059770 295483202 296023041 296786815
3522.4 296786815 297579587 298213720 298857599 299493939 300057888 300784379 301640928 302301437 302875549 303691238
3542.8 303691238 304778695 305753618 306325465 306950092 307863504 308656752 309336573 310167402 310922235
3561.2 310922235 311367095 312327802 314405322 316076487 316634506 317161798 318115413 319258898 320445716
3579.5 320445716 321445405 322158068 323351085 325416386 326858610 327418208 328461528 330017477 331401885
3597.9 331401885 332757860 333980232 334648788 335451216 337165415 339014381 340462625 341585249 342429310
3616.2 342429310 344247162 346668750 347519845 346976787 347220629 350446612 353805423 354639173 355211258
3634.6 355211258 356195480 357218415 358211339 358625978 358458817 359485418 363245696 366333723 366209298
3653C66209298P2360J744658J117587K61516J22815m00186j63912J581490J268685
3671.3C71814311R7185K195179K046556l42310o85692q72820q37505J006037K497285
3689.7C76918226Q53807o89953p02680l78847L54052J190186L89277r41217p05152
3708C76287699R78470K027511K01702j430601j188695n21153k25514q4758k58059j276493
3728.4C74510109j519292q9199J639426J733959o00338k393693l09169K763867N43446
3746.8C76279116m52131K360344J629352j096785r50307N20915K48492p18355l75122
3765.1C77445519J57356P03037N92142o09815j041293k00778O85543J46418m30494
3783.5C77447635j10507j47939l87311o10858o55532k73824n39660P4506J398593j21981
$$ plain form
3653 366209298 366281658 368026316 369143903 369405419 369528234 369128048 368964136 370545626 371814311
3671.3 371814311 371911496 374106675 376153231 375810921 375125229 374252409 373414904 374420941 376918226
3689.7 376918226 377772033 377082080 376379400 376000553 376354605 377544791 377934068 376992851 376287699
3708 376287699 377266169 379293680 379495382 378064781 376876086 376354933 376129419 376044661 375786602 374510109
3728.4 374510109 372990817 372901618 374541044 376275003 375674665 373280972 372971803 375735670 376279116
3746.8 376279116 375826985 378187329 379816681 378719896 377769589 378290504 378538996 377820641 377445519
3765.1 377445519 377602875 378305912 378898054 378288239 377246946 377046168 377731711 377878129 377447635
3783.5 377447635 377337128 377189189 376801878 376191020 375535488 375261664 374722004 374796510 376195103 376073122
3803.9C76073122l94642O65933q55953k051264p58618Q21888j7762M50373J322478
3822.2C75255555n91099j175881q08924o76662m47810m83453M15027J306057L12567
3840.6C73105377l76791n20289j527726k596885j553566L020913L864974j107067k518148
3858.9C69790792j273989Q9526Q5711p70390K92898J070886k0355q11815j307428m25756
3879.3C66720080K50191j13160N10335k69353r13054L91275j02043j601309j167744
3897.7C63705218J13338Q70287J113147K27273r46671r90898p71433o91861m8428M12106
3918.1C62992078r0331m85390j93626k20626o07759k44081L14712r1403o93948o98596
3938.5C59981030k92361J01716j62781m31865r4324l1859l21686l85225l29137k93463
$$ plain form
3803.9 376073122 375678480 376344413 375488460 373437196 372678578 373500466 373482704 373933077 375255555
3822.2 375255555 374664456 373488575 372679651 372002989 371555179 371071726 371486753 372792810 373105377
3840.6 373105377 372728586 372208297 370680571 368083686 366530120 369551033 373416007 372308940 369790792
3858.9 369790792 368516803 368606329 368692040 367921650 368214548 369285434 369265079 368453264 367145836 366720080
3879.3 366720080 366970271 366857111 367367446 367098093 366185039 366576314 366474271 364872962 363705218
3897.7 363705218 363818556 364688843 365801990 366029263 365082592 364091694 363320261 362628400 362579972 362992078
3918.1 362992078 362901747 362416357 362222731 362002105 361394346 361150265 361464977 361373574 360679626 359981030
3938.5 359981030 359688669 359790385 359627604 359195739 359101415 359069556 358747870 358362645 358033508 357740045
3958.9C57740045j57029j35392l10868l48240k61545k30670k14815j91659k41071k83957
3979.3C55364799k26825j88559k63602l22848k73615k36184k36243k32845k66284
3997.6C53117794
$$ plain form
3958.9 357740045 357583016 357447624 357136756 356788516 356526971 356296301 356081486 355889827 355648756 355364799
3979.3 355364799 355137974 354949415 354685813 354362965 354089350 353853166 353616923 353384078 353117794
3997.6 353117794
##END=$$ End of the data block
