##TITLE=GJ P $$ Begin of the data block
##JCAMP-DX=5.00 $$ ACD/SpecManager v 10.08
##SPECTROMETER/DATA SYSTEM=Alpha
##DATE=04 Dec 2015 11:34:10
##DATA TYPE=INFRARED SPECTRUM
##DATA CLASS=XYDATA
##ORIGIN=
##OWNER=
##NPOINTS=1765
##FIRSTX=399.76428223
##LASTX=3997.64306641
##MAXX=3997.64306641
##MINX=399.76428223
##MAXY=0.87716782
##MINY=0.42163119
##XFACTOR=1.0000000000
##YFACTOR=1.000000000000000e-9
##FIRSTY=0.80148745
##DELTAX=2.03961372
##XUNITS=1/CM
##YUNITS=ARBITRARY UNITS
##XYDATA=(X++(Y..Y))
399.8H01487446J418531k122820m798054k322972j167715m867792o695270m537583
416.1G76393771n351484q848548o063759r22620N88000j118124j118362k71797l361583
434.4G49925494p190943n982577l877998n756974p223070m803717k976239m534721
450.8G07579255n339324k650202p15851j589060j380682J86741r19878m848898o937563
469.1F83384538n479157l432274j356185K545715P005274Q413672P087946O533742
485.4G04703271O225765L353715J8478J52289J727820N75602j577377j293481n84423
503.8G13301659k615989m358410k274871P61270J302600J112044K221644K155423n45263
522.1G11060107k284527r35316L11971r13978j639426P0930J076579l85642r00209
$$ y = [801487446, 802905977, 800783157, 795985103, 793662131, 792494416, 787626624, 780931354, 776393771, 771042287, 762193739, 756129980, 755207360, 755795360, 754677236, 753558874, 753287077, 749925494, 742734551, 736751974, 732873976, 727117002, 719893932, 715090215, 712113976, 707579255, 702239931, 699589729, 698873878, 697284818, 695904136, 696090877, 695170999, 690322101, 683384538, 677905381, 674473107, 673116922, 675662637, 682667911, 691081583, 698169529, 704703271, 710929036, 714282751, 714301229, 714453518, 716181338, 716756940, 715179563, 713886082, 713301659, 710685670, 706327260, 704052389, 704813659, 706116259, 707228303, 709449947, 711605370, 711060107, 708775580, 707840264, 708152235, 707238257, 705598831, 705669761, 706746340, 706360698, 705460489]
540.5G05460489J169383J995862j3411q55923Q55029J373231J0133O06537L335953
558.9G13937283L901660J781285J281619L052652K971589P97272Q80361L179907L099621
577.2G34883249P77244O97256K351582J521050p40706j23620K105236J516163l50773
595.6G42636681P93933L010929K149522L70324J689434L669560K454400N84304J821280
613.9G59180367L437281J851618J55330J602411K762973P41065p76708R14394K135814
632.3G72004545K74360q79705J306117K986073J957119K128064M909635N522847K288699
650.6G92497754L31700J761019K005637m22418j070738R85086J484334r23037k166629
669G94482708M77254M04299k171636k877057j347959j926183m771471n610526m434526
$$ y = [705460489, 706629872, 708625734, 708612323, 707756400, 708611429, 709984660, 709994793, 710601330, 713937283, 717838943, 719620228, 720901847, 723954499, 726926088, 727723360, 728603721, 731783628, 734883249, 735660493, 736357749, 738709331, 740230381, 739489675, 739366055, 741471291, 742987454, 742636681, 743430614, 746441543, 748591065, 748961389, 750650823, 754320383, 756774783, 757359087, 759180367, 762617648, 764469266, 764624596, 766227007, 768989980, 769731045, 768954337, 769868731, 772004545, 772278905, 771399200, 772705317, 775691390, 777648509, 779776573, 784686208, 790209055, 792497754, 792829454, 794590473, 796596110, 796173692, 795102954, 796088040, 797572374, 796649337, 794482708, 794959962, 795364261, 793192625, 790315568, 788967609, 787041426, 782269955, 776659429, 772224903]
687.3G72224903n010068o654680n538046k341390o64413j50979K447605O132305P175625
705.7G67620862O456017P072508P306219M087269l2008o94573J065612J532435J145006
724.1G95559347K442240L821731K332270N3048N74112K050936R38714r12845j12295
742.4H06747258J435816N47647o37948R66668K970755K157808P36057J711667K826214
760.8H19461942J295745l65496O67453J862467M90665q51035O01888K277374J351476
779.1H26792479L19063J750231K937078J429618M7743J145780J747549m22299k173305
797.5H33573937j344263j040280k983093l983736k478779j585841k821803l248155
813.8H14087987j411557l12627j387357j525820N58734J647532N09680K44081J969635
$$ y = [772224903, 767214835, 760560155, 755022109, 752680719, 752016306, 751865327, 754312932, 760445237, 767620862, 774076879, 781149387, 788455606, 792542875, 792510867, 791816294, 792881906, 794414341, 795559347, 798001587, 801823318, 804155588, 804208636, 804782748, 806833684, 807772398, 806859553, 806747258, 808183074, 808730721, 808092773, 809059441, 812030196, 814188004, 814924061, 816635728, 819461942, 820757687, 820392191, 821059644, 822922111, 823412776, 822561741, 823163629, 825441003, 826792479, 827111542, 828861773, 831798851, 833228469, 833276212, 834421992, 836169541, 835747242, 833573937, 832229674, 831189394, 828206301, 824222565, 821743786, 820157945, 817336142, 814087987, 812676430, 812363803, 810976446, 809450626, 810009360, 811656892, 812166572, 812410653, 814380288]
832.2H14380288K762556J809061J991033L628612L438294J241743Q75593L076672M213989
850.5H37417841L181934K934397M028081L353537O70611l46124J009167J415908L68774
868.9H54034126Q37266K775967K947867J271665R59695K104580J670301j57297l02076
887.2H66142094J006901P14839q88705p62463O50942L09945j208842r41873M75526
905.6H65498364J83165j204848r09925L75510j40369j721263j603783m54664p98404
923.9H59223783j757264q59380P83324M98355p83146n78940K34545m79341j589954
942.3H54691982r30011L07381j35362j206875q03649l2842q15154j851022j190126
960.7H48034322j33276o34610j490534r12249j35839q90553j880765j393556p23660
$$ y = [814380288, 817142844, 818951905, 820942938, 824571550, 828009844, 829251587, 830127180, 833203852, 837417841, 840599775, 843534172, 847562253, 850915790, 851586401, 851240277, 852249444, 853665352, 854034126, 854871392, 857647359, 860595226, 861866891, 862826586, 864931166, 866601467, 866444170, 866142094, 867148995, 867863834, 866975129, 866212666, 866863608, 867173553, 865964711, 865022838, 865498364, 865681529, 864476681, 863566756, 863942266, 863801897, 862080634, 860476851, 860022187, 859223783, 857466519, 856607139, 857390463, 857888818, 857105672, 856526732, 856761277, 856281936, 854691982, 853761971, 854069352, 853933990, 852727115, 851923466, 851890624, 851075470, 849224448, 848034322, 847901046, 847266436, 845775902, 844863653, 844727814, 843837261, 841956496, 840562940, 839839280]
979H39839280j484394k380908j831531j102984j796961k701938k304614j854479k776862
997.4H21604609l868222l820061l908098n920589j0086656j5359640j7280996q877933
1013.7G52482414P910669J8811107J5550554N862236m56870j955688j849413k182841
1030G94172168k192497j028538R7275L6895k45989K36214N29587j77145p46369k50996
1050.4G90430605K42353k24233p37667m40180k49803r70781j637518j495779j530111
1068.8G83386886k508640l630996m432321o030678r250820j3394356j7663479k1544039
1085.1G04931557k3085415j9710243j1863887l340960K531469N254090N833149M831076
1101.4F65380836K766311J457929K888322O484091R630263J0807395J0229945Q373797
$$ y = [839839280, 838354886, 835973978, 834142447, 833039463, 831242502, 828540564, 826235950, 824381471, 821604609, 817736387, 813916326, 810008228, 804087639, 794000983, 778641343, 761360347, 752482414, 760393083, 779204190, 794754744, 800616980, 800160110, 798204422, 796355009, 794172168, 791979671, 790951133, 791048408, 791085303, 790839314, 791075528, 791605115, 791427970, 790681601, 790430605, 790672958, 790448725, 789711058, 789270878, 789021075, 788050294, 786412776, 784916997, 783386886, 780878246, 777247250, 772814929, 766784251, 757533431, 744139075, 726475596, 704931557, 681846142, 662135899, 650272012, 646931052, 649462521, 654716611, 660549760, 665380836, 668147147, 669605076, 672493398, 678977489, 688607752, 699415147, 709645092, 718018889]
1117.7G18018889N999923M525423M519224N023420N427063O392538P891894Q272648
1134G66071022O657898M356086K705336J394689q3268j132369j367748j587808k323806
1152.4G74690032k868354k786517k984405m160166n736172p285118r280026j1502385
1168.7G28086889j2860179j3549149j4615596j5331268j4078319j1204898q380592
1183F38066888n977214l438591j609564k006293l906488m526198k125025K645314Q341432
1201.3F25464261J4083504J9076050K2008240K2022962J9844473J6709268J3144433
1215.6G52353191R566546O789029N091845L777922K346694J234472O46472j64688j589298
1234G80052185k934635l770530m616320n554199n706608m599333k901078j268386K65240
$$ y = [718018889, 724018812, 728544235, 733063459, 738086879, 743513942, 749906480, 757798374, 766071022, 772728920, 777085006, 779790342, 781185031, 781101763, 779969394, 778601646, 777013838, 774690032, 771821678, 769035161, 766050756, 761890590, 756154418, 748869300, 739589274, 728086889, 715226710, 701677561, 687061965, 671730697, 657652378, 646447480, 638066888, 632089674, 628651083, 627041519, 625035226, 621128738, 616602540, 614477515, 617122829, 625464261, 639547765, 658623815, 680632055, 702655017, 722499490, 739208758, 752353191, 761919737, 768708766, 773800611, 777578533, 779925227, 781159699, 781806171, 781641483, 780052185, 777117550, 773347020, 768730700, 763176501, 757469893, 752870560, 749969482, 748701096, 748966336]
1252.3G48966336J404166J373530J82748r59397j329004j522065k075672k553224k499342
1270.7G40988076j927138o86526J552999M261792O039679O278038N610823M482389
1287G66600132K722859J092077Q22723J538693J641572N86987o54996j490414k449393
1305.4G70410240l816068m846216n116820m884958m058659k289236j18434R97424O62625
1323.7G46939898J09314K42770P95484J795232L663838N895972P313431P363736O236971
1342.1G80356646M594862K502561N8829j718938k694786l773629n088091n923510p012665
1360.4G61301279r456456j1236488j0254562p194162k980172J93476R47416p39932
1376.7G20580399m096329p473648q572578p025600n235195m476011m047751m005015
$$ y = [748966336, 750370502, 751744032, 751926780, 750967383, 749638379, 748116314, 746040642, 743487418, 740988076, 739060938, 738374412, 739927411, 744189203, 750228882, 756506920, 762117743, 766600132, 769322991, 770415068, 771237791, 772776484, 774418056, 775005043, 774350047, 772859633, 770410240, 766594172, 761747956, 756631136, 751746178, 747687519, 745398283, 745279849, 746277273, 746939898, 747049212, 747291982, 748087466, 749882698, 753546536, 759442508, 766755939, 774119675, 780356646, 784951508, 787454069, 787512898, 785793960, 783099174, 779325545, 774237454, 768313944, 761301279, 751844823, 740608335, 730353773, 723159611, 720179439, 720372915, 721320331, 720580399, 716484070, 709010422, 700437844, 693412244, 688177049, 683701038, 679653287, 675648272]
1393.1F75648272m172265l663242k489984j297176j277805k587020l670037l709614
1409.4F52781129k904892j462102j42872O00338Q80956P52330O53505O05166j48534
1427.7F51615024j290203j386225J29521L764391R000838J2039900J4069318J4809430
1444.1G02751994J3816893J2711168J0188877O521881L254771P94292r90093k204836
1460.4G46844947l308952l946661l405214l134966m531264o484509o388425n558789
1476.7G10086167n777180o721914q845449j2942910j8269956j7570913l258109J2281299
1493F48981035K0452797K3649156J8280804R701252L955663O87182m67778J60635K60949
1511.4G25661695J57654M6134j45256O735J490057L334641L809273L612697K823651
$$ y = [675648272, 671476007, 667812765, 665322781, 664025605, 662747800, 660160780, 656490743, 652781129, 649876237, 648414135, 648271263, 648871601, 649752557, 650504887, 651158392, 651763558, 651615024, 650324821, 648938596, 649068117, 652832508, 661833346, 673873246, 687942564, 702751994, 716568887, 729280055, 739468932, 745990813, 749245584, 750039876, 749049783, 746844947, 743535995, 739589334, 736184120, 733049154, 728517890, 722033381, 715644956, 710086167, 704308987, 697587073, 688741624, 675798714, 657528758, 639957845, 636699736, 648981035, 669433832, 693082988, 711363792, 721065044, 725020707, 725707889, 725240111, 725400746, 725661695, 725819349, 725865483, 725720227, 725726962, 727217019, 730551660, 734360933, 737973630, 740797281]
1529.7G40797281J603186j23262j622438l007651n364597o330728n674243n427182
1546G14850366n468309o338119o813288o448448o005347p633924p918179l950179k960026
1564.4F61314547k987742k101422K00987K606750L941118M381597K008737p40052j601040
1582.8F67023480l54707J951635L569603L731250L313244L158867K327681n06938n125105
1601.1F79089010j0398448j5912771k2535264l0144036l5830617l7169636l8624942
1615.4D88473296l6568522k1700830q572757K262801J2651593J8396675J9623667J6617298
1631.7D91183221J4837265J7480255J7014801J3860106J2851894J1855543J2276590
1646E91359675J1815667P621706P904827J4620543J5301406J5778840J8651008K0778776
$$ y = [740797281, 742400467, 742277205, 740654767, 737647116, 732282519, 725951791, 720277548, 714850366, 709382057, 703043938, 696230650, 689782202, 683776855, 676142931, 668224752, 664274573, 661314547, 658326805, 656225383, 656426370, 659033120, 662974238, 667355835, 669364572, 668624520, 667023480, 666668773, 668620408, 672190011, 675921261, 679234505, 682393372, 684721053, 684214115, 679089010, 668690562, 652777791, 630242527, 600098491, 564267874, 527098238, 488473296, 451904774, 430203944, 421631187, 423893988, 436545581, 454942256, 474565923, 491183221, 506020486, 523500741, 540515542, 554375648, 567227542, 579083085, 591359675, 603175342, 610797048, 618701875, 633322418, 648623824, 664402664, 683053672, 703832448]
1662.3G03832448J8546640J2824119J0328650R326756N986750L178537J810014L18528
1678.6G66152442j318038l460944n284726m144550l294050k998948j828552n27560
1694.9G43295074M54962J131296J822650J186848n12838j634777j554608q53896L46660
1713.3G43681371K647877P763445J1815548J1797488J2185335J2153983J0136545P388532
1729.6H19570124M588783L211081K815127J878858J582444K233386K873718L106118
1745.9H41859639L359198M450023N383790M635036L773749L412485K758026K004445
1762.2H71636391J293480P67112M75347M1008k82109J76966N02289J52707j96755l5286
1782.6H74531150K25842J54435j41799k70843J13964L50713O3002m5597J95265K29716
$$ y = [703832448, 722379088, 735203207, 745531857, 754858613, 760845363, 764023900, 765833914, 766152442, 764834404, 761373460, 756088734, 751944184, 748650134, 745651186, 743822634, 743295074, 743750036, 744881332, 746703982, 747890830, 747377992, 745743215, 744188607, 743334711, 743681371, 746329248, 754092693, 765908241, 777705729, 789891064, 802045047, 812181592, 819570124, 824158907, 827369988, 830185115, 832063973, 833646417, 835879803, 838753521, 841859639, 845218837, 849668860, 855052650, 859687686, 863461435, 866873920, 869631946, 871636391, 872929871, 873696983, 874172330, 874213338, 873931229, 874108195, 874610484, 874763191, 874566436, 874531150, 874756992, 874911427, 874769628, 874498785, 874612749, 874963462, 875026464, 874980867, 875176132, 875405848]
1803H75405848J2875J3411J44124Q6069K0623J94430L82603K74658o139m1128J91331
1825.5H76678705J27971j44660J04308L62158L9339k72811j41620o7055l43621l52979
1845.9H75989735l576J39117p9930l58462k49326L040r6739l55184l22103k37167l96490
1868.3H74032915l84570p6532M2498k03848m98712m44352k39671l20375n85377o15537
1888.7H70706439l33607l12448n93960m87506j17660j05977k90096j51574J41680J20520
1909.1H68575811n1260L1591J73211K2292j61290n6684J62542J40786j30594j73569
1929.5H68532836k324q0109l12984k61426q2135j98722l72529k26498l3617j41799
1949.9H66820693l91126l60846j27614j47521l47674k86579o8248j30295l35574k48015
$$ y = [875405848, 875418723, 875432134, 875576258, 875662327, 875682950, 875877380, 876259983, 876534641, 876528502, 876487374, 876678705, 876806676, 876662016, 876766324, 877128482, 877167821, 876895010, 876753390, 876686335, 876342714, 875989735, 875986159, 876125276, 876045346, 875686884, 875437558, 875440598, 875343859, 874988675, 874666572, 874429405, 874032915, 873648345, 873571813, 873614311, 873410463, 872911751, 872467399, 872227728, 871907353, 871321976, 870706439, 870372832, 870060384, 869466424, 868978918, 868861258, 868755281, 868465185, 868313611, 868455291, 868575811, 868524551, 868556142, 868729353, 868751645, 868590355, 868533671, 868696213, 868836999, 868706405, 868532836, 868530512, 868450403, 868137419, 867875993, 867793858, 867595136, 867222607, 866996109, 866962492, 866820693, 866429567, 866068721, 865941107, 865793586, 865445912, 865159333, 865091085, 864960790, 864625216, 864377201]
1970.3H64377201m411n8890l34799l22401r8884j27674l20673k82526q7738j48594
1990.7H62590611l58701k69115m1246j03593l42548l14772o7294r7632l51787l26216
2011.1H60317707r9182j51694m06802m22179k71619m27425o45875k23101L12746J25646
2031.5H58108222l13341l31819j13309j65760m11868l60251p1048o3241k97427k56419
2051.9H55723739K5749L6001k10762k21193k086l0398k66612k23160J6392l5644l09229
2074.3H54502797l04103p4088j16229l68476l48211r5486r8348l55005l69132j03712
2094.7H52270007o2823k67863k22922N0724M7624k05338j96040N8651Q9109j09076
2115.1H51452053q1122J89185J93059p5698p0274J83046J65224p7486n8651J88172
$$ y = [864377201, 864372790, 864313900, 863979101, 863656700, 863557816, 863430142, 863109469, 862826943, 862739205, 862590611, 862231910, 861962795, 861921549, 861817956, 861475408, 861160636, 861093342, 860995710, 860643923, 860317707, 860218525, 860066831, 859660029, 859237850, 858966231, 858538806, 857892931, 857669830, 857982576, 858108222, 857794881, 857463062, 857349753, 857183993, 856772125, 856411874, 856340826, 856277585, 855980158, 855723739, 855749488, 855785489, 855574727, 855353534, 855351448, 855321050, 855054438, 854831278, 854847670, 854812026, 854502797, 854198694, 854124606, 854008377, 853639901, 853291690, 853196204, 853097856, 852742851, 852373719, 852270007, 852207184, 851939321, 851716399, 851767123, 851814747, 851609409, 851413369, 851472020, 851561129, 851452053, 851370931, 851560116, 851753175, 851677477, 851607203, 851790249, 851955473, 851877987, 851819336, 852007508]
2135.5H52007508J71125q3685r8407J25945J35600p0751n3882J62125J47581r4712
2155.9H52348447j20759J05500J25110j14560j78635j3173N8055l0219l8982R0301
2176.3H52231085N9724j40726j32084O4909L9458j95324k20597p987K1994j91927k16782
2198.7H51311743n364j133k13742k00629J5974l398j97529j33574R5605O2347j62840
2221.2H50567460j64151K9445p75k07603j80960K6643L2544j54972j56223J9908P271
2243.6H49818587j63376j53005J1444j013j80126j92523j3053J6570j66058k04325
2264H48773122k2352J0967j74760k21313q2373q3447k36630k29895o6757o1870k46286
2286.4H47358406k95937j44661j15573k71380l06666j62423j72436l95060m65929l32356
$$ y = [852007508, 852178633, 852094948, 851996541, 852122486, 852258086, 852187335, 852133453, 852295578, 852443159, 852348447, 852227688, 852333188, 852458298, 852343738, 852165103, 852151930, 852209985, 852179766, 852140784, 852231085, 852290809, 852150083, 852017999, 852082908, 852122366, 851927042, 851706445, 851698458, 851720452, 851528525, 851311743, 851306379, 851305246, 851091504, 850890875, 850906849, 850903451, 850705922, 850572348, 850667953, 850730300, 850567460, 850403309, 850432754, 850431979, 850224376, 850043416, 850070059, 850102603, 849947631, 849791408, 849811316, 849818587, 849655211, 849502206, 849513650, 849512637, 849332511, 849139988, 849126935, 849143505, 848977447, 848773122, 848750770, 848761737, 848586977, 848365664, 848283291, 848199844, 847963214, 847733319, 847666562, 847604692, 847358406, 847062469, 846917808, 846802235, 846530855, 846224189, 846061766, 845889330, 845494270, 845028341, 844695985]
2306.8H44695985l36408n04256n23150l82602m24146o64056o76811l91662j99914k09927
2327.2H40383053j81318m6014p6652k85864l11315q2850J08480K17736N45621P89046
2347.6H41059923M69983j16110m25339k75850j09136j34945j05500R5069K68221K30491
2368H40956807J50979K20060K33352J13786J27375K49087J94312j8061j17242l4988
2388.4H42075467k6941j68085j95563o9380l0994j38164k08378j52051j05262j73926
2408.8H40806723k27869j61230j14203k01941k60889j70589j29222k23220k36153j11998
2429.2H38969409o9856j88708k72990k16782j64509k07007k22683j35541r6499j97530
2449.6H37197304k79546k12789j31309j96635k63811j67787q3744j67787k64883k19286
$$ y = [844695985, 844359577, 843855321, 843332171, 842949569, 842525423, 841861367, 841184556, 840792894, 840592980, 840383053, 840201735, 840155721, 840079069, 839793205, 839481890, 839399040, 839507520, 839725256, 840270877, 841059923, 841529906, 841413796, 840988457, 840712607, 840603471, 840468526, 840363026, 840458095, 840726316, 840956807, 841107786, 841327846, 841561198, 841674984, 841802359, 842051446, 842245758, 842227697, 842110455, 842075467, 842048526, 841880441, 841684878, 841615498, 841584504, 841446340, 841237962, 841085911, 840980649, 840806723, 840578854, 840417624, 840303421, 840101480, 839840591, 839670002, 839540780, 839317560, 839081407, 838969409, 838899553, 838710845, 838437855, 838221073, 838056564, 837849557, 837626874, 837491333, 837394834, 837197304, 836917758, 836704969, 836573660, 836377025, 836113214, 835945427, 835861683, 835693896, 835429013, 835209727]
2470H35209727j49667k13265k76924j96456j22071j85609k64465k12431j40846k04861
2490.4H33243132k62797j66774q8871j92999k86699j94609q9526j35422k04742j40071
2510.8H31480622p0870j56283k35796j28090k0504j35720k45273j24038k4795j60456
2531.2H30178797l16560k44379j12116j87517k92241j90079j04249k49743l72589k70486
2551.6H27838838j78516k93553l80754k38657j37091k77757l96848k89440j83583k92718
2572H25169921l78549k35558j54078l17514m20749k97367k02120k96175l44932j94192
2592.4H22328687j03414k33770l40938k41101j68264k87533l33488j76787j05739k55346
2612.8H20082307l63410k83241k19047l30508l95715k54452k11597m20391n42283m38631
$$ y = [835209727, 835060060, 834846795, 834569871, 834373415, 834251344, 834065735, 833801270, 833588839, 833447993, 833243132, 832980335, 832813561, 832724690, 832531691, 832244992, 832050383, 831960857, 831825435, 831620693, 831480622, 831409752, 831253469, 831017673, 830889583, 830869079, 830733359, 830488086, 830364048, 830339253, 830178797, 829862237, 829617858, 829505742, 829318225, 829025984, 828835905, 828731656, 828481913, 828109324, 827838838, 827660322, 827366769, 826986015, 826747358, 826610267, 826332510, 825935662, 825646222, 825462639, 825169921, 824791372, 824555814, 824401736, 824084222, 823663473, 823366106, 823163986, 822867811, 822522879, 822328687, 822225273, 821991503, 821650565, 821409464, 821241200, 820953667, 820620179, 820443392, 820337653, 820082307, 819718897, 819435656, 819216609, 818886101, 818490386, 818235934, 818024337, 817603946, 817061663, 816623032]
2633.2H16623032l98934n35369o01828m82023m41849o20067p20024o21140o01471p30633
2653.5H10869694p47442n94438n36024o64294p02381n40614m36068m71949m27664k61187
2673.9H05487633k22862l55005m08411l45767l50654m32491m18484k91110k82764m50194
2694.3H01929891n30481m46379m37797n32209m74811k76923k35319l85702m33266l00169
2714.7G97876835k40266k82586j83523K9087Q8096l1471n5194J02401J69575R9301
2735.1G97572255J11520J68264R9540l874K5153O8247l0637j51157j11580J0669p808
2757.6G97750592j45375j97292j45554j55092k20537j86443q3983r2805k30908l05474
2778G95987129k52962k22683k50101k15650j64091k43545l80873m20392l74854l90827
$$ y = [816623032, 816224098, 815688729, 815086901, 814604878, 814163029, 813542962, 812822938, 812201798, 811600327, 810869694, 810122252, 809527814, 808991790, 808327496, 807625115, 807084501, 806648433, 806176484, 805748820, 805487633, 805264771, 804909766, 804501355, 804155588, 803804934, 803372443, 802953959, 802662849, 802380085, 801929891, 801399410, 800953031, 800515234, 799983025, 799508214, 799231291, 798995972, 798610270, 798177004, 797876835, 797636569, 797353983, 797170460, 797199547, 797287643, 797256172, 797200978, 797303379, 797472954, 797572255, 797683775, 797852039, 797951579, 797947705, 797972858, 798041105, 798010468, 797859311, 797747731, 797758400, 797750592, 797605217, 797407925, 797262371, 797107279, 796886742, 796700299, 796616316, 796523511, 796292603, 795987129, 795734167, 795511484, 795261383, 795045733, 794881642, 794638097, 794257224, 793836832, 793461978, 793071151]
2798.4G93071151n04732n53191n02944n08487n85079o26922o13153o06060o13034n57244
2818.8G87400305m74930n01155o15478o77884o48200o44088p36117p97451p74801q41558
2839.1G80688643j037597j160205j142382j134873j206576j224041j086653r34243
2855.5G71762073q95977r37998j024664j133144j252114j309753j200437j011372r60112
2873.8G62036502j029133j036048j043380j159191j259863j264334j288056j400054
2890.1G52556443j476049j433313j401901j423836j303315r99511p26819n81085m49121
2908.5G42761493l36528m50373q46743j279116j529515j639962j695216j646518j414597
2926.8G31922925j163006j121283j051724p15315l70860j73927J3650Q1718j98066
$$ y = [793071151, 792566419, 792013228, 791510284, 791001797, 790416718, 789789796, 789176643, 788570583, 787957549, 787400305, 786925375, 786424220, 785808742, 785130858, 784482658, 783838570, 783102453, 782305002, 781530201, 780688643, 779651046, 778490841, 777348459, 776213586, 775007010, 773782969, 772696316, 771762073, 770866096, 769928098, 768903434, 767770290, 766518176, 765208423, 764007986, 762996614, 762036502, 761007369, 759971321, 758927941, 757768750, 756508887, 755244553, 753956497, 752556443, 751080394, 749647081, 748245180, 746821344, 745518029, 744518518, 743791699, 743210614, 742761493, 742424965, 741974592, 741127849, 739848733, 738319218, 736679256, 734984040, 733337522, 731922925, 730759919, 729638636, 728586912, 727871597, 727500737, 727326810, 727340460, 727422178, 727224112]
2945.2G27224112p21574j148582j322627j481354j733899j846969j771272j744389
2961.5G15453446j925707k196372k412498k619206k816618k845824k575934k030551
2977.8F96030736j389921q20160l73661r5666J6034N2571j3828k49445m89712o21200
2998.2F92045748o62029o16788n76914m93765k20298M4643J610k09868l37184m48763
3018.6F88526392o24120p37608p67350p85053p64250p13766p23541r56297j296043
3037F81158364j406253j403987j571238j829922j903773j748979j672864j814782k001822
3055.3F65804744k165437k283931k301097k266466k264679k436578k782762l029168
3071.7F46274626l074884l108680l350556l782273m092753m206717m342675m475474
$$ y = [727224112, 726502538, 725353956, 724031329, 722549975, 720816076, 718969107, 717197835, 715453446, 713527739, 711331367, 708918869, 706299663, 703483045, 700637221, 698061287, 696030736, 694640815, 693820655, 693446994, 693351328, 693367362, 693419933, 693406105, 693156660, 692666948, 692045748, 691383719, 690766931, 690190017, 689696252, 689475954, 689520597, 689522207, 689312339, 688975155, 688526392, 687902272, 687164664, 686397314, 685612261, 684848011, 684134245, 683410704, 682454407, 681158364, 679752111, 678348124, 676776886, 674946964, 673043191, 671294212, 669621348, 667806566, 665804744, 663639307, 661355376, 659054279, 656787813, 654523134, 652086556, 649303794, 646274626, 643199742, 640091062, 636740506, 632958233, 628865480, 624658763, 620316088, 615840614]
3088F15840614m573405m808009n067348n144417n183578n429745n833387o118715o238282
3106.3E67443728o376862o502926o267488n606354m842519m086435l300369k455950
3122.6E28004825j548886p51972k46585n0247k3901m6313j35422m15861r58145j544595
3143E22282898k016305k449215k850115l254295l782272m330337m701465m995436n327254
3161.4D88576204n620242n777537n748451n476535m908829m094303l072560j865834
3177.7D52011913n23359Q82537K285689L604114M740447N606830O177723O551057O856084
3196.1D88193035P144213P387876P612646P896245Q194148Q401454Q467018Q283436
3212.4E51580071P771671O908059N783558M612744L451228K270282J141965J55807
$$ y = [615840614, 611267209, 606459200, 601391852, 596247435, 591063857, 585634112, 579800725, 573682010, 567443728, 561066866, 554563940, 548296452, 542690098, 537847579, 533761144, 530460775, 528004825, 526455939, 525703967, 525457382, 525407135, 525383234, 525336921, 525201499, 524785638, 523827493, 522282898, 520266593, 517817378, 514967263, 511712968, 507930696, 503600359, 498898894, 493903458, 488576204, 482955962, 477178425, 471429974, 465953439, 461044610, 456950307, 453877747, 452011913, 451488554, 452371091, 454656780, 458260894, 463001341, 468608171, 474785894, 481336951, 488193035, 495337248, 502725124, 510337770, 518234015, 526428163, 534829617, 543296635, 551580071, 559351742, 566259801, 572043359, 576656103, 580107331, 582377613, 583519578, 583675385]
3228.7E83675385p12932j549124k369702l068745l580034m003763m414022m757047
3245E59220016m979312n176068n407750n570710n661070n765021n842507n804897n665779
3263.4E09346902n475044n211025m885197m587978m242599l681570k886177j888841
3279.7D76488471p43151M41581J564563K500921L145099L479868L535777L402949L160983
3298D96977061K903968K735794K541721K089440J470149R76741O96659N19872L03328
3316.4E11214733P3850r1374k32160m46021q25286j216591j430630j557708j610398
3334.8E03878415j656533j973569k401799k615303k748638k819896k806723l119290
3351.1D83736664l663719l855466l680587l502101l469944l342688k878487k423972
$$ y = [583675385, 582962453, 581413329, 579043627, 575974882, 572394848, 568391085, 563977063, 559220016, 554240704, 549064636, 543656886, 538086176, 532425106, 526660085, 520817578, 515012681, 509346902, 503871858, 498660833, 493775636, 489187658, 484945059, 481263489, 478377312, 476488471, 475745320, 476186901, 477751464, 480252385, 483397484, 486877352, 490413129, 493816078, 496977061, 499881029, 502616823, 505158544, 507247984, 508718133, 509694874, 510391533, 510911405, 511214733, 511288583, 511197209, 510965049, 510519028, 509693742, 508477151, 507046521, 505488813, 503878415, 502221882, 500248313, 497846514, 495231211, 492482573, 489662677, 486855954, 483736664, 480072945, 476217479, 472536892, 469034791, 465564847, 462222159, 459343672, 456919700]
3367.4D56919700k359301k423465k125710j532793j125336r86785r46730q20101n34594
3385.7D44064885j68860J50323J85967J15126N33313J522988K424389K793163L117412
3404.1D54738706L895223M725993N240321N527318N656928N783111O055980O293715
3420.4D97917295O284356O222367O225645O113947N838215N637348N471945N006909
3436.7E44718027M400551M147351M184187M110574L915430L701031L535986L415763
3453.1E76128900L344059L355801L293157L064334K948940L093958L099263K656221
3469.4F00984633K140224K114236K425373K628922K500415K209127K194286K329766
3485.7F19526982K259255K185762K277374K340019K350330K286613K205849K200484
$$ y = [456919700, 454560399, 452136934, 450011224, 448478431, 447353095, 446366310, 445419580, 444599479, 444064885, 443896025, 444046348, 444232315, 444347441, 444880754, 446403742, 448828131, 451621294, 454738706, 458633929, 463359922, 468600243, 474127561, 479784489, 485567600, 491623580, 497917295, 504201651, 510424018, 516649663, 522763610, 528601825, 534239173, 539711118, 544718027, 549118578, 553265929, 557450116, 561560690, 565476120, 569177151, 572713137, 576128900, 579472959, 582828760, 586121917, 589186251, 592135191, 595229149, 598328412, 600984633, 603124857, 605239093, 607664466, 610293388, 612793803, 615002930, 617197216, 619526982, 621786237, 623971999, 626249373, 628589392, 630939722, 633226335, 635432184, 637632668]
3502F37632668K095997J973272K092659K352715K514839K404690K174318K147495K312422
3520.4F57701075K533972K476395K164840K143860K384901K556801K663970K613902
3536.7F77239716K449930K526343K667486K546668K291024K214015K296686K377093
3553F96608961K453684K526820K565324K467156K144277K002299K628624L194213K903044
3571.3G19494402K590537K627373K724052K856195K934992K711594K426088K612770
3587.7G40978003K972722K783119K599061K824962K976298K846122K727509K524972
3604G63232768K175629K209484K471686K466142K366364K071917K040505K579630K516091
3622.3G84130216J761019J080811J300216K209603K101660J681745J502395J363397
$$ y = [637632668, 639728665, 641701937, 643794596, 646147311, 648662150, 651066840, 653241158, 655388653, 657701075, 660235047, 662711442, 664876282, 667020142, 669405043, 671961844, 674625814, 677239716, 679689646, 682215989, 684883475, 687430143, 689721167, 691935182, 694231868, 696608961, 699062645, 701589465, 704154789, 706621945, 708766222, 710768521, 713397145, 716591358, 719494402, 722084939, 724712312, 727436364, 730292559, 733227551, 735939145, 738365233, 740978003, 743950725, 746733844, 749332905, 752157867, 755134165, 757980287, 760707796, 763232768, 765408397, 767617881, 770089567, 772555709, 774922073, 776993990, 779034495, 781614125, 784130216, 785891235, 786972046, 788272262, 790481865, 792583525, 794265270, 795767665, 797131062]
3638.7G97131062J289784J121045O57200J85311O16670J638353J458704R15110J092613
3657H06105852J199126P01070K85268J32501j14083j57833K37822%k07722N66483Q69393
3679.4H09617877O54697M38035J68025j9490P5578L87311N30959L74078M8220k30669
3699.8H12044621j43111J63734K8193m57585o91295j42395M62651K80857q8513k39313
3720.2H11217844k60055k51174j27434n8472l27588o14225l80755K93553M93705j62542
3740.6H09822857j054048r25720q9645l77119m54068M45664N58913Q344j88470J0848
3761H07757556o8724l01957l52025k54631J3113R8050j21773l12507l03328k18510
3781.4H05935264k24293j86920j05023j41680k69473m58300n39184m74810n71072l53039
$$ y = [797131062, 798420846, 799541891, 800199091, 800384402, 801001072, 802639425, 804098129, 805013239, 806105852, 807304978, 808006048, 808291316, 808423817, 808309734, 808151901, 808389723, 808389723, 808182001, 808748484, 809617877, 810272574, 810710609, 810878634, 810859144, 810934722, 811322033, 811852992, 812227070, 812275290, 812044621, 811901510, 812065244, 812093437, 811635852, 810944557, 810802162, 811264813, 811545670, 811457157, 811217844, 810957789, 810706615, 810579181, 810520709, 810193121, 809578896, 809198141, 809491694, 809985399, 809822857, 808768809, 807843089, 807753444, 807376325, 806922257, 807367921, 807926834, 807935178, 807746708, 807757556, 807688832, 807386875, 807034850, 806780219, 806793332, 806891382, 806769609, 806457102, 806153774, 805935264, 805710971, 805524051, 805419028, 805277348, 805007875, 804549575, 804010391, 803535581, 802964509, 802611470]
3801.8H02611470q285j86443k563K61605j08242o21200o09756l60786m66705q6188
3822.2H00422907L18169J26303r4354k43545k20478k15113n39362n97477j24037K12371
3842.6G99045384L43084J84179l83556j188040j372755J63854R17434L10660k87474
3861G97732770m93407k41637j73986m06861k38836P1347J97351P152l54290k06053
3881.4G95893550j5259p1347l0338j98365k50101L2783r537l75092n57244m12345l8743
3903.8G93967962L76225M01616J19507q0824j93953k70844j55866J9074l2604j16408
3924.2G94033885k5570o1751j83284j3471J61588N782j67608k19226j65343M172J2577
3946.6G93381751r9183j01685p7427q6784q3625r5010j13606q2612m8817n5909j19865
$$ y = [802611470, 802603185, 802416742, 802414179, 802675784, 802567542, 801946342, 801336586, 800975800, 800509095, 800422907, 800741076, 800867379, 800773025, 800529480, 800309002, 800093889, 799554527, 798957050, 798833013, 799045384, 799388468, 799572647, 799189091, 798001051, 796628296, 796792150, 797709584, 798020244, 797732770, 797239363, 796997726, 796823740, 796416879, 796178043, 796249390, 796446741, 796453893, 796099603, 795893550, 795878291, 795806944, 795776606, 795578241, 795328140, 795360923, 795351386, 794976294, 794419050, 794006705, 793967962, 794344187, 794745803, 794865310, 794784486, 794590533, 794319689, 794163823, 794182897, 794150293, 794033885, 794008315, 793946564, 793763280, 793749809, 793911397, 793917179, 793749571, 793530345, 793365002, 793369174, 793381751, 793282568, 793180883, 793103456, 793016672, 792933047, 792838037, 792724431, 792641819, 792593002, 792537093, 792417228]
3969.1G92417228j80840j54853q2135m1187m4704j073J4067j22845k40684k13563j47760
3991.5G91201651j36018j27613p1764
3997.6G90866256
$$ y = [792417228, 792236388, 792081535, 791999400, 791958213, 791913509, 791912436, 791926503, 791803658, 791562974, 791349411, 791201651, 791065633, 790938020, 790866256]
##END=$$ End of the data block
