##TITLE=$$ Begin of the data block
##JCAMP-DX=5.00 $$ ACD/SpecManager v 10.08
##SPECTROMETER/DATA SYSTEM=Alpha
##DATE=11 Jun 2014 07:55:32
##DATA TYPE=INFRARED SPECTRUM
##DATA CLASS=XYDATA
##ORIGIN=
##OWNER=
##NPOINTS=1765
##FIRSTX=399.75695801
##LASTX=3997.56933594
##MAXX=3997.56933594
##MINX=399.75695801
##MAXY=0.62029660
##MINY=0.00868086
##XFACTOR=1.0000000000
##YFACTOR=1.000000000000000e-9
##FIRSTY=0.15100761
##DELTAX=2.03957629
##XUNITS=1/CM
##YUNITS=ARBITRARY UNITS
##XYDATA=(X++(Y..Y))
399.8A51007608P868230P676437P974163Q248612Q125872Q042708P667005O707564
416.1B13318199P364228R001330P964089O807059O858513O844551O452828O064058
432.4B70674855O346404O822288O293327N494594N550176N325973M427850M072935
448.7C15008402M235089L825664K816528K884597L417730K443224J333863J649976
465C37615073K607792K768368K766132L777176M652977M421533M138231M699766N201012
483.4C72648060M493356L688395L900260L868937K775878K181232K716362K838254
499.7C99110734K113909J793206K140790J853138R32902Q70943J441121J214713L50714
518.1D11822170L14266R63479P88957J35451N46307J237452Q22991M01467J195550
$$ y = [151007608, 158875838, 166552275, 174526438, 182775050, 190900922, 198943630, 206610635, 213318199, 220682427, 229683757, 237647846, 244454905, 251313418, 258157969, 264610797, 270674855, 277021259, 283843547, 290136874, 295631468, 301181644, 306507617, 310935467, 315008402, 319243491, 323069155, 325885683, 328770280, 332188010, 334631234, 335965097, 337615073, 340222865, 342991233, 345757365, 349534541, 354187518, 358609051, 362747282, 367447048, 372648060, 377141416, 380829811, 384730071, 388599008, 391374886, 393556118, 396272480, 399110734, 401224643, 403017849, 405158639, 407011777, 407944679, 408815622, 410256743, 411471456, 411822170, 412136436, 413099915, 413888872, 414024323, 414570630, 415808082, 416631073, 417032540, 418228090]
536.4D18228090K128631J922995J461386J879126K207279J515657R01848J201242J344115
554.8D32790369M53263j27911Q13484J808822J512617J020819J252443J199573N12600
573.1D41236079M52280J144916J221448O08027P06702J455277J466275P82996O53327
591.5D49727327J048892Q08001J20312m7177l6508o75052j494825j414270n74648n8621
611.9D47403431M5985M38929R51707J010269R13024J164347J315385Q76516N97238
630.2D54716831J165867J800120J694530J342625J355946J343161R28044M60267J99408
648.6D65006799K2947l37898p68483p51138m92066o45757r95248j150638j343161q91238
669D57654119O496J43260P7605k63214p66843r16183r05633j329392k151341k807766
$$ y = [418228090, 420356721, 422279716, 423741102, 425620228, 427827507, 429343164, 430245012, 431446254, 432790369, 433243632, 433115721, 433929205, 435738027, 437250644, 438271463, 439523906, 440723479, 441236079, 441688359, 442833275, 444054723, 444662750, 445369452, 446824729, 448291004, 449074000, 449727327, 450776219, 451584220, 451704532, 451657355, 451620847, 450945795, 449450970, 448036700, 447462052, 447403431, 447449416, 447888345, 448840052, 449850321, 450763345, 451927692, 453243077, 454119593, 454716831, 455882698, 457682818, 459377348, 460719973, 462075919, 463419080, 464347124, 464807391, 465006799, 465029746, 464691848, 463923365, 463172227, 462680161, 462034404, 461039156, 459888518, 458545357, 457654119, 457660615, 457803875, 457881480, 457618266, 456851423, 455935240, 455029607, 453700215, 451548874, 448741108]
689.4D48741108l413111m594385o129265p317275q010060q956313j0796398j2697965
705.7C86826336j3498127j2618035r965032o907940n101443l687530k4230O337136
722C41361135J3165415J8446028K1570921K2602081K1565914J8573404J4671206J1295944
738.3D83252048Q578003N833924L654003K821267K368152J331567N41509O94096P96377
756.7E09870946K10822j23799K23756L00586j83522l34323J01328J45018m73499o52373
777.1E09084940o8486K94030L4153j75416j37389m11272j016736j242101r64999q08954
797.5E04587770q22604m69566P2718j311n95570r83953j113832j440138j938611k177060
817.9D95117843k259552k581537l049851l337234l590345m204214n054831n708784
$$ y = [448741108, 445327997, 440733612, 434604347, 427287072, 419277012, 410320699, 399524301, 386826336, 373328209, 360710174, 350745142, 343837202, 338735759, 335048229, 335023999, 341361135, 354526550, 372972578, 394543499, 417145580, 438711494, 457284898, 471956104, 483252048, 491830051, 497663975, 501317978, 504139245, 506507397, 507838964, 508380473, 509074569, 509870946, 510081768, 509957969, 510181725, 510482311, 510298789, 509964466, 510065794, 510210812, 509737313, 509084940, 509016454, 509310484, 509344637, 509169221, 509031832, 508620560, 507603824, 506361723, 505396724, 504587770, 503765166, 503295600, 503368318, 503367007, 502771437, 501787484, 500673652, 499233514, 497294903, 495117843, 492858291, 490276754, 487226903, 483889669, 480299324, 476095110, 471040279, 465331495]
834.2D65331495o290853p274688q792936j0933370j4553487j7578512j3766617n385369
850.5C80755663l478944r701074j6884923k1950095k6455850l2188892l9987520m8987269
866.8A81121096n2436814m1316725k0493247m212752N363882J5138604K7392104M0271588
883.1A50827736N2148893N9911922N8849156M9031704L6539346K6427925J9278526
897.4D53015208J4233262J0843664Q416951O293833M653245L809601L282726K618074
913.7E07166564K109528J919210J552045P96080J64390j5796k01583o50882q63314
932.1E11976242o52850n57661q24392r69767q32617r17852j348496j684665j849950
950.4E02337992k198517k798677l239095l366202l664613m238546m549771m629880
$$ y = [465331495, 459040642, 451765954, 442973018, 432039648, 417486161, 399907649, 386141032, 380755663, 377276719, 367575645, 350690722, 328740627, 302284777, 270095885, 230108365, 181121096, 128684282, 87367557, 66874310, 62661558, 68025440, 83164044, 110556148, 150827736, 202976629, 262888551, 321737707, 370769411, 407308757, 433736682, 453015208, 467248470, 478092134, 486509085, 492802918, 497456163, 501265764, 504548490, 507166564, 509276092, 511195302, 512747347, 513543427, 513707817, 513692021, 513490438, 512839556, 511976242, 511323392, 510765731, 509941339, 508971572, 508138955, 507221103, 505872607, 504187942, 502337992, 500139475, 497340798, 494101703, 490735501, 487070888, 482832342, 478282571, 473652691]
966.8D73652691n054504n712569o111383o442219p151813p980823q443266q636713
983.1D18119401q801788q811355q485347q008748p682383p400364o953389o571233
999.4C55404794o475240o518125o503135o451845o406606o202131n786896n283028
1015.7C05777788m732102m085720l353208k639770k061963j535535r03994k75314K08408
1034.1B86398590M88698M77791J49071l13789o90281q92013q46595n37962J9491P85619
1054.5B85038620J575232K191812K522409K386450J705677O22004p09057k104133l234685
1072.8B89994329l800630l784806l421903k800166j622170l070J525909K907246M053921
1091.2B83048660M424989L721684K352774J101792M18872K85834N61773J045645J491278
$$ y = [473652691, 468598187, 462885618, 456774235, 450332016, 443180203, 435199380, 426756114, 418119401, 409317613, 400506258, 392020911, 384012163, 376329780, 368929416, 361976027, 355404794, 348929554, 342411429, 335908294, 329456449, 323049843, 316847712, 311060816, 305777788, 301045686, 296959966, 293606758, 290966988, 288905025, 287369490, 286465496, 286190182, 286398590, 286887288, 287365079, 287514150, 287200361, 286510080, 285618067, 284771472, 284233510, 284253001, 285038620, 286613852, 288805664, 291328073, 293714523, 295420200, 296042204, 295333147, 293229014, 289994329, 286193699, 282408893, 278986990, 276186824, 274564654, 274561584, 276087493, 278994739, 283048660, 287473649, 291195333, 293548107, 294649899, 295068771, 295354605, 295916378, 296962023, 298453301]
1109.5B98453301J753211J802653J605302J180441P09474L74049K03639M8607j82896
1127.9C05947781m03405o29574j017064j551389j984418k143234k105772j953811j602083
1146.2B92557031j107454p36893n53280l63022n1647L23683P33346J230716J751453
1164.6B93783933K003938J799941J434207J244455J145036R97751Q62033O81638K47747
1182.9C04200679l92049r68904j404404j807332k202750k428680k417118k372384k351343
1201.3B87855715k205581k019733k014250k188980k408058k621978k880395l135353
1217.6B68381387l240973l243476l297478l397882l394246l286406l222838l199205
1233.9B42098883l115028l012628l019005l096759l099710l008619k977937l032193
$$ y = [298453301, 300206512, 302009165, 303614467, 304794908, 305504382, 305878431, 306082070, 306130677, 305947781, 305544376, 304914802, 303897738, 302346349, 300361931, 298218697, 296112925, 294159114, 292557031, 291449577, 290712684, 290159404, 289796382, 289744735, 290068418, 290801764, 292032480, 293783933, 295787871, 297587812, 299022019, 300266474, 301411510, 302409261, 303271294, 303952932, 304200679, 303808630, 302839726, 301435322, 299627990, 297425240, 294996560, 292579442, 290207058, 287855715, 285650134, 283630401, 281616151, 279427171, 277019113, 274397135, 271516740, 268381387, 265140414, 261896938, 258599460, 255201578, 251807332, 248520926, 245298088, 242098883, 238983855, 235971227, 232952222, 229855463, 226755753, 223747134, 220769197, 217737004]
1250.3B17737004l054932l050074l095761l164932l173604l137082l132090l171980
1266.6A92756549l172607l185257l284156l397897l425926l394053l412515l467530
1282.9A66016608l504231l540322l599748l616154l619716l669381l730357l737777
1299.2A36998922l685147l638148l623188l618359l555224l472343l409073l340236
1315.5A08657204l301628l289320l245339l245465l291235l291212l272093l189572
1331.8H2531340l038145k984606l148585l263958l073983k872378k854597k860471
1348.1E8434617k806235k735310k686195k622131k496075k425667k451569k334613
1364.5C7876822k105188k034436j972300j907082j902290j757439j591840j506022
$$ y = [217737004, 214682072, 211631998, 208536237, 205371305, 202197701, 199060619, 195928529, 192756549, 189583942, 186398685, 183114529, 179716632, 176290706, 172896653, 169484138, 166016608, 162512377, 158972055, 155372307, 151756153, 148136437, 144467056, 140736699, 136998922, 133313775, 129675627, 126052439, 122434080, 118878856, 115406513, 111997440, 108657204, 105355576, 102066256, 98820917, 95575452, 92284217, 88993005, 85720912, 82531340, 79493195, 76508589, 73360004, 70096046, 67022063, 64149685, 61295088, 58434617, 55628382, 52893072, 50206877, 47584746, 45088671, 42663004, 40211435, 37876822, 35771634, 33737198, 31764898, 29857816, 27955526, 26198087, 24606247, 23100225]
1380.8B3100225j407079j321316j309032j231972j087233j078688j106421r83890q85650
1399.1A2688944q19610p20894o38716n30422m44981l41199k15809j53848j26183j6421
1419.5H680861J21699J96852K41602K64187L04249L25330K89650K77926L52417L31968
1439.9A1386741K54683K10546J97106K05606J95714J56003R4312J05723K20908K59375
1460.3A3286717K07809K40972L32802L30092L11266M10360N22284N21742N55003O14710
1480.7A7333757O69418O76157P12842Q73141J078097J056805J040055J302164J454206
1499.1B6196642J344565J140615J224283J838610J910761J640264J593757J614895
1515.4C8504392J681723J737717J966205K002518J839742J955420J871232J830164
$$ y = [23100225, 21693146, 20371830, 19062798, 17830826, 16743593, 15664905, 14558484, 13574594, 12688944, 11869334, 11148440, 10509724, 9979302, 9534321, 9193122, 8977313, 8823465, 8697282, 8680861, 8802560, 8999412, 9241014, 9505201, 9809450, 10134780, 10424430, 10702356, 11054773, 11386741, 11641424, 11851970, 12049076, 12254682, 12450396, 12606399, 12700711, 12806434, 13027342, 13286717, 13494526, 13735498, 14068300, 14398392, 14709658, 15120018, 15642302, 16164044, 16719047, 17333757, 18003175, 18679332, 19392174, 20265315, 21343412, 22400217, 23440272, 24742436, 26196642, 27541207, 28681822, 29906105, 31744715, 33655476, 35295740, 36889497, 38504392, 40186115, 41923832, 43890037, 45892555, 47732297, 49687717, 51558949, 53389113]
1531.7E3389113K100073J941394J695603K327152K856940K636738K591349K554573
1548G2092935K760791K987511L112883L125667M311532N726680M204385L720932M051082
1566.4A06094398M313603M613399L926255L570192M281871L980815L338590L340632
1582.7A37459755L326118L190771L043592K899006K772525K675071K525523K383277
1599A60275638K317190K276495K140850K011672J975804J848266J549169J461417J678869
1617.4A77535370J450285J158893J231105J268461J208305J164019R70140R34929J378372
1635.7A88299879J604230J403570J327991J320586J648560K024397J600862J836225
1652B01066300L048912K597317K093703K316892K795055L035486K714127K899617L469304
$$ y = [53389113, 55489186, 57430580, 59126183, 61453335, 64310275, 66947013, 69538362, 72092935, 74853726, 77841237, 80954120, 84079787, 88391319, 94117999, 98322384, 102043316, 106094398, 110408001, 115021400, 118947655, 122517847, 126799718, 130780533, 134119123, 137459755, 140785873, 143976644, 147020236, 149919242, 152691767, 155366838, 157892361, 160275638, 162592828, 164869323, 167010173, 169021845, 170997649, 172845915, 174395084, 175856501, 177535370, 178985655, 180144548, 181375653, 182644114, 183852419, 185016438, 185986578, 186921507, 188299879, 189904109, 191307679, 192635670, 193956256, 195604816, 197629213, 199230075, 201066300, 204115212, 206712529, 208806232, 211123124, 213918179, 216953665, 219667792, 222567409, 226036713]
1670.4B26036713L225877L338650L747613L334313K900869L235325M553944M370361
1686.7B54743665L560096L663362L467470L705144M107952M171431M919410M220843
1703B86559373L585130L888220L610164L166735K862066K870887L562153L700971K969891
1721.4C16775590K764881K847910K654671K452404K340018K972156L320784K553790
1737.7C38682204K527178K780944K619594K451480K429127K767355L008663K574683
1754C59841228K350598K411842K292872K375722K244472J901120J748950J599937J702547
1772.4C78469288J626253R73672L08424k57939q31842j500160k093702k469659k842397
1790.7C71381938k873241k304405j791567j272410l58403O78867J491934K192289K959281
$$ y = [226036713, 229262590, 232601240, 236348853, 239683166, 242584035, 245819360, 250373304, 254743665, 258303761, 261967123, 265434593, 269139737, 273247689, 277419120, 282338530, 286559373, 290144503, 294032723, 297642887, 300809622, 303671688, 306542575, 310104728, 313805699, 316775590, 319540471, 322388381, 325043052, 327495456, 329835474, 332807630, 336128414, 338682204, 341209382, 343990326, 346609920, 349061400, 351490527, 354257882, 357266545, 359841228, 362191826, 364603668, 366896540, 369272262, 371516734, 373417854, 375166804, 376766741, 378469288, 380095541, 381069213, 381377637, 381119698, 380287856, 378787696, 376693994, 374224335, 371381938, 368508697, 366204292, 364412725, 363140315, 362781912, 363460779, 364952713, 367145002, 370104283]
1809.1C70104283L810525M376918M633546M887044M934699M616230M395426M380703
1825.4D06139374L974944L770262L777713L287077K878189K750039K477586K113730
1841.7D31168914K262354K563297K344817K127469K017200J887351J853138J866997
1858D48091537J829356J711279J558989J467586J641124J892090J788884J644195J582682
1876.4D63207722J509279J496821J526416J479625J339019J370817J533389J460791
1892.7D74923879J340926J410842J445949J361966J247972J238734J291424J276195
1909D85537887J247465J218021J151323J142771J216560J208127J264184J272768J122266
1927.4D96381372J092851J136989J077860J003176J053691J041174R64403J000822
$$ y = [370104283, 373914808, 378291726, 382925272, 387812316, 392747015, 397363245, 401758671, 406139374, 410114318, 413884580, 417662293, 420949370, 423827559, 426577598, 429055184, 431168914, 433431268, 435994565, 438339382, 440466851, 442484051, 444371402, 446224540, 448091537, 449920893, 451632172, 453191161, 454658747, 456299871, 458191961, 459980845, 461625040, 463207722, 464717001, 466213822, 467740238, 469219863, 470558882, 471929699, 473463088, 474923879, 476264805, 477675647, 479121596, 480483562, 481731534, 482970268, 484261692, 485537887, 486785352, 488003373, 489154696, 490297467, 491514027, 492722154, 493986338, 495259106, 496381372, 497474223, 498611212, 499689072, 500692248, 501745939, 502787113, 503751516, 504752338]
1943.7E04752338J084685J102269J019597R08077Q75652Q91387Q27313P59542P87019
1962.1E13007879Q52824R02891R71198J015305J020074J002073R36985R11177R15527
1980.4E21535933Q70526Q11457Q27969Q33153Q00133Q09908Q29935Q48770Q24034P50661
2000.8E29742479P49648Q02040P43151O56187O92785P63476P35462O82532P04766P51555
2021.2E37024081P39872O57976O30259O76811O80208O17266O23167O88433O62983O01649
2041.6E43602705O22332O83963O76871O28173O30736O83904O68824N74052N59092O36935
2062E49967587O51062N79595N58019O18577O52373N95867N81503O46055O28352N22137
2082.4E56001127M96864N58972N70655N30601N11289N49852N44012M54247M28677M84883
$$ y = [504752338, 505837023, 506939292, 507958889, 508866966, 509742618, 510634005, 511461318, 512220860, 513007879, 513860703, 514763594, 515734792, 516750097, 517770171, 518772244, 519709229, 520620406, 521535933, 522406459, 523217916, 524045885, 524879038, 525679171, 526489079, 527319014, 528167784, 528991818, 529742479, 530492127, 531294167, 532037318, 532693505, 533386290, 534149766, 534885228, 535567760, 536272526, 537024081, 537763953, 538421929, 539052188, 539728999, 540409207, 541026473, 541649640, 542338073, 543001056, 543602705, 544225037, 544909000, 545585871, 546214044, 546844780, 547528684, 548197508, 548771560, 549330652, 549967587, 550618649, 551198244, 551756263, 552374840, 553027213, 553623080, 554204583, 554850638, 555478990, 556001127, 556497991, 557056963, 557627618, 558158219, 558669508, 559219360, 559763372, 560217619, 560646296, 561131179]
2102.8E61131179M84944M11093L80337M17829M22776L47077L39806M29869M23551L08752
2123.2E65097213K79486L70383M07815L60191L39091L75986L76225L17692L19720M09722
2143.6E68653524M51386L75390L46243M58122N28812M70817M70281N82635O17206N30541
2164E73484957N13435O08563O27101N55813N61774O58810O80744N90444N45800O14643
2184.4E79442084O45459N67436N33283N84006N90324N26846N22196N74708N47647M26889
2204.8E84960878L77834M68731N23567M64022M27485N09917N52893M47750L71158M23551
2225.2E89527786M87268M61101M24564M57287M60148M09663M24921M90546M92335M05132
2245.6E94040751L66271M40896N04612M68255L90648M14014M81069M38154L77357M35948
$$ y = [561131179, 561616123, 562027216, 562407553, 562825382, 563248158, 563595235, 563935041, 564364910, 564788461, 565097213, 565376699, 565747082, 566154897, 566515088, 566854179, 567230165, 567606390, 567924082, 568243802, 568653524, 569104910, 569480300, 569826543, 570284665, 570813477, 571284294, 571754575, 572337210, 572954416, 573484957, 573998392, 574606955, 575234056, 575789869, 576351643, 577010453, 577691197, 578281641, 578827441, 579442084, 580087543, 580654979, 581188262, 581772268, 582362592, 582889438, 583411634, 583986342, 584533989, 584960878, 585338712, 585807443, 586331010, 586795032, 587222517, 587732434, 588285327, 588733077, 589104235, 589527786, 590015054, 590476155, 590900719, 591358006, 591818154, 592227817, 592652738, 593143284, 593635619, 594040751, 594407022, 594847918, 595352530, 595820785, 596211433, 596625447, 597106516, 597544670, 597922027, 598357975]
2265.9E98357975N04435M44233L74496M55439N23388M17650L40700M04895M12404K68758
2286.3F02504373J90198K75791K95579J57178Q8751J86324K21849Q1717n1438m8399
2306.7F03901923l4690n3108j848N1141o7234k93195l31044j10031M0949m1843l0756
2329.2F03030264K04087L06308J67370J07109K34843L89814O97196J220941R90212
2347.5F07348144j36256j027286j105964o88851k73645Q6725N12838R26137J141190
2365.9F06783032J181066J273573J436472J461267J321376J206994J160919R96411
2382.2F16821110P00712M70162L81589K92480J71304J49548K06828K02298J26779R6023
2402.6F19618833J43886J66118J02281O8188J04785R0778J728k8371J2993k5212j26481
$$ y = [598357975, 598862410, 599306643, 599681139, 600136578, 600659966, 601077616, 601418316, 601823211, 602235615, 602504373, 602694571, 602970362, 603265941, 603423119, 603511870, 603698194, 603920043, 604001760, 603950322, 603901923, 603867233, 603814125, 603812277, 603863418, 603796184, 603502989, 603171945, 603061914, 603102863, 603061020, 603030264, 603234351, 603540659, 603708029, 603815138, 604049981, 604439795, 605136991, 606357932, 607348144, 607211888, 606184602, 605078638, 604389787, 604116142, 604202867, 604715705, 605641842, 606783032, 607964098, 609237671, 610674143, 612135410, 613456786, 614663780, 615824699, 616821110, 617521822, 617991984, 618373573, 618666053, 618837357, 618986905, 619193733, 619396031, 619522810, 619618833, 619762719, 619928837, 620031118, 620099306, 620204091, 620294869, 620296597, 620268226, 620281219, 620256007, 620129526]
2425F20129526j29819n1260q8871k26319k52306k00152k58863l99530m57406m49777
2445.4F17615223n08368o30975p15792p69377q80539j042366j181722j313686j515806
2463.8F09056592j725554j857222j995027k246022k520084k691567k865494l149807
2480.1E90005815l410816l548980l653943l756524l779232l672838l477037l254712
2496.4E61451733l030777k823472k641320k489507k375543k277852k184033k120495
2512.7E41508734k043605j855969j565635j239717q71897m46498L397M56929R00328
2531.1E34846067J316548J704514K036631K294004K507090K673746K775728K813280
2547.4E52967608K787888K708614K560317K329827K079427J876533J685560J502633
$$ y = [620129526, 619999707, 619948447, 619859576, 619633257, 619380951, 619180799, 618921936, 618522406, 618065000, 617615223, 617106855, 616475880, 615760088, 614990711, 614110172, 613067806, 611886084, 610572398, 609056592, 607331038, 605473816, 603478789, 601232767, 598712683, 596021116, 593155622, 590005815, 586594999, 583046019, 579392076, 575635552, 571856320, 568183482, 564706445, 561451733, 558420956, 555597484, 552956164, 550466657, 548091114, 545813262, 543629229, 541508734, 539465129, 537609160, 536043525, 534803808, 533931911, 533485413, 533488810, 533945739, 534846067, 536162615, 537867129, 539903760, 542197764, 544704854, 547378600, 550154328, 552967608, 555755496, 558464110, 561024427, 563354254, 565433681, 567310214, 568995774, 570498407]
2563.7E70498407J369297J210690J018643Q73387P65145O71446O04630N55038M66585
2582.1E78033268L74020L59892L59416L01540K38955K41518K83122L22223L62992L79086
2602.5E81256032M05252M75943N38349O13809P17878Q03650R08613J043379J122534
2620.8E87885439J136601J156211J204193J231730J217902J192331J161098J152695
2637.1E97338200J167535J134038J059950J000881R41157Q36790P05540N96225M92931
2655.5F05273247L76105K72334J94847J03712R179l397o378q2075j33097j22190j27137
2677.9F05755150j71303k05577k08914k05279k27987k58625k63035k73824k98798k94268
2698.3F03347540k76446l05236l57151l71218l48210l34620l58880l89338l86059l96013
$$ y = [570498407, 571867704, 573078394, 574097037, 574970424, 575735569, 576407015, 577011645, 577566683, 578033268, 578407288, 578767180, 579126596, 579428136, 579667091, 579908609, 580191731, 580513954, 580876946, 581256032, 581661284, 582137227, 582675576, 583289385, 584007263, 584810913, 585719526, 586762905, 587885439, 589022040, 590178251, 591382444, 592614174, 593832076, 595024407, 596185505, 597338200, 598505735, 599639773, 600699723, 601700604, 602641761, 603478551, 604184091, 604780316, 605273247, 605649352, 605921686, 606116533, 606220245, 606229424, 606226027, 606219649, 606137574, 606004477, 605882287, 605755150, 605583847, 605378270, 605169356, 604964077, 604736090, 604477465, 604214430, 603940606, 603641808, 603347540, 603071094, 602765858, 602408707, 602037489, 601689279, 601354659, 600995779, 600606441, 600220382, 599824369]
2718.7E99824369m59313n06103m62354l43561l07262m12524m85539m65274m44889m24325
2739.1E95513225m02153m33266m99189n38349m94599m38989m67956n15461n18679n15759
2759.5E90688825n48244n66006n49435n74887o50287p14719p38978p03335o78837p03037
2779.9E84261060p27833p83920q71241r50694r48966r13918r78529j052678j045584
2798.3E75987697j019419j030504j087010j212418j330614j347065j350284j389027
2814.6E66221356j446068j529932j607120j658916j702071j768589j851320j944482
2830.9E52712858k085150k261161k453208k612114k810955l259123l856241m144252
2847.2E29230654l706872k701938j790882j359164j284659j312912j387715j628339
$$ y = [599824369, 599365056, 598858953, 598396599, 598053038, 597745776, 597333252, 596847713, 596382439, 595937550, 595513225, 595111072, 594677806, 594178617, 593640268, 593145669, 592706680, 592238724, 591723263, 591204584, 590688825, 590140581, 589574575, 589025140, 588450253, 587799966, 587085247, 586346269, 585642934, 584964097, 584261060, 583533227, 582749307, 581878066, 580927372, 579978406, 579064488, 578085959, 577033281, 575987697, 574968278, 573937774, 572850764, 571638346, 570307732, 568960667, 567610383, 566221356, 564775288, 563245356, 561638236, 559979320, 558277249, 556508660, 554657340, 552712858, 550627708, 548366547, 545913339, 543301225, 540490270, 537231147, 533374906, 529230654, 525523782, 522821844, 521030962, 519671798, 518387139, 517074227, 515686512, 514058173]
2863.5E14058173j920820k061247k148629k183735j943886j543820j327157j294166
2879.9D99634713j247853j173049j156301j167655j112550j035392j003653r42409
2896.2D90795851q20399p80671q58128r26167j024962j298696j733809k157808k309054
2914.5D78886157k044677j506836r16600m31538r3311J10954K65599N08547O99490
2932.9D75477785P17163P57933Q58247Q13395O78301O36458N95391M00096J24037k2560
2953.3D81036246m5300n2333p152J43856L79741N89579P33376Q48144Q82864Q48651
2973.7D85357672P91192O55979N60284N93751N76586M42654L14712K31505J86920K19673
2994.1D89930928K34216K09451K21342K35230K76446K96742K21192J44661J37567J84983
$$ y = [514058173, 512137353, 510076106, 507927477, 505743742, 503799856, 502256036, 500928879, 499634713, 498386860, 497213811, 496057510, 494889855, 493777305, 492741913, 491738260, 490795851, 489975452, 489194781, 488336653, 487410486, 486385524, 485086828, 483353019, 481195211, 478886157, 476841480, 475334644, 474418044, 473986506, 473893195, 474004149, 474269748, 474778295, 475477785, 476194948, 476952881, 477811128, 478624523, 479302824, 479939282, 480534673, 480934769, 481058806, 481036246, 480990946, 480938613, 480931461, 481075317, 481455058, 482044637, 482778013, 483626157, 484509021, 485357672, 486148864, 486804843, 487365127, 487958878, 488535464, 488978118, 489292830, 489524335, 489711255, 489930928, 490165144, 490374595, 490595937, 490831167, 491107613, 491404355, 491625547, 491770208, 491907775, 492092758]
3014.5D92092758K17319J61946L9309j29342k84374l80993m78118n38677n72175o03765
3034.9D89523888o40214p86394r33677r25064q42243q58754r94921j036554r54509
3053.2D81551558r55671j038522j076728j065642j058012j066834j014649r25720r64940
3071.6D72384840j079261j125574j113445j064270j018823r90003r64969j011283j097470
3089.9D62919742j086563j008302j009554j112967j171500j124233j139790j235187
3106.2D54031646j226425j155347j225441j390338j407534j270145j163423j183212
3122.6D44009781j299113j391769j414299j403689j379251j401425j516372j586169
3138.9D32617694j515597j445919j481772j563191j632691j683205j665980j613855
$$ y = [492092758, 492310077, 492472023, 492511332, 492381990, 492097616, 491716623, 491238505, 490699828, 490127653, 489523888, 488883674, 488097280, 487163603, 486238539, 485396296, 484537542, 483542621, 482506067, 481551558, 480595887, 479557365, 478480637, 477414995, 476356983, 475290149, 474275500, 473349780, 472384840, 471305579, 470180005, 469066560, 468002290, 466983467, 465993464, 465028495, 464017212, 462919742, 461833179, 460824877, 459815323, 458702356, 457530856, 456406623, 455266833, 454031646, 452805221, 451649874, 450424433, 449034095, 447626561, 446356416, 445192993, 444009781, 442710668, 441318899, 439904600, 438500911, 437121660, 435720235, 434203863, 432617694, 431102097, 429656178, 428174406, 426611215, 424978524, 423295319, 421629339, 420015484]
3155.2D20015484j613676j622171j619726j669973j743078j755327j737267j739174
3171.5D06515092j736135j731455j736551j753986j782328j783878j774818j740306
3187.8C92475635j666129j694768j800836j784354j690030j675874j712144j708000
3204.1C78743500j681686j667112j658171j653582j634300j641512j680374j645833
3220.5C65480930j582653j581371j605778j615197j618743j598567j548201j541107
3236.8C52789313j568467j557410j528501j546294j586854j577914j533240j541793
3253.1C40348840j615942j655668j616269j550734j541346j555175j504541j477152
3269.4C27832013j517266j497894j376033j267821j277357j340687j349718j282870
$$ y = [420015484, 418401808, 416779637, 415159911, 413489938, 411746860, 409991533, 408254266, 406515092, 404778957, 403047502, 401310951, 399556965, 397774637, 395990759, 394215941, 392475635, 390809506, 389114738, 387313902, 385529548, 383839518, 382163644, 380451500, 378743500, 377061814, 375394702, 373736531, 372082949, 370448649, 368807137, 367126763, 365480930, 363898277, 362316906, 360711128, 359095931, 357477188, 355878621, 354330420, 352789313, 351220846, 349663436, 348134935, 346588641, 345001787, 343423873, 341890633, 340348840, 338732898, 337077230, 335460961, 333910227, 332368881, 330813706, 329309165, 327832013, 326314747, 324816853, 323440820, 322172999, 320895642, 319554955, 318205237, 316922367]
3285.7C16922367j191646j149118j139373j141250j149684j103312j044780j057118
3302C07946086j102656j116842j074672j033187j075834j138717j140356j164973j223832
3320.4B97875017j257002j300365j323551j300782j295060j321435j339287j349329
3336.7B87388206j335025j254052j162231j115114j104146j125872j102746r87202
3353B78201818r25302r63032r67801r16868q75771q46804q26031p76082o91533o66082
3373.4B69746512o77228o38932n72860n69463n83678n39542m84555m28260l65317l30984
3393.8B64555693l10362k59250k05517j83105k02984k21670j27822K4676P7099N4598
3414.2B63201356J4037K1338J22965K08556K62320L53068M37201M29183M54038N72026
$$ y = [316922367, 315730721, 314581603, 313442230, 312300980, 311151296, 310047984, 309003204, 307946086, 306843430, 305726588, 304651916, 303618729, 302542895, 301404178, 300263822, 299098849, 297875017, 296618015, 295317650, 293994099, 292693317, 291398257, 290076822, 288737535, 287388206, 286053181, 284799129, 283636898, 282521784, 281417638, 280291766, 279189020, 278201818, 277276516, 276313484, 275345683, 274428815, 273553044, 272706240, 271880209, 271104127, 270412594, 269746512, 269069284, 268430352, 267857492, 267288029, 266704351, 266164809, 265680254, 265251994, 264886677, 264555693, 264245331, 263986081, 263780564, 263597459, 263394475, 263172805, 263044983, 263069659, 263146758, 263201356, 263215393, 263236731, 263359696, 263568252, 263830572, 264183640, 264620841, 265050024, 265504062, 266076088]
3434.6B66076088N99384N48184N73337O40393P06911Q16881Q78275Q96930R44585R97603
3455B73678571J049429J097769J109272J095533J134247J222432J259177J245350J277656
3473.4B84169436J347661J427114J495242J548588J564920J584887J632482J651317
3489.7B96421647J675636J702398J734554J754880J768262J818776J880914J909792
3506C10666859J968205K028495K027244K030223K043337K081901K106875K117425K156287
3524.4C29226851K260089K420038K487332K391249K349883K463758K535850K526045
3540.7C48661095K529532K676278K837598K791405K778113K924234K929568K883047
3557C71010870K972245K942085K757490K925664L658831L869385L382683L247737L451020
$$ y = [266076088, 266675472, 267223656, 267796993, 268437386, 269144297, 269961178, 270839453, 271736383, 272680968, 273678571, 274728000, 275825769, 276935041, 278030574, 279164821, 280387253, 281646430, 282891780, 284169436, 285517097, 286944211, 288439453, 289988041, 291552961, 293137848, 294770330, 296421647, 298097283, 299799681, 301534235, 303289115, 305057377, 306876153, 308757067, 310666859, 312635064, 314663559, 316690803, 318721026, 320764363, 322846264, 324953139, 327070564, 329226851, 331486940, 333906978, 336394310, 338785559, 341135442, 343599200, 346135050, 348661095, 351190627, 353866905, 356704503, 359495908, 362274021, 365198255, 368127823, 371010870, 373983115, 376925200, 379682690, 382608354, 386267185, 390136570, 393519253, 396766990, 400218010]
3575.3D00218010L531307L483891L342867L142953L402412M155249M133433L454625
3591.7D28864747L479302L847569L840894L831297L870219L597528L495991L926337
3608D58753884L986358L564388L272712L002972L257811L904432L811031L395707L577918
3626.3D90527213M953056N530268M270613L815115L858685L733397L609478L229857
3642.6E23527682K698600K921641M238605M455746L033161K690971L359437L196001
3659E50121844K698362K508938K077639J817644K410769K499044J850426K568841K788782
3677.3E71342289J661540J188039Q63195M76837P04229J125634O54637M7386M9353
3695.7E78113139L69787R78470J818955J985728J526773J518548K175569K670050J892388
$$ y = [400218010, 403749317, 407233208, 410576075, 413719028, 417121440, 421276689, 425410122, 428864747, 432344049, 436191618, 440032512, 443863809, 447734028, 451331556, 454827547, 458753884, 462740242, 466304630, 469577342, 472580314, 475838125, 479742557, 483553588, 486949295, 490527213, 495480269, 501010537, 505281150, 509096265, 512954950, 516688347, 520297825, 523527682, 526226282, 529147923, 533386528, 537842274, 540875435, 543566406, 546925843, 550121844, 552820206, 555329144, 557406783, 559224427, 561635196, 564134240, 565984666, 568553507, 571342289, 573003829, 574191868, 575055063, 575531900, 576236129, 577361763, 578016400, 578063786, 578113139, 578482926, 579461396, 581280351, 583266079, 584792852, 586311400, 588486969, 591157019, 593049407]
3714E93049407Q84593O08921O96837P89047P81238O77585L61622J35183L41594Q83222
3734.4E99209249J213610M85122n10156k15411J005709O88970J65046J017868R41336
3752.8F04001343j2517m7743M63784M74274R8705M7267J46567L89576M97342O5207
3773.2F06123805j82152J36912N05865L06725j5378O1751J43587J34826N4657j18255
3793.6F07152343j37985k14279p867N83887K74300N9962M20213j9789n59866k97189
3814F07253730K17140r179J15096O52135J27971j47402k1160j46568j93059j89781
3834.4F07658923Q3804M97818L34978Q7738K6643k99871p96973p74861O15299J483261
3854.8F08916759N7996o96182m38691L3498J44661k11418n5015L68714K04921m3452
$$ y = [593049407, 593934000, 594542921, 595239758, 596028805, 596810043, 597487628, 597849250, 597984433, 598326027, 599209249, 600422859, 600907981, 600397825, 600182414, 601188123, 601877093, 602042139, 603060007, 604001343, 603988826, 603941083, 604404867, 604879141, 604977846, 605025113, 605171680, 605561256, 606058598, 606123805, 605941653, 606078565, 606584430, 606891155, 606875777, 606937528, 607081115, 607215941, 607270598, 607152343, 607014358, 606800079, 606792212, 607376099, 607650399, 607710361, 608130574, 608110785, 607550919, 607253730, 607470870, 607461691, 607576787, 608228922, 608356893, 608209491, 608188331, 608041763, 607848704, 607658923, 607742727, 608240545, 608575523, 608663261, 608689904, 608390033, 607593060, 606818199, 607433498, 608916759, 608974755, 608278573, 607839882, 607873380, 608018041, 607806623, 607751608, 608120322, 608325243, 608281791]
3875.2F08281791l31640k80261L5345N007J71423L3736l19957M9293J64151l64900
3895.5F07443988m74155j34945J17481L68238L86536J5080j76192k16901k96712j70350
3915.9F06862068N5194l3379k23636r8050k682j75893j25766J09613N3465j04606j49965
3938.4F06166363j86920j51873j43707j37091L6180J01269j2040o6996n9187p1049
3958.8F05474949r5606n3287n602n8830j14858q4758k5392j3292j728K3246j8478l0994
3983.2F04995370j6153p5698p0929J8715O4195J1921r2745
3997.5F04834676
$$ y = [608281791, 607950151, 607669890, 607705235, 607710242, 607881665, 607915401, 607595444, 607644737, 607808888, 607443988, 606969833, 606834888, 606952369, 607320607, 607707143, 607722223, 607546031, 607329130, 607032418, 606862068, 606917262, 606883883, 606660247, 606562197, 606559515, 606383622, 606257856, 606367469, 606420934, 606316328, 606166363, 605979443, 605827570, 605683863, 605546772, 605582952, 605684221, 605672181, 605605185, 605545998, 605474949, 605379343, 605326056, 605320454, 605261624, 605146766, 605062008, 605036616, 605023324, 605021596, 605044842, 605026364, 604995370, 604979217, 604903519, 604832590, 604851305, 604915500, 604927421, 604834676]
##END=$$ End of the data block
