##TITLE=$$ Begin of the data block
##JCAMP-DX=5.00 $$ ACD/SpecManager v 10.08
##SPECTROMETER/DATA SYSTEM=Alpha
##DATE=11 Jun 2014 07:55:32
##DATA TYPE=INFRARED SPECTRUM
##DATA CLASS=XYDATA
##ORIGIN=
##OWNER=
##NPOINTS=1765
##FIRSTX=399.75695801
##LASTX=3997.56933594
##MAXX=3997.56933594
##MINX=399.75695801
##MAXY=0.62206787
##MINY=0.00865144
##XFACTOR=1.0000000000
##YFACTOR=1.000000000000000e-9
##FIRSTY=0.14972562
##DELTAX=2.03957629
##XUNITS=1/CM
##YUNITS=ARBITRARY UNITS
##XYDATA=(X++(Y..Y))
399.8 149725616 157377303 165039107 173122704 181009710 188694745 196784258 204866320 212155700
416.1 212155700 219962403 228710502 236133322 242729142 249675736 256835341 263451457 269222230
432.4 269222230 275129646 281586230 287656069 293112516 298896730 304614723 309016913 312727660
448.7 312727660 316761106 320594251 323584288 326669574 330197096 332669288 333977968 335576057
465 335576057 338062286 340692848 343488872 347570628 352588058 357144862 361150205 365604997 370673567
483.4 370673567 375199139 378921747 382765055 386518240 389276862 391611934 394406021 397087842
499.7 397087842 399007022 400827199 403139293 405053377 405887365 406674653 408105910 409266025 409616172
518.1 409616172 410023302 411006868 411801666 412019938 412532091 413592994 414407194 414986074 416343838
536.4 416343838 418545812 420418054 421760708 423542917 425683767 427063227 427775443 428960413 430423170
554.8 430423170 431040764 431239635 432295769 433940589 435057133 435783356 437037170 438525200 439291060
573.1 439291060 439701527 440627247 441660762 442238688 443007141 444434136 445812285 446616650 447465390
591.5 447465390 448716462 449557424 449574083 449415684 449418753 448904216 447503269 446079046 445479423 445434928
611.9 445434928 445473313 445874870 446859688 447967649 448997140 450249732 451613426 452585548 453227162
630.2 453227162 454284519 455986917 457698792 459159791 460670203 462114006 463052422 463472307 463672698
648.6 463672698 463737875 463482291 462802917 462015122 461430579 460815072 459918678 458884507 457768202 456993222
669 456993222 456853747 456898212 457017392 456822127 456044286 455109149 454177290 452773690 450566977 447754323
689.4 447754323 444424212 439934462 433795929 426440775 418471605 409580767 398763269 386002690
705.7 386002690 372594029 360116184 350141495 343192160 338125765 334441185 334342808 340626031
722 340626031 353779674 372191161 393720388 416390449 438080549 456660837 471280009 482561737
738.3 482561737 491156131 497031361 500727057 503553927 505847216 507098615 507671058 508486032 509441614
756.7 509441614 509760201 509624422 509805977 510090649 509841204 509386659 509427011 509608746 509181440 508536220
777.1 508536220 508487403 508789599 508765340 508534789 508419573 508068979 507064044 505808711 504878223 504120648
797.5 504120648 503288865 502772927 502850771 502848148 502201796 501203656 500090301 498605758 496607810 494396001
817.9 494396001 492170215 489652485 486566365 483121246 479464054 475254774 470256925 464595228
834.2 464595228 458241016 450850546 442040056 431188077 416661590 399016559 385209113 379834473
850.5 379834473 376327515 366570801 349682271 327739835 301269412 269135237 229273975 180422962
866.8 180422962 128182426 87122068 66802450 62633254 68036027 83276764 110739693 150956646
883.1 150956646 202982023 262806445 321641296 370710135 407288432 433711469 452928513
897.4 452928513 467126489 478022814 486502200 492779791 497326523 500994384 504218578 506881893
913.7 506881893 509045839 511015415 512583852 513324797 513434350 513394117 513164997 512496531 511654139
932.1 511654139 511017025 510435820 509594679 508623421 507770479 506820738 505427659 503674209 501756549
950.4 501756549 499494612 496638209 493395180 490053236 486386776 482172072 477665335 473021656
966.8 473021656 467929691 462213844 456100613 449620992 442431211 434434026 425986320 417369515
983.1 417369515 408630639 399914443 391474515 383433342 375759125 368424207 361502677 354941130
999.4 354941130 348474622 341980398 335530758 329146326 322830558 316703439 310943514 305664688
1015.7 305664688 300939083 296903580 293646276 291059822 288963735 287359953 286374748 286023945 286192864
1034.1 286192864 286644191 287065476 287181079 286851376 286135048 285264730 284445465 283872485 283892453 284733921
1054.5 284733921 286337882 288508117 290956676 293244213 294884473 295500159 294842184 292818755 289655477
1072.8 289655477 285887361 282066047 278549880 275669396 274012089 273969710 275468856 278411269 282497585
1091.2 282497585 286887974 290583372 292985976 294142991 294599742 294959754 295593321 296650261 298120201
1109.5 298120201 299856186 301649511 303253531 304421276 305104226 305471778 305700362 305776447 305574059
1127.9 305574059 305110842 304443955 303436011 301928222 299980015 297830939 295720130 293796718 292210162
1146.2 292210162 291086107 290356189 289840341 289508641 289453834 289763778 290504217 291715413 293404639
1164.6 293404639 295352489 297133237 298546672 299730182 300824732 301822394 302689135 303347796 303589404
1182.9 303589404 303210616 302243710 300861478 299094737 296914905 294498324 292096168 289747775 287434131
1201.3 287434131 285243481 283186615 281109095 278853178 276400506 273790956 270970851 267902702
1217.6 267902702 264700323 261462271 258156568 254762024 251398057 248139843 244909480 241681278
1233.9 241681278 238545612 235535502 232533127 229459733 226380616 223367617 220379874 217352912
1250.3 217352912 214282349 211193472 208091944 204958975 201815888 198689565 195557907 192389578
1266.6 192389578 189200044 185986355 182711393 179348722 175937533 172537908 169133440 165686816
1282.9 165686816 162194863 158671707 155100286 151485518 147838652 144166201 140472353 136771515
1299.2 136771515 133086219 129424796 125797719 122182652 118619449 115152761 111756235 108414695
1315.5 108414695 105103105 101798125 98542497 95321380 92063867 88764533 85478440 82305536
1331.8 82305536 79293154 76321147 73172301 69918305 66854790 63971512 61114326 58273327
1348.1 58273327 55468477 52717358 50036673 47443047 44968329 42537782 40084030 37763685
1364.5 37763685 35655163 33610150 31646352 29764811 27899973 26168633 24586974 23084383
1380.8 23084383 21670857 20352682 19051690 17807180 16718499 15661953 14566557 13579826 12689297
1399.1 12689297 11876700 11178726 10542924 9995745 9545364 9190512 8941044 8770174 8651437 8654051
1419.5 8654051 8791552 8994075 9248624 9518328 9810850 10119165 10398476 10707201 11084379 11378097
1439.9 11378097 11613568 11841835 12048468 12260756 12445550 12579232 12673921 12801496 13052425 13326876
1460.3 13326876 13542190 13796244 14136521 14460583 14748100 15120087 15645429 16205059 16772795 17383650
1480.7 17383650 18049175 18723305 19457366 20349942 21400088 22447148 23518546 24828922 26270378
1499.1 26270378 27616035 28766623 30001171 31830419 33733074 35377003 36973476 38592294
1515.4 38592294 40250883 41939255 43903597 45952126 47816850 49770247 51639866 53502135
1531.7 53502135 55641375 57578150 59277598 61640210 64479649 67059651 69644272 72246321
1548 72246321 75049698 78041181 81126325 84224872 88533916 94265528 98473333 102193743 106226191
1566.4 106226191 110527731 115155235 119085647 122663945 126972213 130949453 134247735 137536228
1582.7 137536228 140822366 143974513 146969989 149843231 152594000 155216798 157707304 160081223
1599 160081223 162363917 164590076 166688472 168647096 170542657 172293425 173757523 175166890 176824361
1617.4 176824361 178258970 179398283 180606216 181835786 183000833 184148148 185135901 186090142 187469319
1635.7 187469319 189080104 190508321 191905364 193355620 195130140 197192430 198817953 200747952
1652 200747952 203919455 206597358 208759278 211147666 214003414 217075452 219833910 222802147 226326078
1670.4 226326078 229572967 232934311 236714840 240071580 242999271 246277511 250854015 255218148
1686.7 255218148 258771420 262421191 265890419 269643068 273807675 278011441 282937735 287130594
1703 287130594 290694267 294599533 298245221 301446974 304360092 307298362 310907394 314608276 317553997
1721.4 317553997 320308924 323181748 325886279 328393847 330775142 333758503 337051541 339578420
1737.7 339578420 342108160 344909579 347549915 350011170 352443069 355222642 358232588 360785156
1754 360785156 363120586 365533024 367831200 370223135 372473657 374364346 376147270 377827078 379549205
1772.4 379549205 381133407 382085204 382375807 382090777 381256759 379779249 377681941 375187159 372344494
1790.7 372344494 369473130 367154121 365376353 364143521 363793820 364446670 365915745 368103445 371080816
1809.1 371080816 374917567 379315734 383961141 388844460 393778354 398415059 402853310 407278478
1825.4 407278478 411263406 415030897 418816835 422094584 424933583 427643329 430116624 432256490
1841.7 432256490 434564799 437169522 439523637 441634625 443617135 445476949 447336555 449236602
1858 449236602 451085925 452797055 454370052 455867469 457523793 459409148 461188793 462825537 464396119
1876.4 464396119 465878874 467350096 468874097 470371872 471754879 473164618 474675924 476082146
1892.7 476082146 477396101 478819728 480286449 481641382 482888669 484165877 485479504 486743003
1909 486743003 487980068 489182472 490317374 491465628 492688030 493896276 495168000 496424794 497500032
1927.4 497500032 498567730 499720722 500821352 501825631 502847254 503848493 504819095 505865395
1943.7 505865395 506968439 508059382 509070575 509971797 510850668 511751652 512584269 513372838 514194965
1962.1 514194965 515026629 515861928 516789973 517822027 518878400 519881546 520794690 521698713 522646904
1980.4 522646904 523557782 524369121 525195241 526048958 526846349 527637839 528463423 529305935 530120075 530860424
2000.8 530860424 531584024 532363772 533122182 533816218 534515858 535246313 535952687 536642373 537370861 538114727
2021.2 538114727 538822293 539470792 540121138 540808439 541489780 542129695 542775035 543459773 544111192 544707298
2041.6 544707298 545329630 546030998 546734631 547370553 547994375 548665702 549322009 549912691 550499141 551126122
2062 551126122 551758170 552357912 552954733 553579748 554202616 554772437 555352151 556015968 556669652 557214737
2082.4 557214737 557724953 558289468 558848739 559344471 559837043 560398102 560961008 561446011 561900973 562388122
2102.8 562388122 562872946 563293219 563694358 564128637 564558923 564926207 565280259 565696239 566082120 566377819
2123.2 566377819 566707850 567135036 567542911 567855477 568157732 568550050 568967879 569317460 569674432 570104063
2143.6 570104063 570518792 570869684 571242809 571723819 572266519 572748959 573215067 573780000 574381590 574919939
2164 574919939 575447261 576066792 576729178 577313781 577850282 578450501 579089463 579682827 580272555 580935657
2184.4 580935657 581586599 582128525 582665503 583296537 583931744 584457636 584940672 585479498 586019814 586464763
2204.8 586464763 586871088 587367475 587914288 588381112 588791788 589272857 589786410 590230644 590659738 591159165
2225.2 591159165 591676235 592114329 592502713 592931509 593398809 593840897 594262540 594719708 595209479 595647633
2245.6 595647633 596054971 596517920 597005308 597435832 597799063 598217666 598721206 599173605 599559784 600008845
2265.9 600008845 600520730 600968063 601364672 601842642 602359831 602749348 603067756 603481948 603930712 604226410
2286.3 604226410 604412854 604668856 604965866 605170369 605293930 605466723 605673194 605741382 605669856 605629385
2306.7 605629385 605647802 605645061 605644464 605672717 605592549 605319798 605051577 605028033 605132937 605093181 605060816
2329.2 605060816 605290473 605600476 605765879 605875313 606080592 606436193 607124805 608319521 609259069
2347.5 609259069 609099329 608133435 607182741 606648862 606455445 606496274 606857240 607693255 608827651 610004663
2367.9 610004663 611320317 612794101 614173114 615367472 616490424 617583036 618534684 619235694 619713604
2386.3 619713604 620087624 620382607 620572627 620727777 620941520 621167004 621283591 621340632 621471643 621652246
2406.7 621652246 621781349 621870875 621979177 622067869 622053623 621989846 621978700 621958077 621865153 621773481 621711552
2429.1 621711552 621582747 621355414 621117353 620894253 620614827 620248437 619840562 619408607 618889689 618238509
2449.5 618238509 617503822 616716683 615813375 614748180 613562822 612258315 610763788 609060585 607181489
2467.9 607181489 605144143 602892220 600385129 597689331 594811082 591647625 588215053 584642410
2484.2 584642410 580977857 577223003 573441505 569759369 566266060 562984288 559928298 557121992
2500.5 557121992 554530919 552065134 549683809 547385573 545178950 543060422 541040599 539205313
2516.8 539205313 537627876 536342084 535445154 535010278 535016835 535465121 536354363 537660837 539371312
2535.2 539371312 541423500 543738484 546272576 548958540 551734269 554565310 557371914 560065031
2551.5 560065031 562606514 564951658 567065537 568977833 570682585 572186351 573559880 574774861
2567.8 574774861 575782299 576645315 577429473 578131139 578735530 579272389 579750776 580144227 580489337
2586.2 580489337 580824137 581116557 581363499 581624687 581922531 582232654 582564652 582931817 583344042 583823085
2606.6 583823085 584374845 585038424 585833132 586670697 587541759 588538647 589629650 590761423 591937065
2624.9 591937065 593137026 594364822 595605075 596814692 597993195 599159420 600319207 601450503
2641.2 601450503 602517903 603505731 604410589 605225205 605919778 606499076 607004821 607405961 607687294
2659.6 607687294 607893825 608017623 608057499 608069301 608053982 607967973 607825875 607666433 607503355 607350349
2680 607350349 607198894 607006848 606766403 606503844 606239378 605983734 605730414 605474472 605216086 604932487
2700.4 604932487 604602337 604240656 603859663 603494763 603168607 602811873 602405190 602016687 601630926 601173520
2720.8 601173520 600665689 600215971 599875569 599530101 599079728 598594487 598136544 597689688 597263932 596867740
2741.2 596867740 596454322 595978975 595469654 594999909 594563246 594101012 593599141 593061030 592497051 591935277
2761.6 591935277 591391861 590826273 590202093 589532077 588830352 588119686 587450325 586815655 586132050 585354149
2782 585354149 584516048 583628595 582684696 581768036 580880821 579905212 578850567 577800155 576767862
2800.3 576767862 575715780 574587107 573349953 572035134 570693851 569352031 567986667 566542983
2816.6 566542983 564998746 563374341 561715603 560037136 558284402 556425452 554454923 552338719
2832.9 552338719 550063789 547607780 544967175 542130828 538900793 535071850 530910552 527205169
2849.3 527205169 524512470 522675276 521257401 519944787 518601358 517153740 515474081 513541877
2865.6 513541877 511477292 509329915 507178366 505269945 503717422 502354324 501042306 499794304
2881.9 499794304 498616725 497473150 496340275 495217562 494137555 493126601 492190242 491356343 490594804
2900.2 490594804 489801109 488919616 487906158 486608148 484875888 482740790 480452299 478384644 476830810
2918.6 476830810 475899160 475496203 475424290 475529313 475792289 476295084 476976871 477686465 478434324 479273230
2939 479273230 480088979 480778754 481424809 482068151 482524246 482659757 482638627 482614428 482595056 482631832 482803494
2961.4 482803494 483161271 483711720 484413087 485219568 486085415 486967921 487811774 488518447 489113718 489713103
2981.8 489713103 490265161 490676671 491005540 491270095 491446912 491643369 491881341 492119581 492391825 492669612
3002.2 492669612 492951542 493261009 493508846 493625551 493705630 493889064 494154543 494357079 494410008 494273752
3022.6 494273752 493974894 493581504 493080705 492492378 491901785 491349548 490753651 489965677 488998860 488035589
3043 488035589 487172455 486309856 485336661 484308988 483317941 482330769 481335789 480355799 479325294 478188872
3063.4 478188872 477028638 476007521 475134641 474227130 473164648 472006142 470861673 469783932 468756020
3081.8 468756020 467741758 466742098 465741128 464716315 463691324 462671816 461602539 460442513
3098.1 460442513 459258914 458135754 457013786 455799878 454570472 453422397 452210605 450796515
3114.4 450796515 449348360 448054522 446876138 445671469 444375247 443024725 441618919 440168142
3130.7 440168142 438744307 437338740 435833275 434217095 432660401 431199789 429699332 428127021
3147 428127021 426516205 424856514 423187882 421557099 419949174 418337077 416676342 414937764 413175166
3165.4 413175166 411446333 409709215 407937795 406170785 404408991 402651995 400901347 399108768
3181.7 399108768 397263825 395457327 393733948 392011732 390261412 388525367 386801958 385069072
3198 385069072 383302152 381518573 379776657 378054976 376313806 374596506 372917384 371259004 369609177
3216.4 369609177 367935628 366249382 364589483 362973213 361366898 359738171 358089149 356450409
3232.7 356450409 354863912 353295982 351707637 350121766 348541826 346942276 345355898 343816817
3249 343816817 342270166 340656638 339005083 337386280 335772961 334126443 332538158 331040978 329524964
3267.4 329524964 327940375 326375157 324918061 323545516 322219193 320929945 319640130 318333447
3283.7 318333447 317045510 315805554 314585119 313369036 312175721 311018258 309909493 308813930
3300 308813930 307677060 306515604 305353940 304190248 303069741 301963419 300765693 299495906 298229516
3318.4 298229516 296971440 295660198 294270754 292895436 291540444 290113837 288645118 287217319
3334.7 287217319 285822749 284417957 283055514 281786650 280549437 279323101 278130114 276977301
3351 276977301 275883436 274833322 273802549 272780538 271754533 270726234 269744575 268826216 267928034
3369.3 267928034 267049104 266200006 265379995 264635861 263993204 263365924 262711078 262104124 261594951 261137754
3389.7 261137754 260677844 260225207 259795457 259398669 259089261 258863956 258638233 258418709 258253545 258144230
3410.1 258144230 258069873 258035153 258065909 258163422 258292079 258419991 258611858 258907080 259251684 259615511
3430.5 259615511 260061234 260599136 261157721 261745155 262376040 262995273 263666302 264498770 265388042 266285598
3450.9 266285598 267260104 268299729 269369215 270460457 271588296 272771418 274008691 275282383
3467.2 275282383 276572257 277877331 279241741 280647755 282063782 283525586 285073966 286655009
3483.6 286655009 288229227 289882869 291640341 293425530 295178860 296919584 298683643 300511807
3499.9 300511807 302418560 304343134 306250632 308229148 310293585 312374830 314482898 316608936
3516.2 316608936 318752319 320920587 323104501 325293303 327563286 330015153 332570016 335072994
3532.5 335072994 337583333 340198308 342784882 345290005 347845703 350603700 353535384 356441975
3548.8 356441975 359317809 362304062 365302384 368250519 371281207 374330997 377249211 380348951
3565.1 380348951 384144634 388075888 391505688 394821048 398365945 402041644 405700833 409237325
3581.5 409237325 412582070 416131735 420384973 424668521 428320915 431944460 435840398 439746737
3597.8 439746737 443741351 447803527 451574147 455236375 459337264 463508844 467267454 470717847
3614.1 470717847 473865330 477288336 481381446 485318989 488792717 492533177 497717381 503338814
3630.4 503338814 507626772 511502862 515450299 519303083 523026884 526319802 529095054 532167375
3646.7 532167375 536546946 541049778 544097841 546829402 550221622 553408623 556133628 558734298
3663 558734298 560900450 562762380 565183461 567699134 569589496 572168589 574912429 576551735 577762544
3681.4 577762544 578642547 579131424 579915881 581139803 581792116 581832588 581931591 582368255 583393991 585188627
3701.8 585188627 587108314 588627696 590202332 592402697 595033050 596909583 597827554 598501921 599274814
3720.1 599274814 600100279 600876689 601558805 601927280 602051735 602430522 603396118 604600430 605034411
3738.5 605034411 604560435 604421556 605400026 605983794 606122673 607193112 608165026 608135641 608078361 608538151
3758.9 608538151 608947217 608948827 608968437 609170616 609614015 610122502 610225499 610115647 610268295 610683680
3779.3 610683680 610860169 610828578 611005843 611226201 611336768 611340225 611175239 611015499 610844195 610928595
3799.7 610928595 611547649 611752212 611752987 612171650 612146080 611556888 611240089 611492932 611556411 611656904
3820.1 611656904 612223983 612372220 612286627 612259686 612078547 611860096 611668527 611748993 612231553 612545013
3840.5 612545013 612603486 612626731 612314761 611495674 610778689 611556172 613077939 612984240 612190545 611757219
3860.9 611757219 611838460 612080991 611944616 611864209 612138331 612264097 612229824 611978114 611776173 611789286
3881.3 611789286 611659884 611746609 611836970 611607075 611668646 611798108 611435175 610953748 610775232 610890388
3901.7 610890388 611253798 611588001 611587703 611460686 611311913 611025393 610801399 610820413 610806108 610619366
3922.1 610619366 610530674 610546172 610426128 610334039 610423863 610422313 610249281 610037148 609837830 609752059 609715164
3944.5 609715164 609633267 609616995 609656811 609649241 609600663 609557211 609490752 609398425 609378040 609405577 609384894 609316528
3969 609316528 609211326 609132349 609115064 609101236 609103501 609114170 609095156 609064043 609021187 608973205 608946204 608951151
3993.4 608951151 608959734 608946204
3997.5 608946204
##END=$$ End of the data block
