##TITLE=$$ Begin of the data block
##JCAMP-DX=5.00 $$ ACD/SpecManager v 10.08
##SPECTROMETER/DATA SYSTEM=Alpha
##DATE=11 Jun 2014 07:55:32
##DATA TYPE=INFRARED SPECTRUM
##DATA CLASS=XYDATA
##ORIGIN=
##OWNER=
##NPOINTS=1765
##FIRSTX=399.75695801
##LASTX=3997.56933594
##MAXX=3997.56933594
##MINX=399.75695801
##MAXY=0.62436759
##MINY=0.00863359
##XFACTOR=1.0000000000
##YFACTOR=1.000000000000000e-9
##FIRSTY=0.14735264
##DELTAX=2.03957629
##XUNITS=1/CM
##YUNITS=ARBITRARY UNITS
##XYDATA=(X++(Y..Y))
399.8A47352636Q065671P273942P671773Q058429Q147553Q395880Q199513P155269
$$ 147352636 155418307 162692249 170364022 178422451 186570004 194965884 203165397 210320666
416.1B10320666P326544Q281454P259831O532714O828457O787747O391108O033510
$$ 210320666 217647210 225928664 233188495 239721209 246549666 253337413 259728521 265762031
432.4B65762031O105691O451458O104231N524665N584270N362153M507363L981232
$$ 265762031 271867722 278319180 284423411 289948076 295532346 300894499 305401862 309383094
448.7C09383094M074693L786296K731204K701670L559112K833009J514614J663178
$$ 309383094 313457787 317244083 319975287 322676957 326236069 329069078 330583692 332246870
465C32246870K587586K742738K749264L806830M712045M461884M141003M589647N044908
$$ 332246870 334834456 337577194 340326458 344133288 348845333 353307217 357448220 362037867 367082775
483.4C67082775M269123L349364L800958M093200L012448K314538K751678K829612
$$ 367082775 371351898 374701262 378502220 382595420 385607868 387922406 390674084 393503696
499.7C93503696K037853J610458K006501J861631R81123Q75205J410990J108021L18676
$$ 393503696 395541549 397152007 399158508 401020139 402001262 402876467 404287457 405395478 405714154
518.1D05714154N48959J172543P60406O7979N39064J265437R04053M78775J188159
$$ 405714154 406263113 407435656 408196062 408264041 408803105 410068542 410972595 411451370 412639529
536.4D12639529J979738J718849J408487J925350K177387J446963Q92907J177311J203000
$$ 412639529 414619267 416338116 417746603 419671953 421849340 423296303 424189210 425366521 426569521
554.8D26569521M57913J89811J061618J731813J251579Q28713J336157J447201O20395
$$ 426569521 427027434 427217245 428278863 430010676 431262255 432090968 433427125 434874326 435494721
573.1D35494721L44604R92984J204550P28935Q87424J656204J577586P35045O60449
$$ 435494721 435839325 436832309 438036859 438765794 439653218 441309422 442887008 443622053 444282502
591.5D44282502J217753R08315J41233K2829O6429n31524j334727j272142m53294J1355
$$ 444282502 445500255 446408570 446549803 446572632 446639061 446107537 444772810 443500668 443047374 443058729
611.9D43058729M6343M84884J206964J320988J056283J243532J464606J043885O81490
$$ 443058729 443105072 443589956 444796920 446117908 447174191 448417723 449882329 450926214 451607704
630.2D51607704J158774J819015J792609J478076J526177J505256J015067N13911L63767
$$ 451607704 452766478 454585493 456378102 457856178 459382355 460887611 461902678 462416589 462780356
648.6D62780356K94149j14053n79506o49602n41329o06179q11875r83655j139492o89924
$$ 462780356 463074505 462960452 462380946 461731344 461190015 460583836 459771961 458788306 457648814 456958890
669D56958890L159R1374J28448j27345o56456q87782r36776j377404k134472k689898
$$ 456958890 456962049 457053423 457181871 457054526 456398070 455510288 454573512 453196108 451061636 448371738
689.4D48371738l268271m491330o134659p373690p956982q853495j0817945j2763620
$$ 448371738 445103467 440612137 434477478 427103788 419146806 410293311 399475366 386711746
705.7C86711746j3446718j2590140j0078818o974339n018830l571868K3901O290793
$$ 386711746 373265028 360674888 350596070 343621731 338602901 335031033 335054934 341345727
722C41345727J3138235J8504083K1625430K2725731K1751284J8632293J4646292J1281848
$$ 341345727 354483962 372988045 394613475 417339206 439090490 457722783 472369075 483650923
738.3D83650923Q563667N886585L801524K941907K379537J281440N36680P50005Q30174
$$ 483650923 492214590 498101175 501902699 504844606 507224143 508505583 509042263 509792268 510622442
756.7E10622442K27451r8050K33055L22878j68681m23014k1339J05858m85659o82532
$$ 510622442 510849893 510751843 510984898 511307776 511139095 510716081 510694742 510800600 510314941 509632409
777.1E09632409p4387L34799O2108j99914j29401m00484j087963j303733r59396p75039
$$ 509632409 509558022 509892821 509954929 509755015 509625614 509225130 508137167 506833434 505874038 505098999
797.5E05098999p78139m60744R537q1778o63698j020610j114786j489341k036094k270759
$$ 505098999 504320860 503860116 503869653 503787875 503124177 502103567 500988781 499499440 497463346 495192587
817.9D95192587k310276k570092l064841l444106l745913m323900n125791n812496
$$ 495192587 492882311 490312219 487247378 483803272 480057359 475733459 470607668 464795172
834.2D64795172o439745p381022q842886j1024981j4735222j7746210j3819874n427956
$$ 464795172 458355427 450974405 442131519 431106538 416371316 398625106 384805232 379377276
850.5C79377276l623903r869903j7005176k2035002k6502192l2199353l9932624m8778832
$$ 379377276 375753373 365883470 348878294 326843292 300341100 268141747 228209123 179430291
866.8A79430291n1994204m0723831k0036355l973871N534291J5269198K7480334M0344782
$$ 179430291 127436087 86712256 66675901 62702030 68236321 83505519 110985853 151330635
883.1A51330635N2149117N9866980N8904975M9146206L6577254K6374459J9163251
$$ 151330635 203479752 263346732 322251707 371397913 407975167 434349626 453512877
897.4D53512877J4160872J0868281Q429617O249964M579514L686249L148198K538681
$$ 453512877 467673749 478542030 486971647 493221611 497801125 501487374 504635572 507174253
913.7E07174253K109945J972676J547932O98865L2782j44064k80142o73354q51571
$$ 507174253 509284198 511256874 512804806 513503671 513536453 513392389 513112247 512438893 511587322
932.1E11587322o17087n36323q31008j015067r28044j022160j461625j822651j961410
$$ 511587322 510970235 510433912 509602904 508587837 507659793 506637633 505176008 503353357 501391947
950.4E01391947k302497k943308l342539l402412l708511m283249m580021m659743
$$ 501391947 499089450 496146142 492803603 489401191 485692680 481409431 476829410 472169667
966.8D72169667n073905n736529o181836o543279p201970p994950q473456q602172
$$ 472169667 467095762 461359233 455177397 448634118 441432148 433437198 424963742 416361570
983.1D16361570q692592q733213q449703p966876p584960p259965o814420o438166
$$ 416361570 407668978 398935765 390486062 382519186 374934226 367674261 360859841 354421675
999.4C54421675o370604o446034o457001o368875o216615n960078n553573n114883
$$ 354421675 348051071 341605037 335148036 328779161 322562546 316602468 311048895 305934012
1015.7C05934012m659861m013271l244727k628059k162367j633495j006126m09067
$$ 305934012 301274151 297260880 294016153 291388094 289225727 287592232 286586106 286177039
1032B86177039N8293L28899L23623k294m39644p26432q25077p82162n50866J549Q03233
$$ 286177039 286235332 286564231 286887854 286885560 286445916 285719484 284894407 284112245 283561379 283562928 284366161
1054.5B84366161J572728K120346K371698K218873J618981O42061o18279k000630l171831
$$ 284366161 285938889 288059235 290430933 292649806 294268787 294910848 294292569 292291939 289120108
1072.8B89120108l796160l827006l481954k872974j737207j59770J395046K844006
$$ 289120108 285323948 281496942 278014988 275142014 273404807 273245037 274640083 277484089
1089.1B77484089M032195M428714L783494K510280J289010N69910M15444O40780J067996
$$ 277484089 281516284 285944998 289728492 292238772 293527782 294097692 294513136 295153916 296221912
1107.5B96221912J518339J779258J783013J578242J158446O42151K95400J53929Q583
$$ 296221912 297740251 299519509 301302522 302880764 304039210 304681361 304976761 305130690 305139273
1125.8C05139273k33888m61042o68109j029372j513392j900047k066880k033532j856327
$$ 305139273 304905385 304444343 303776234 302746862 301233470 299333423 297266543 295233011 293376684
1144.2B93376684j497447j024187o76960n26428l80486r2149K82258O69211J128495
$$ 293376684 291879237 290855050 290178090 289651662 289271176 289179027 289461285 290130496 291258991
1162.6B91258991J640290J885950J687259J349002J172751J079708R50128Q43168O87778
$$ 291258991 292899281 294785231 296472490 297821492 298994243 300073951 301024079 301867247 302555025
1180.9C02555025K62856m02748r94474j393229j765132k149969k379209k399534k357692
$$ 302555025 302817881 302415133 301420659 300027430 298262298 296112329 293733120 291333586 288975894
1199.3B88975894k302944k171993k027929k052069k242357k437889k626449k861768
$$ 288975894 286672950 284500957 282473028 280420959 278178602 275740713 273114264 270252496
1215.6B70252496l073245l169567l211051l288209l372670l341406l222242l175259
$$ 270252496 267179251 264009684 260798633 257510424 254137754 250796348 247574106 244398847
1231.9B44398847l185391l119722l009677l015071l089503l074869k981589k974331
$$ 244398847 241213456 238093734 235084057 232068986 228979483 225904614 222923025 219948694
1248.2B19948694l055662l070250l043234l080443l134191l140032l131628l146708
$$ 219948694 216893032 213822782 210779548 207699105 204564914 201424882 198293254 195146546
1264.5A95146546l193751l211186l214389l268242l351986l391147l385663l400668
$$ 195146546 191952795 188741609 185527220 182258978 178906992 175515845 172130182 168729514
1280.8A68729514l434867l477052l531813l597051l633544l649607l665909l691569
$$ 168729514 165294647 161817595 158285782 154688731 151055187 147405580 143739671 140048102
1297.2A40048102l689215l659487l643751l619999l599181l552162l481574l401339
$$ 140048102 136358887 132699400 129055649 125435650 121836469 118284307 114802733 111401394
1313.5A11401394l312089l270544l276534l252387l240921l276087l298506l280215
$$ 111401394 108089305 104818761 101542227 98289840 95048919 91772832 88474326 85194111
1329.8H5194111l165528l003426k976500l163173l267304l072463k879671k852045
$$ 85194111 82028583 79025157 76048657 72885484 69618180 66545717 63666046 60814001
1346.1F0814001k839957k771899k679039k634182k618075k505988k403739k410628
$$ 60814001 57974044 55202145 52523106 49888924 47270849 44764861 42361122 39950494
1362.4C9950494k311439k123303k063711j974374j893207j885857j727263j546822
$$ 39950494 37639055 35515752 33452041 31477667 29584460 27698603 25971340 24424518
1378.7B4424518j479155j403842j305535j298678j245940j085406j054387j080957
$$ 24424518 22945363 21541521 20235986 18937308 17691368 16605962 15551575 14470618
1395.1A4470618r79332r01401q03715o73000o18379n38052m33797l25369k45873j97407
$$ 14470618 13491286 12589885 11786170 11113170 10494791 9956739 9522942 9197573 8951700 8754293
1415.5H754293j20705K2766J36831J93926K38847K56069L11028L47676L11005K94461
$$ 8754293 8633588 8656354 8793185 8987111 9225958 9482027 9793055 10140731 10451736 10746197
1435.9A0746197L40654L20739K68961K13829J77432J82285J78634J66686J31642J35000
$$ 10746197 11086851 11407590 11676551 11890380 12067812 12250097 12428731 12595417 12727059 12862059
1456.2A2862059K16754K54286K23387K54823L33069L22837K98647M13501N64256N53330
$$ 12862059 13078813 13333099 13556486 13811309 14144378 14467215 14765862 15179363 15743619 16296949
1476.6A6296949N32406N78908O57244O84280P54572R21531J071607J034895J041461
$$ 16296949 16829355 17408263 18065507 18749787 19504359 20425890 21497497 22532392 23573853
1495B3573853J309229J469959J365060J155846J256311J878278J905210J615949J578123
$$ 23573853 24883082 26353041 27718101 28873947 30130258 32008536 33913746 35529695 37107818
1513.4C7107818J622483J702841J740527J969568K022110J852799J973443J902726
$$ 37107818 38730301 40433142 42173669 44143237 46165347 48018146 49991589 51894315
1529.7E1894315J864358K119042J935397J684606K326533K858650K624027K585985
$$ 51894315 53758673 55877715 57813112 59497718 61824251 64682901 67306928 69892913
1546F9892913K573282K782337K996132L103807L096618M285991N730994M201912L686219
$$ 69892913 72466195 75248532 78244664 81348471 84445089 88731080 94462074 98663986 102350205
1564.3A02350205M003324M298992M623525L915548L553644M284136L985211L296897
$$ 102350205 106353529 110652521 115276046 119191594 122745238 127029374 131014585 134311482
1580.7A34311482L235489L198505L082722K962709K819910K663896K556235K423614
$$ 134311482 137546971 140745476 143828198 146790907 149610817 152274713 154830948 157254562
1597A57254562K266884K162635K110824J990557J866862J809224J652867J358315J295373
$$ 157254562 159521446 161684081 163794905 165785462 167652324 169461548 171114415 172472730 173768103
1615.3A73768103J515225J316756J088977J197248J230717J172498J155838J009703
$$ 173768103 175283328 176600084 177689061 178886309 180117026 181289524 182445362 183455065
1631.6A83455065J025498J522809J765490J546055J493022J558363J960531K291009
$$ 183455065 184480563 186003372 187768862 189314917 190807939 192366302 194326833 196617842
1648A96617842J779899K107858L434331K819553K239316K489865K973944L168747K840385
$$ 196617842 198397741 200505599 203939930 206759483 208998799 211488664 214462608 217631355 220471740
1666.3B20471740L051579L587439L311634L421814L803655L363177K933711L307104
$$ 220471740 223523319 227110758 230422392 233844206 237647861 241011038 243944749 247251853
1682.6B47251853M594043M317552L530175L657251L468663L754854M184216M239440
$$ 247251853 251845896 256163448 259693623 263350874 266819537 270574391 274758607 278998047
1699B78998047M938275M195481L608734L946125L656417L231287K966643K978444L629863
$$ 278998047 283936322 288131803 291740537 295686662 299343079 302574366 305541009 308519453 312149316
1717.3C12149316L737211K985210K762347K848178K694816K544194K437592L023922
$$ 312149316 315886527 318871737 321634084 324482262 327177078 329721272 332158864 335182786
1733.6C35182786L309965K533227K513796K750278K589166K456039K477497K822638
$$ 335182786 338492751 341025978 343539774 346290052 348879218 351335257 353812754 356635392
1749.9C56635392L009557K539993K326786K407104K308875K386898K232403J905679
$$ 356635392 359644949 362184942 364511728 366918832 369227707 371614605 373847008 375752687
1766.3C75752687J802564J683384J737029J584828R05275K34127k99454q14259j449168
$$ 375752687 377555251 379238635 380975664 382560492 383465767 383699894 383400440 382586181 381137013
1784.6C81137013k073526k495438k858072k866060k290308j765877j251519l72976
$$ 381137013 379063487 376568049 373709977 370843917 368553609 366787732 365536213 365163237
1800.9C65163237O30736J443058K181232K987415L841847M392505M629642M892409
$$ 365163237 365793973 367237031 369418263 372405678 376247525 380640030 385269672 390162081
1817.2C90162081M986107M693597M458577M411727L988952L781944L765762L257394
$$ 390162081 395148188 399841785 404300362 408712089 412701041 416482985 420248747 423506141
1833.6D23506141K854198K735346K489806K171486K331287K565265K305329K123534
$$ 423506141 426360339 429095685 431585491 433756977 436088264 438653529 440958858 443082392
1849.9D43082392K038211J886427J828194J836091J815587J735211J611471J540095
$$ 443082392 445120603 447007030 448835224 450671315 452486902 454222113 455833584 457373679
1866.2D57373679J676410J858264J765251J641721J563609J490563J505971J536667
$$ 457373679 459050089 460908353 462673604 464315325 465878934 467369497 468875468 470412135
1882.5D70412135J470089J342446J399070J538485J419544J302660J409381J467348
$$ 470412135 471882224 473224670 474623740 476162225 477581769 478884429 480293810 481761158
1898.8D81761158J379102J258165J257270J300246J262009J227468J210660J167327
$$ 481761158 483140260 484398425 485655695 486955941 488217950 489445418 490656078 491823405
1915.1D91823405J154751J201331J191944J246333J233101J079232J078724J151383
$$ 491823405 492978156 494179487 495371431 496617764 497850865 498930097 500008821 501160204
1931.5E01160204J088798R82225J000405J001298R75371J034677J087367J066864R87053
$$ 501160204 502249002 503231227 504231632 505232930 506208301 507242978 508330345 509397209 510384262
1949.8E10384262R07898Q96990R00447Q15213P46131P75754Q33035Q75354R50277J018166
$$ 510384262 511292160 512189150 513089597 513904810 514650941 515426695 516259730 517135084 518085361 519103527
1970.2E19103527J037955R97544R16004R11951R48131R03845Q06689Q13723Q37087
$$ 519103527 520141482 521139026 522055030 522966981 523915112 524818957 525625646 526439369 527276456
1988.6E27276456P91133Q02100Q37266Q24928P87437P48933P54356P88808P38263O49750
$$ 527276456 528067589 528869689 529706955 530531883 531319320 532068253 532822609 533611417 534349680 534999430
2009E34999430O65426P56264P54774P04646P22408P39277P03752O41346O43670O93739
$$ 534999430 535664856 536421120 537175894 537880540 538602948 539342225 540045977 540687323 541330993 542024732
2029.4E42024732O94453O36161O31034O75798O67214O44684O64413P01368O74188O20663
$$ 542024732 542719185 543355346 543986380 544662178 545329392 545974076 546638489 547339857 548014045 548634708
2049.8E48634708O36518O80566O57260O05941O16789O69360O54757N72503N70774O44624
$$ 548634708 549271226 549951792 550609052 551214993 551831782 552501142 553155899 553728402 554299176 554943800
2070.2E54943800O63519N99205N94557O66320O45578N38051N09203N77509N96821N45323
$$ 554943800 555607319 556206524 556801081 557467401 558112979 558651030 559160233 559737742 560334563 560879886
2090.5E60879886N36621N77569N33759M52578M72844N30362M96268L99352L86297M40359
$$ 560879886 561416507 561994076 562527835 562980413 563453257 563983619 564479887 564879239 565265536 565705895
2110.9E65705895M44293L78252L71277M53889M43936L37839L35514M15504L90947L09944
$$ 565705895 566150188 566528440 566899717 567353606 567797542 568135381 568470895 568886399 569277346 569587290
2131.3E69587290L33250M30286M19080L17156L34740M48048M60208L85463L85821M90248
$$ 569587290 569920540 570350826 570769906 571087062 571421802 571869850 572330058 572715521 573101342 573591590
2151.7E73591590N53369M97282M86672N81801O11901N42462N39780O32345O51718N80966
$$ 573591590 574144959 574642241 575128913 575710714 576322615 576865077 577404857 578037202 578688920 579269886
2172.1E79269886N49376O12259O62804O12378N75065O40929O72400N97298N66602O28233
$$ 579269886 579819262 580431521 581094325 581706703 582281768 582922697 583595097 584192395 584758997 585387230
2192.5E85387230O29902N23627M77969N30601N40614M57585M16159M96090N36740M56929
$$ 585387230 586017132 586540759 587018728 587549329 588089943 588547528 588963687 589459777 589996517 590453446
2212.9E90453446M25279N19455N46038M52876M04835M53174M86195M44770M19974M67002
$$ 590453446 590878725 591398180 591944218 592397094 592801929 593255103 593741298 594186068 594606042 595073044
2233.3E95073044M93169M42743M32134M98057N14805M15087L56614M31657N00679M73857
$$ 595073044 595566213 596008956 596441090 596939147 597453952 597869039 598225653 598657310 599157989 599631846
2253.7E99631846M16160M43518M88937M37319L75628M30286N14090M83513M12882M59611
$$ 599631846 600048006 600491524 600980461 601417780 601793408 602223694 602737784 603221297 603634179 604093790
2274.1F04093790N08010L94881L19600L96729M22954K93494K17020K92182L23415K25842
$$ 604093790 604601800 604996681 605316281 605713010 606135964 606429458 606646478 606938660 607262075 607487917
2294.5F07487917J32084J82986K22921Q8573k8014Q106K8074l1769j1623O3061l1292
$$ 607487917 607620001 607802987 608025908 608114481 608086467 608094573 608122647 608090878 608079255 608142316 608111024
2316.9F08111024k42949k40802m948R9183l8565p0929J74820L77596K86758J27911
$$ 608111024 607868075 607627273 607622325 607721508 607682943 607612014 607786834 608164430 608451188 608579099
2337.3F08579099J88649M04656P44223J157701Q37744k17378r88126r82166n34176
$$ 608579099 608767748 609172404 609916627 611074328 611912072 611694694 610706568 609724402 609190226
2355.7F09190226j40965J70111N41389R08733J052797J062572J229465J400709J309335
$$ 609190226 609049261 609219372 609760761 610669494 611722291 612784863 614014328 615415037 616724372
2374F16724372J115501J088798J127541R52184O50287M66108L98994K88009J41025
$$ 616724372 617839873 618928671 620056212 621008396 621658683 622124791 622523785 622811794 622952819
2392.4F22952819J18434J99616K04027J27971J14381J52111J39714P1645O3896J24991
$$ 622952819 623071253 623270869 623474896 623602867 623717248 623869359 624009073 624080718 624144614 624269605
2412.8F24269605R7990j1504k6762K5212k5034j14977j03116n7101j14143k21312k36571
$$ 624269605 624367595 624356091 624329329 624354541 624329507 624214530 624111414 624054313 623940170 623718858 623482287
2435.2F23482287k04265k68936l94822m44769m27783m84407o57618p64310p72834q80063
$$ 623482287 623278022 623009086 622614264 622169495 621741712 621257305 620599687 619835377 619062543 618182480
2455.6F18182480j069486j192987j311600j512408j706183j848161k012790k269208
$$ 618182480 617112994 615920007 614608407 613095999 611389816 609541655 607528865 605259657
2471.9F05259657k552688k752602k915919l145456l385902l545999l664196l773034
$$ 605259657 602706969 599954367 597038448 593892992 590507090 586961091 583296895 579523861
2488.3E79523861l801703l686547l511370l323257l074824k812088k612352k481759
$$ 579523861 575722158 572035611 568524241 565200984 562126160 559314072 556701720 554219961
2504.6E54219961k384245k297223k214372k138853k023220j820982j566350j284123
$$ 554219961 551835716 549538493 547324121 545185268 543162048 541341066 539774716 538490593
2520.9E38490593r33945m75228K7240M74691R01044J349568J733303K009988K259672
$$ 538490593 537556648 537081420 537108660 537583351 538484395 539833963 541567266 543577254 545836926
2539.2E45836926K524018K734840K848923K873659K793849K656817K528071K352536
$$ 545836926 548360944 551095784 553944707 556818366 559612215 562269032 564797103 567149639
2555.6E67149639K124250J928806J731933J513540J339138J198709J051724R04739
$$ 567149639 569273889 571202695 572934628 574448168 575787306 576986015 578037739 578942478
2571.9E78942478P78258O91652O37352N60224M58181L81470L56793L45707K82288K21193
$$ 578942478 579720736 580412388 581049740 581609964 582068145 582449615 582806408 583152115 583434403 583655596
2592.3E83655596K51651L17335L31700L34322L89695M74632N24461N54741O36995P49945
$$ 583655596 583907247 584224582 584556282 584890604 585280299 585754931 586279392 586834133 587471128 588221073
2612.7E88221073Q26240Q97944J018464J113415J141906J171708J207292J221955J226008
$$ 588221073 589047313 589945257 590963721 592077136 593219042 594390750 595598042 596819997 598046005
2631E98046005J217246J208186J194894J151800J105190J055896R93192R34959Q50141
$$ 598046005 599263251 600471437 601666331 602818131 603923321 604979217 605972409 606907368 607757509
2649.4F07757509P18593O02067N20170M13239K92956K00630J05559J5319r120j6331
$$ 607757509 608476102 609078169 609598339 610011578 610304534 610505164 610610723 610626042 610616922 610600591
2669.8F10600591p9930j38164j36137j29461j57237j70589j56044j78993k35737k57372
$$ 610600591 610520661 610382497 610246360 610116899 609959662 609789073 609633029 609454036 609218299 608960927
2690.2F08960927k67625k89858k98500k86937k58743k71619l26514l68953l77178l51310
$$ 608960927 608693302 608403444 608104944 607818007 607559264 607287645 606961131 606592178 606215000 605863690
2710.6F05863690l75688m44948m11034l34144l87251m97162m74871l34084l19719m52876
$$ 605863690 605488002 605043054 604632020 604297876 603910625 603413463 602938592 602604508 602284789 601831913
2731F01831913m81725m20272m12226m13060m07934m30525m78744n25653m95434m44234
$$ 601831913 601350188 600929916 600517690 600104630 599696696 599266171 598787427 598261774 597766340 597322106
2751.4E97322106m56333m87685n11467n21720n40614n80192n96404o04868o48617o99342
$$ 597322106 596865773 596378088 595866621 595344901 594804287 594224095 593627691 593022823 592374206 591674864
2771.8E91674864p18176o77764o49512o92606p33853p84993q89361r67145r34779q98302
$$ 591674864 590956688 590278924 589629412 588936806 588202953 587417960 586528599 585561454 584626675 583728373
2792.2E83728373r78231j061201j035631j005709j073599j156688j207948j265824
$$ 583728373 582750142 581688941 580653310 579647601 578574002 577417314 576209366 574943542
2808.5E74943542j317620j346767j395941j473486j527429j576125j641691j713395
$$ 574943542 573625922 572279155 570883214 569409728 567882299 566306174 564664483 562951088
2824.8E62951088j804054j884579j970053k121628k309441k491355k623737k802372
$$ 562951088 561147034 559262455 557292402 555170774 552861333 550369978 547746241 544943869
2841.1E44943869l235042l806889m094005l700435k764404j898765j442492j318217
$$ 544943869 541708827 537901938 533807933 530107498 527343094 525444329 524001837 522683620
2857.4E22683620j333534j454473j704037j921475k055168k191544k196908j915991
$$ 522683620 521350086 519895613 518191576 516270101 514214933 512023389 509826481 507910490
2873.7E07910490j554668j377582j308144j221239j191914j205385j148283j060695
$$ 507910490 506355822 504978240 503670096 502448857 501256943 500051558 498903275 497842580
2890.1D97842580j022518j003325r31978q36581q14765q40396q62062r56565j246572
$$ 497842580 496820062 495816737 494884759 494048178 493233413 492393017 491530955 490574390 489327818
2908.4D89327818j723081k142399k242714j989544j507103r49681m75913j47790O4731
$$ 489327818 487604737 485462338 483219624 481230080 479722977 478773296 478297383 478149593 478214324
2926.8D78214324K80350N69493P38501P43806P99239R00597Q65727P25150O52045O28949
$$ 478214324 478494674 479064167 479802668 480546474 481345713 482246310 483112037 483837187 484489232 485118181
2947.2D85118181M53144J31935k7776N305J8835M6938K09123M51416O32227P50154
$$ 485118181 485571325 485703260 485675484 485680789 485699624 485746562 485955685 486407101 487039328 487789482
2967.6D87789482Q65847R15617Q73267P83950O69718O15239O44744O30378M97401L55840
$$ 487789482 488655329 489570946 490444213 491228163 491897881 492513120 493157864 493788242 494285643 494641483
2987.9D94641483K71559K13891K22027K38121K47329K85924K79098K89709L39031K99215
$$ 494641483 494913042 495126933 495348960 495587081 495834410 496120334 496399432 496689141 497028172 497327387
3008.3D97327387K09391J80722K05785K29567J96129Q5563p2211k01106l04550m43250
$$ 497327387 497536778 497717500 497923285 498152852 498348981 498434544 498362333 498161227 497856677 497413427
3028.7D97413427n56767n94586n74828o09964p74890r15438r03726q13990q17836r30369
$$ 497413427 496856660 496262074 495687246 495077282 494302392 493386954 492483228 491669238 490851402 489921033
3049.1D89921033r73403r24677r38594j015753j039266j018822j033783j063854j009166
$$ 489921033 488947630 488022953 487084359 486068606 485029340 484010518 482976735 481912881 480903715
3067.5D80903715r22114r41604j037359j128734j143753j041800r65327r90510j013696
$$ 480903715 479981601 479039997 478002638 476873904 475730151 474688351 473723024 472732514 471718818
3085.8D71718818j030237j047492j009702r63062j008421j137764j170248j077562
$$ 471718818 470688581 469641089 468631387 467668325 466659904 465522140 464351892 463274330
3102.2D63274330j079619j203120j251817j169502j173705j357347j444548j329303
$$ 463274330 462194711 460991591 459739774 458570272 457396567 456039220 454594672 453265369
3118.5D53265369j202762j173228j239389j323253j379818j415551j421064j441330
$$ 453265369 452062607 450889379 449649990 448326737 446946919 445531368 444110304 442668974
3134.8D42668974j515776j553475j479417j441688j515806j600354j674086j700819
$$ 442668974 441153198 439599723 438120306 436678618 435162812 433562458 431888372 430187553
3151.1D30187553j641810j595318j598835j603216j638860j711040j764030j776546
$$ 430187553 428545743 426950425 425351590 423748374 422109514 420398474 418634444 416857898
3167.4D16857898j770109j775741j792133j789510j775384j770348j759886j777500
$$ 416857898 415087789 413312048 411519915 409730405 407955021 406184673 404424787 402647287
3183.7D02647287j835347j846373j808613j806736j806110j766712j747191j769632
$$ 402647287 400811940 398965567 397156954 395350218 393544108 391777396 390030205 388260573
3200.1C88260573j807690j800268j744152j704543j695246j715660j727998j698345
$$ 388260573 386452883 384652615 382908463 381203920 379508674 377793014 376065016 374366671
3216.4C74366671j705170j738310j712650j676976j672060j686245j725614j730770
$$ 374366671 372661501 370923191 369210541 367533565 365861505 364175260 362449646 360718876
3232.7C60718876j667529j619160j617909j608282j618445j674056j686990j630694
$$ 360718876 359051347 357432187 355814278 354205996 352587551 350913495 349226505 347595811
3249C47595811j586139j611978j652122j648158j637429j623302j583576j553089j577288
$$ 347595811 346009672 344397694 342745572 341097414 339459985 337836683 336253107 334700018 333122730
3267.4C33122730j621514j612515j536578j445204j394987j368343j350761j350462
$$ 333122730 331501216 329888701 328352123 326906919 325511932 324143589 322792828 321442366
3283.7C21442366j329333j317352j353145j337796j245856j207769j225949j227378
$$ 321442366 320113033 318795681 317442536 316104740 314858884 313651115 312425166 311197788
3300C11197788j232774j245796j256675j259714j251191j265466j302749j321733j356840
$$ 311197788 309965014 308719218 307462543 306202829 304951638 303686172 302383423 301061690 299704850
3318.4B99704850j415015j461327j535415j595825j573861j542717j572132j596123
$$ 299704850 298289835 296828508 295293093 293697268 292123407 290580690 289008558 287412435
3334.7B87412435j597882j625984j628340j553118j462787j431883j417815j367450
$$ 287412435 285814553 284188569 282560229 281007111 279544324 278112441 276694626 275327176
3351B75327176j325995j309246j280695j281708j312554j304537j251430j178056j133293
$$ 275327176 274001181 272691935 271411240 270129532 268816978 267512441 266261011 265082955 263949662
3369.3B63949662j139551j128137j033157r05454q55685q76784q53360p95066p23213
$$ 263949662 262810111 261681974 260648817 259743363 258887678 258010894 257157534 256362468 255639255
3387.7B55639255o11991n44011n46485n36234n02318m60773l94702l53069l49342l28362
$$ 255639255 255027264 254483253 253936768 253400534 252898216 252437443 252042741 251689672 251340330 251011968
3408.1B51011968k52605j58936j03920r6977p1734L218P6652J63794K58356L13043
$$ 251011968 250759363 250600427 250496507 250399530 250327796 250331014 250407666 250571460 250829816 251142859
3428.5B51142859L36320M48018N73784N46098N14686N93960O47545P08491Q66085R39846
$$ 251142859 251479179 251927197 252500981 253047079 253561765 254155725 254803270 255511761 256377846 257317692
3448.9B57317692R57549J021027J063436J096547J157224J222611J297712J368761
$$ 257317692 258275241 259296268 260359704 261456251 262613475 263836086 265133798 266502559
3465.2B66502559J368255J330554J354843J461447J525789J548440J584649J617878
$$ 266502559 267870814 269201368 270556211 272017658 273543447 275091887 276676536 278294414
3481.5B78294414J656503J715064J762301J803100J870870J850993J801759J859903
$$ 278294414 279950917 281665981 283428282 285231382 287102252 288953245 290755004 292614907
3497.8B92614907J967162K045542K065599K030671K052843K113849K151877K226203
$$ 292614907 294582069 296627611 298693210 300723881 302776724 304890573 307042450 309268653
3514.2C09268653K291024K300352K242923K215981K299994K475054K622425K627969
$$ 309268653 311559677 313860029 316102952 318318933 320618927 323093981 325716406 328344375
3530.5C28344375K579868K623290K691924K670229K668082K758265K960831L091424
$$ 328344375 330924243 333547533 336239457 338909686 341577768 344336033 347296864 350388288
3546.8C50388288K996952K983183L157168L168076L092289L191054L258646L153324
$$ 350388288 353385240 356368423 359525591 362693667 365785956 368977010 372235656 375388980
3563.1C75388980L287136L921271M075616L646613L577262L785044L862023L853142
$$ 375388980 378676116 382597387 386673003 390319616 393896878 397681922 401543945 405397087
3579.4D05397087L813684L659517L847837M539550M544943L935308L961056M235506
$$ 405397087 409210771 412870288 416718125 421257675 425802618 429737926 433698982 437934488
3595.7D37934488M199982M237681M310578M088015M012346M399926M387885L952473
$$ 437934488 442134470 446372151 450682729 454770744 458783090 463183016 467570901 471523374
3612.1D71523374L689498L401995L661662M321277M148811L699303L972739N365580
$$ 471523374 475212872 478614867 482276529 486597806 490746617 494445920 498418659 503784239
3628.4E03784239N727709M370153L979504M057467L954589L827691L395379K856850
$$ 503784239 509511948 513882101 517861605 521919072 525873661 529701352 533096731 535953581
3644.7E35953581L100515M342317M449010L009141K717733L388167L158986K664685
$$ 535953581 539054096 543396413 547845423 550854564 553572297 556960464 560119450 562784135
3661E62784135K512157K109647J887143K477705K509296J839698K525270K640604J508713
$$ 562784135 565296292 567405939 569293082 571770787 574280083 576119781 578645051 581285655 582794368
3679.4E82794368J115382Q64148N47886Q29041J210690O38961K3902R2566M75883J102388
$$ 582794368 583909750 584773898 585321784 586150825 587361515 588000476 588024378 588116944 588592827 589695215
3699.8E89695215J881540J990378J583815J592934K158940K608835J857639Q71002
$$ 589695215 591576755 593567133 595150948 596743882 598902822 601511657 603369296 604240298
3716.1F04240298O29664P59124Q56519P91312O37054L67701K37465M89294R01878J052738
$$ 604240298 604869962 605629086 606485605 607276917 607913971 608281672 608519137 609008431 609910309 610963047
3736.5F10963047M13417m15921j18196R82046O24955J66774J020729R02176m6491p1168
$$ 610963047 611376464 610960543 610842347 611824393 612449348 612616122 613636851 614539027 614492536 614421368
3756.9F14421368M25577M10557L1888o974J37508M58539N69522P9870j84595J26242
$$ 614421368 614846945 615257502 615289390 615282416 615419924 615878463 616447985 616527855 616343260 616469502
3777.3F16469502M38571K09213n1916Q5592J89245J63913K1398j70887j24096j40489
$$ 616469502 616908073 617117286 617065370 617150962 617340207 617504120 617525518 617354631 617230535 617090046
3797.7F17090046P2778O10530K34246L1472M14967l9637o23047l76761K04563L8028
$$ 617090046 617162824 617773354 618007600 618039072 618454039 618414402 617791355 617414594 617619157 617657185
3818F17657185J28686O21498J20520j33693K6107q0347k19941k81513K3186M76778
$$ 617657185 617785871 618407369 618527889 618394196 618420303 618339956 618120015 617838502 617861688 618338466
3838.4F18338466L44336P7128o378l34262p92504o46174P82788J424015j09196p44999
$$ 618338466 618682802 618759930 618753552 618419290 617626786 616980612 617763400 619187415 619078219 618333220
3858.8F18333220l81469Q8215J41739k15590p867L57031J09971q2314l08454k56419
$$ 618333220 617951751 618039966 618181705 617966115 617958248 618315279 618425250 618342936 618034482 617778063
3879.2F17778063J3768m5001J52588N6982k60830O4850J03295m08113n09203j71184
$$ 617778063 617791831 617746830 617899418 617956400 617695570 617760420 617863715 617455602 616946399 616775215
3899.6F16775215J65343M33505L31223r7812k26080j77741k25723j40786M7564j1921
$$ 616775215 616940558 617374063 617705286 617607474 617381394 617203653 616977930 616837144 616884708 616872787
3920F16872787j63793o8724k4259k00153j66297P8142R5010r2149k15650j81734m9472
$$ 616872787 616708994 616640270 616616011 616415858 616249561 616327703 616422713 616330564 616114914 615933180 615883708
3942.5F15883708p5459j34528J490Q0824K1756l5227o7055p5281l8027J2934k6584
$$ 615883708 615808249 615673721 615675211 615756035 615777791 615742564 615675509 615600228 615562201 615575135 615548551
3964.9F15548551r0837q6844j00971q2790K4080N7936Q94k8611k8550m4227o0022l5167
$$ 615548551 615457714 615370870 615269899 615187109 615211189 615269125 615270019 615241408 615212858 615168631 615108609 615073442
3989.4F15073442K2710N8472K0385n8234
$$ 615073442 615096152 615154624 615175009 615116775
3997.5F15116775
$$ 615116775
##END=$$ End of the data block
