##TITLE=$$ Begin of the data block
##JCAMP-DX=5.00 $$ ACD/SpecManager v 10.08
##SPECTROMETER/DATA SYSTEM=Alpha
##DATE=11 Jun 2014 07:55:32
##DATA TYPE=INFRARED SPECTRUM
##DATA CLASS=XYDATA
##ORIGIN=
##OWNER=
##NPOINTS=1765
##FIRSTX=399.75695801
##LASTX=3997.56933594
##MAXX=3997.56933594
##MINX=399.75695801
##MAXY=0.62614232
##MINY=0.00861573
##XFACTOR=1.0000000000
##YFACTOR=1.000000000000000e-9
##FIRSTY=0.14635225
##DELTAX=2.03957629
##XUNITS=1/CM
##YUNITS=ARBITRARY UNITS
##XYDATA=(X++(Y..Y))
399.8A46352246P295579P399768P861212Q142396Q140609Q043632P607371O842330
$$ 146352246 153647825 161047593 168908805 177051201 185191810 193235442 200842813 207685143
416.1B07685143P525772Q518189P315561O595507O688863O611854O335110N914479
$$ 207685143 215210915 223729104 231044665 237640172 244329035 250940889 257275999 263190478
432.4B63190478O133735O549090N982727N351782N481452N226582M365742M075885
$$ 263190478 269324213 275873303 281856030 287207812 292689264 297915846 302281588 306357473
448.7C06357473M304230L900081K862633K664029L031373K550632J859963J910150
$$ 306357473 310661703 314561784 317424417 320088446 323119819 325670451 327530414 329440564
465C29440564K427697K543450K745717L965616M862130M440427M011661M618913N151212
$$ 329440564 331868261 334411711 337157428 341123044 345985174 350425601 354437262 359056175 364207387
483.4C64207387M294813L439814L775060L908634L056675K471209K660900K546430
$$ 364207387 368502200 371942014 375717074 379625708 382682383 385153592 387814492 390360922
499.7C90360922J851916J654565K124340J868516Q73595P93457J427234J286208N53876
$$ 390360922 392212838 393867403 395991743 397860259 398733854 399527311 400954545 402240753 402794629
518.1D02794629N31376J032382P67857J07884M55112J143813R41783O67363J335770
$$ 402794629 403326005 404358387 405126244 405234128 405689240 406833053 407774836 408442199 409777969
536.4D09777969K048284J645803J088858J611143K180547J607060R12071J111447J257748
$$ 409777969 411826253 413472056 414560914 416172057 418352604 419959664 420871735 421983182 423240930
554.8D23240930O23315L18945J041144J501918J046896Q93265J452118J460940P47114
$$ 423240930 423864245 424183190 425224334 426726252 427773148 428666413 430118531 431579471 432326585
573.1D32326585N88596J064658J111209O53863Q22664J568585J492232P54267P68811
$$ 432326585 432915181 433979839 435091048 435744911 436567575 438136160 439628392 440382659 441151470
591.5D41151470J292407J027376K57790K6643J29581l69430j171052j103193l02225
$$ 441151470 442443877 443471253 443729043 443755686 443885267 443515837 442344785 441241592 440939367
609.8D40939367J48922K26736O47068J246363J374036J260549J410574J492023J131922
$$ 440939367 441088289 441315025 441962093 443208456 444582492 445843041 447253615 448745638 449877560
628.2D49877560Q57949J256317J879156J977026J713574J594961J489252J166910P62611
$$ 449877560 450735509 451991826 453870982 455848008 457561582 459156543 460645795 461812705 462575316
646.5D62575316M74155K98024o438m03911n45293m36991n05626q06123j019210j117200
$$ 462575316 463049471 463347495 463341057 462937146 462391853 461954862 461449236 460643113 459623903 458506703
666.9D58506703n93960R8556K00034K28077n7876n73039p90537q63254j321614k075553
$$ 458506703 457912743 458011299 458211333 458439410 458381534 457808495 457017958 456154704 454833090 452757537
687.3D52757537k691656l353626m578173o139666p307261p943958q980036j0959237
$$ 452757537 450065881 446712255 442134082 435994416 428687155 420743197 411763161 400803924
703.7D00803924j2762160j3397216j2600512j0101884o962270m991680l581137P093
$$ 400803924 388041764 374644548 362044036 351942152 344979882 339988202 336407065 336414158
720C36414158O296814J3121873J8481582K1688015K2893905K1960050J8779248J4674008
$$ 336414158 342710972 355832845 374314427 396002442 418896347 440856397 459635645 474309653
736.3D74309653J1303008Q698016O019652L761351K832830K376854J346112N72145
$$ 474309653 485612661 494310677 500330329 504091680 506924510 509301364 510647476 511219621
752.6E11219621P67767Q98063K66016j90258J17957K60473k10703l98099N7161J37627
$$ 511219621 511987388 512885451 513151467 512961209 513079166 513339639 513128936 512730837 512787998 512925625
773E12925625n20229p35164q8215K95162m9710k90394j74046l79979j017630j281560
$$ 512925625 512405396 511670232 511582017 511877179 511827469 511537075 511363029 510983050 509965420 508683860
793.4E08683860j004517q71837q61704m75884J3888r4414o88493j015901j092017j533866
$$ 508683860 507679343 506807506 505945802 505469918 505483806 505389392 504700899 503684998 502592981 501059115
813.8E01059115k147436k380818k388478k649128l159344l524930l801494m371167
$$ 501059115 498911679 496530861 494142383 491493255 488333911 484808981 481007487 476636320
830.1D76636320n173802n820483o437600p460504q985520j1141062j4784455j7771065
$$ 476636320 471462518 465642035 459204435 451743931 442758411 431617349 416832894 399061829
846.4C99061829j3858080n468637l711134j0059088j7227710k2229761k6647120l2238514
$$ 399061829 385203749 379735112 376023978 365964890 348737180 326507419 299860299 267621785
862.7B67621785l9941057m8827782n1979974m0573866j9826874l838040N620219J5426114
$$ 267621785 227680728 178852946 126872972 86299106 66472232 62634192 68254411 83680525
879.1H3680525K7661130M0485829N2325964O0034812N8901071M9024821L6524564K6409685
$$ 83680525 111341655 151827484 204153448 264188260 323089331 372114152 408638716 435048401
895.4D35048401J9216150J4165700J0797620Q381486O243229M526466L617584L127516
$$ 435048401 454264551 468430251 479227871 487609357 493852586 498379052 501996636 505124152
911.7E05124152K536237K044380J836598J442372O81401Q8095n9664k51532p22587
$$ 505124152 507660389 509704769 511541367 512983739 513665140 513753235 513693571 513442039 512719452
930E12719452r08196o49869n65946q46803r96948r09507j065373j562178j929105k073526
$$ 512719452 511811256 511161387 510595441 509748638 508751690 507842183 506776810 505214632 503285527 501212001
950.4E01212001k387256k960890l371805l499210l792822m294575m580736m705101
$$ 501212001 498824745 495863855 492492050 488992840 485200018 480905443 476324707 471619606
966.8D71619606n118698n747855o195962o576061p255465q054227q500397q626819
$$ 471619606 466500908 460753053 454557091 447981030 440725565 432671338 424170941 415544122
983.1D15544122q727014q706659q336752p847846p545501p262319o791681o393045
$$ 415544122 406817108 398110449 389773697 381925851 374380350 367118031 360326350 353933305
999.4C53933305o309629o370693o347120o240189o131083n918622n521029n032659
$$ 353933305 347623676 341252983 334905863 328665674 322534591 316615969 311094940 306062281
1015.7C06062281m509836l886044l203601k625823k174795j689315j071095m50671
$$ 306062281 301552445 297666401 294462800 291836977 289662182 287972867 286901772 286451101
1032B86451101R239K49565K48134n2899n27352q54046r07003p96587n30392K3842P95543
$$ 286451101 286460340 286709905 286958039 286905140 286377788 285523742 284616739 283820152 283289760 283313602 284109145
1054.5B84109145J531363K053827K306968K170086J554847N66840o29068j893431l041446
$$ 284109145 285640508 287694335 290001303 292171389 293726236 294293076 293664008 291770577 288729131
1072.8B88729131l761828l859579l546119k963394j791328j70380J364529K790392
$$ 288729131 284967303 281107724 277561605 274598211 272806883 272636503 274001032 276791424
1089.1B76791424M018902M467100L811151K521396J327812O28651M82142P36206J170755
$$ 276791424 280810326 285277426 289088577 291609973 292937785 293566436 294048578 294784784 295955539
1107.5B95955539J589864J835436J816511J543671J082361N78969K53290J53333K9326
$$ 295955539 297545403 299380839 301197350 302741021 303823382 304402351 304655641 304808974 304838300
1125.8C04838300k51413n23895p44700j055628j480967j856625k020747j998752j822203
$$ 304838300 304586887 304062992 303318292 302262664 300781697 298925072 296904325 294905573 293083370
1144.2B93083370j450062j011014o87540m87446k92182l2038K67327O07341J042128
$$ 293083370 291633308 290622294 289934754 289447308 289155126 289123088 289390415 289997756 291039884
1162.6B91039884J511842J748353J618713J349420J185834J099646R78440Q48234O53148
$$ 291039884 292551726 294300079 295918792 297268212 298454046 299553692 300532132 301380366 302033514
1180.9C02033514K29329l86328r60082j393348j802206k171307k345860k352000k329349
$$ 302033514 302262843 301876515 300916433 299523085 297720879 295549572 293203712 290851712 288522363
1199.3B88522363k294720k183288k040982k043873k224684k440214k617478k831936
$$ 288522363 286227643 284044355 282003373 279959500 277734816 275294602 272677124 269845188
1215.6B69845188l084034l217220l230930l257096l317594l312290l240645l198236
$$ 269845188 266761154 263543934 260313004 257055908 253738314 250426024 247185379 243987143
1231.9B43987143l143474l033102k970383l025218l103316l089324k996862k974897
$$ 243987143 240843669 237810567 234840184 231814966 228711650 225622326 222625464 219650567
1248.2B19650567l038660l059924l032043l065765l158421l176927l135413l135011
$$ 219650567 216611907 213551983 210519940 207454175 204295754 201118827 197983414 194848403
1264.5A94848403l168359l178895l205940l275603l340393l363788l390387l448695
$$ 194848403 191680044 188501149 185295209 182019606 178679213 175315425 171925038 168476343
1280.8A68476343l477260l479213l497556l553599l613010l652125l658832l672093
$$ 168476343 164999083 161519870 158022314 154468715 150855705 147203580 143544748 139872655
1297.2A39872655l698587l675908l630981l619656l610924l533259l450379l402233
$$ 139872655 136174068 132498160 128867179 125247523 121636599 118103340 114652961 111250728
1313.5A11250728l328614l268748l278054l257454l232211l278508l312991l282286
$$ 111250728 107922114 104653366 101375312 98117858 94885647 91607139 88294148 85011862
1329.8H5011862l166042l008872k980568l163270l239647l027283k844810k827678
$$ 85011862 81845820 78836948 75856380 72693110 69453463 66426180 63581370 60753692
1346.1F0753692k834559k795189k727557k665423k597783k487316k439362k462923
$$ 60753692 57919133 55123944 52396387 49730964 47133181 44645865 42206503 39743580
1362.4C9743580k313342k082892k034716j973614j889527j854179j684713j531290
$$ 39743580 37430238 35347346 33312630 31339016 29449489 27595310 25910597 24379307
1378.7B4379307j497676j425168j318553j291646j207411j063932j062386j088522
$$ 24379307 22881631 21456463 20137910 18846264 17638853 16574921 15512535 14424013
1395.1A4424013r81355r03692q12689o83587o29104n41989m20135l10145k26787j74689
$$ 14424013 13442658 12538966 11726277 11042690 10413586 9871597 9451462 9141317 8914530 8739841
1415.5H739841j24114L703J39570K05435K52184K76201L09994L16128K87407L08690
$$ 8739841 8615727 8619430 8759000 8964435 9216619 9492820 9802814 10118942 10406349 10715039
1435.9A0715039L78728L31805K58707K13209J81979J98108K07852J66379R4913J00597
$$ 10715039 11093767 11425572 11684279 11897488 12079467 12277575 12485427 12651806 12746719 12847316
1456.2A2847316K23195K81315K51869K80303L33409K93422K52626L93991N86994N86059
$$ 12847316 13070511 13351826 13603695 13883998 14217407 14510829 14763455 15157446 15744440 16330499
1476.6A6330499N73792O09966O73584O87419P18726Q79124J081436J059583J059916
$$ 16330499 16904291 17514257 18187841 18875260 19593986 20473110 21554546 22614129 23674045
1495B3674045J330938J467837J346707J142469J244288J892676J948875J627251J565136
$$ 23674045 25004983 26472820 27819527 28961996 30206284 32098960 34047835 35675086 37240222
1513.4C7240222J619965J698222J727994J959920K040312J890559J974009J886196
$$ 37240222 38860187 40558409 42286403 44246323 46286635 48177194 50151203 52037399
1529.7E2037399J871757K120324J909677J673952K371519K929785K653017K570108
$$ 52037399 53909156 56029480 57939157 59613109 61984628 64914413 67567430 70137538
1546G0137538K546437K760328K973974L097728L107816M283607N729534M195288L653727
$$ 70137538 72683975 75444303 78418277 81516005 84623821 88907428 94636962 98832250 102485977
1564.3A02485977L993817M324928M620030L879667L526888M253380L943950L276989
$$ 102485977 106479794 110804722 115424752 119304419 122831307 127084687 131028637 134305626
1580.7A34305626L230706L179848L033996K881020K725050K583712K489269K349869
$$ 134305626 137536332 140716180 143750176 146631196 149356246 151939958 154429227 156779096
1597A56779096K189427K093479K025962J878560J750409J684174J527161J259803J197145
$$ 156779096 158968523 161062002 163087964 164966524 166716933 168401107 169928268 171188071 172385216
1615.3A72385216J417950J287236J091808J180366J220748J193121J190677J058817
$$ 172385216 173803166 175090402 176182210 177362576 178583324 179776445 180967122 182025939
1631.6A82025939J102299J624047J848758J627877J609832J693860K125010K506971
$$ 182025939 183128238 184752285 186601043 188228920 189838752 191532612 193657622 196164593
1648A96164593J982108K289221L626391K973288K358824K603009L100038L282189K896101
$$ 196164593 198146701 200435922 204062313 207035601 209394425 211997434 215097472 218379661 221275762
1666.3B21275762L088519L631025L306076L394678L814102L398805K982677L337577
$$ 221275762 224364281 227995306 231301382 234696060 238510162 241908967 244891644 248229221
1682.6B48229221M564270M283607L509223L624648L445596L749937M156619M181832
$$ 248229221 252793491 257077098 260586321 264210969 267656565 271406502 275563121 279744953
1699B79744953M935235M251480L635853L939957L669768L274083L026277L055692L671139
$$ 279744953 284680188 288931668 292567521 296507478 300177246 303451329 306477606 309533298 313204437
1717.3C13204437L696830K940863K754569K884507K755791K555847K408386L027945
$$ 313204437 316901267 319842130 322596699 325481206 328236997 330792844 333201230 336229175
1733.6C36229175L314078K515495K525032K792239K606421K443821K451598K759636
$$ 336229175 339543253 342058748 344583780 347376019 349982440 352426261 354877859 357637495
1749.9C57637495K936035K520889K362967K439528K308488K399058K259671J902372
$$ 357637495 360573530 363094419 365457386 367896914 370205402 372604460 374864131 376766503
1766.3C76766503J780122J682818J755804J593858Q99047K36898k78145q13663j483768
$$ 376766503 378546625 380229443 381985247 383579105 384478152 384715050 384436905 383623242 382139474
1784.6C82139474k093613k488434k856970k875447k303094j784563j269102l80755
$$ 382139474 380045861 377557427 374700457 371825010 369521916 367737353 366468251 366087496
1800.9C66087496O24359J431286K178580L024489L897279M406989M619926M884779
$$ 366087496 366711855 368143141 370321721 373346210 377243489 381650478 386270404 391155183
1817.2C91155183M973382M685968M455030M408092L999948L800869L781468L280848
$$ 391155183 396128565 400814533 405269563 409677655 413677603 417478472 421259940 424540788
1833.6D24540788K887994K744973K476185K178818K330959K543271K305120K123088
$$ 424540788 427428782 430173755 432649940 434828758 437159717 439702988 442008108 444131196
1849.9D44131196K021819J880050J840442J859456J827032J720786J597881J518250
$$ 444131196 446153015 448033065 449873507 451732963 453559995 455280781 456878662 458396912
1866.2D58396912J638770J844555J776278J655877J575887J500904J509071J535505
$$ 458396912 460035682 461880237 463656515 465312392 466888279 468389183 469898254 471433759
1882.5D71433759J471132J339108J385509J536191J438707J311749J406342J450807
$$ 471433759 472904891 474243999 475629508 477165699 478604406 479916155 481322497 482773304
1898.8D82773304J349270J242578J248896J291276J257330J227289J213879J165002
$$ 482773304 484122574 485365152 486614048 487905324 489162654 490389943 491603822 492768824
1915.1D92768824J162857J216710J188159J231133J212925J066715J072555J136542
$$ 492768824 493931681 495148391 496336550 497567683 498780608 499847323 500919878 502056420
1931.5E02056420J076937R85086J027584J044988R90749J005172J061857J068711R86159
$$ 502056420 503133357 504118443 505146027 506191015 507181764 508186936 509248793 510317504 511303663
1949.8E11303663Q83639Q67725Q80301P88331P28964P98047Q68261Q76665R26852J006484
$$ 511303663 512187302 513055027 513935328 514723659 515452623 516250670 517118931 517995596 518922448 519928932
1970.2E19928932J039446R96410R02713Q98182R36866Q91983P99776Q05378Q32736
$$ 519928932 520968378 521964788 522867501 523765683 524702549 525594532 526394308 527199686 528032422
1988.6E28032422P99000P99954Q13663Q01802P78913P53403P64847P96616P31051O48022
$$ 528032422 528831422 529631376 530445039 531246841 532025754 532779157 533544004 534340620 535071671 535719693
2009E35719693P00354P88153P48693O95110P25210P38978O95884O32405O48618P02799
$$ 535719693 536420047 537208200 537956893 538652003 539377213 540116191 540812075 541444480 542093098 542795897
2029.4E42795897O94632O31511O20902O80446O68467O13272O41584P14064O97374O43671
$$ 542795897 543490529 544122040 544742942 545423388 546091855 546705127 547346711 548060775 548758149 549401820
2049.8E49401820O55055O82413O63936O30439O35206O80805O71446N83232N73813O46055
$$ 549401820 550056875 550739288 551403224 552033663 552668869 553349674 554021120 554604352 555178165 555824220
2070.2E55824220O55055N97120O09278O71506O40750N58913N75006O51240O16491N16832
$$ 555824220 556479275 557076395 557685673 558357179 558997929 559556842 560131848 560783088 561399579 561916411
2090.5E61916411M96447N49436N56290N07772N07533N44250N18203M39525M27007M60208
$$ 561916411 562412858 562962294 563518584 564026356 564533889 565078139 565596342 566035867 566462874 566923082
2110.9E66923082M39823L74972L79920M60804M46796L31343L27825M34816M28677L43680
$$ 566923082 567362905 567737877 568117797 568578601 569025397 569356740 569684565 570119381 570548058 570891738
2131.3E70891738L66926M52459M28438L27170L10063L85523M37618M20034M15682M95375
$$ 570891738 571258664 571711123 572139561 572466731 572776794 573162317 573599935 574019969 574435651 574931026
2151.7E74931026N57780N09798M89414N71728O25193N75900N44906O23107O59942N84543
$$ 574931026 575488806 575998604 576488018 577059746 577684939 578260839 578805745 579428852 580088794 580673337
2172.1E80673337N58853O49750O99938O32882N81741O41704O75082N94556N52655O02006
$$ 580673337 581232190 581881940 582581878 583214760 583796501 584438205 585113287 585707843 586260498 586862504
2192.5E86862504O08147N32150N15222N77987N63085M32968L84152M95493N72324N19514
$$ 586862504 587470651 588002801 588518023 589096010 589659095 590092063 590476215 590971708 591544032 592063546
2212.9E92063546M58300M96865N05566M18186M07279N08606N39720M50492M05252M53890
$$ 592063546 592521846 593018711 593524277 593942463 594349742 594858348 595398068 595848560 596253812 596707702
2233.3E96707702M81069M42087M24445M80652N20229M39167L76046M40598N02228M77255
$$ 596707702 597188771 597630858 598055303 598535955 599056184 599495351 599871397 600311995 600814223 601291478
2253.7F01291478M09901M27246M97341M55260L79384M41790N28812M80831M08113M70638
$$ 601291478 601701379 602128625 602625966 603081226 603460610 603902400 604431212 604912043 605320156 605790794
2274.1F05790794N21958L87192L04877M07696M34816K88129K15411L11494L34918K01822
$$ 605790794 606312752 606699944 607004821 607412517 607847333 608135462 608350873 608662367 608997285 609199107
2294.5F09199107J26183K16484K55048R3341l4511K9266N0485l9041j1623Q6248K861
$$ 609199107 609325290 609541774 609796822 609890163 609855652 609884918 609935403 609896362 609884739 609970987 609973848
2316.9F09973848k13206k61605k2113J57535L0756M292K54213L66986J98305O3896
$$ 609973848 609760642 609499037 609476924 609634459 609665215 609669507 609923720 610290706 610489011 610552907
2337.3F10552907J58787L89218P73907J189649Q47697j77383q99971q67247m26114
$$ 610552907 610711694 611100912 611874819 613064468 613912165 613734782 612834811 611967564 611541450
2355.7F11541450o7711J51158M27186P97510J053929J132131J183748J251161J180053
$$ 611541450 611473739 611624897 612052083 612849593 613903522 615035653 616219401 617470562 618650615
2374F18650615J070261J100421J096785Q98540O22154M33325L60728K76327J60932
$$ 618650615 619720876 620821297 621918082 622816622 623438776 623872101 624232829 624509156 624670088
2392.4F24670088J58966K49505K28941R7514O6936J57058J81377Q6903L4571Q9467
$$ 624670088 624829054 625078559 625307500 625405014 625471950 625629008 625810385 625897288 625931859 626021326
2412.8F26021326J09851J1146m3273K4617R179j15633j33336o1094j10031k21729k21193
$$ 626021326 626131177 626142323 626099050 626123667 626132846 626017213 625883877 625822783 625712752 625491023 625269830
2435.2F25269830j87337k71738m05788m54784m56869n20706o54221p32362p70331r03725
$$ 625269830 625082493 624810755 624404967 623950183 623493314 622972608 622318387 621586025 620815694 619911969
2455.6F19911969j076818j190424j308441j498043j698256j864612k031624k266705
$$ 619911969 618835151 617644727 616336286 614838243 613139987 611275375 609243751 606977046
2471.9F06977046k529502k718389k888740l140747l422320l602624l691375l767729
$$ 606977046 604447544 601729155 598840415 595699668 592277348 588674724 584983349 581215620
2488.3E81215620l787577l681541l507316l324568l103375k840162k626419k490282
$$ 581215620 577428043 573746502 570239186 566914618 563811243 560971081 558344662 555854380
2504.6E55854380k385199k320588k252399k148748k022326j827240j567066j274407
$$ 555854380 553469181 551148593 548896194 546747446 544725120 542897880 541330814 540056407
2520.9E40056407q96930m38631K2590M57347Q73983J308262J734316K080202K332986
$$ 540056407 539159477 538720846 538743436 539200783 540074766 541383028 543117344 545197546 547530532
2539.2E47530532K530634K688945K787888K823174K805352K726436K559959K338946
$$ 547530532 550061166 552750111 555537999 558361173 561166525 563892961 566452920 568791866
2555.6E68791866K130509J936793J733840J546859J385749J203060J009822Q74400
$$ 568791866 570922375 572859168 574593008 576139867 577525616 578728676 579738498 580612898
2571.9E80612898Q05080P38621O35862N15640M25577L87907L71456L43621K93672K49326
$$ 580612898 581417978 582156599 582792461 583308101 583733678 584121585 584493041 584836662 585130334 585379660
2592.3E85379660K62439L12150L34144L52919L93688M38929N02884N93901O78658P34449
$$ 585379660 585642099 585954249 586288393 586641312 587035000 587473929 587976813 588570714 589249372 589983821
2612.7E89983821P97093R07540J038790J108646J145423J214802J254261J245439J235306
$$ 589983821 590780914 591688454 592727244 593835890 594981313 596196115 597450376 598695815 599931121
2631E99931121J203179J164198J168847J169920J136542J094102J037419R52006Q39531
$$ 599931121 601134300 602298498 603467345 604637265 605773807 606867909 607905328 608857334 609696865
2649.4F09696865P14898O00398N12421M20630L12686K19762J23680K1756p749O0n2453
$$ 609696865 610411763 611012161 611524582 611945212 612257898 612477660 612601340 612623096 612615347 612615407 612562954
2671.8F12562954j36852j76251j57654j51575j65820j63853j81138k28227k41577k39373
$$ 612562954 612426102 612249851 612092197 611940622 611774802 611610949 611429811 611201584 610960007 610720634
2692.2F10720634k76207k99991k72572k29835k53856l53635m15504l69847k92122l15606
$$ 610720634 610444427 610144436 609871864 609642029 609388173 609034538 608619034 608249187 607957065 607641459
2712.6F07641459l93987l86596l69549m45902n04255m59671l54529l21924m00544m41312
$$ 607641459 607247472 606860876 606491327 606045425 605541170 605081499 604726970 604405046 604004502 603563190
2733F03563190m25280m28021m15384l93391m22001m78983n19037n06997m62830m56095
$$ 603563190 603137910 602709889 602294505 601901114 601479113 601000130 600481093 599974096 599511266 599055171
2753.4E99055171m71830m84348n23865n66721n53667n26131n71787o68406p23064p09236
$$ 599055171 598583341 598098993 597575128 597008407 596454740 595928609 595356822 594688416 593965352 593256116
2773.8E93256116o59347o59525p09593p35343p82788q73148r40025r21130q83520r48727
$$ 593256116 592596769 591937244 591227651 590492308 589709520 588836372 587896347 586975217 586091697 585142970
2794.2E85142970j050293j064480j025259j038373j124203j239121j309693j322031
$$ 585142970 584092677 583028197 582002938 580964565 579840362 578601241 577291548 575969517
2810.5E75969517j331806j363635j419127j505375j612723j693964j736045j791954
$$ 575969517 574637711 573274076 571854949 570349574 568736851 567042887 565306842 563514888
2826.8E63514888j884103j977026k077341k245367k471149k629339k805114l244877
$$ 563514888 561630785 559653759 557576418 555331051 552859902 550230563 547425449 544180572
2843.1E44180572l823638m093587l697694k801954j970590j503169j330555j326263
$$ 544180572 540356934 536263347 532565653 529763699 527793109 526289940 524959385 523633122
2859.5E23633122j457750j704574j937807k083122k192498k174496j899898j551330
$$ 523633122 522175372 520470798 518532991 516449869 514257371 512082875 510182977 508631647
2875.8E08631647j372099j303137j231253j198292j190185j141727j078606j043498
$$ 508631647 507259548 505956411 504725158 503526866 502336681 501194954 500116348 499072850
2892.1D99072850j004219r13173q02696p61122q07136q81254r74626j213670j655757
$$ 499072850 498068631 497155458 496352762 495591640 494784504 493903250 492928624 491714954 490059197
2910.4D90059197k099991k263516k025664j509428r30637m56840j41144N6774K55435
$$ 490059197 487959206 485695690 483670026 482160598 481229961 480773121 480631977 480688751 480944186
2928.8D80944186N43714P47949P70032Q08776R24855R28134Q11666P52360O94185M60267
$$ 480944186 481487900 482235849 483005881 483814657 484739512 485667646 486479312 487231672 487925857 488386124
2949.2D88386124J49340L099J3322N7012J20610K35796M28408O39886P91490Q88973
$$ 488386124 488535464 488538563 488551885 488608897 488729507 488965303 489393711 490033597 490825087 491714060
2969.6D91714060R14246Q82954Q52286P62046O71625O56187N96554M86522L97593K95878
$$ 491714060 492628306 493511260 494363546 495125592 495797217 496453404 497049958 497536480 497934073 498229951
2990D98229951K38508K83569L09646L06398L03834K89500L45677L93987L09229J97351
$$ 498229951 498468459 498752028 499061674 499368072 499671906 499961406 500307083 500701070 501010299 501207650
3010.4E01207650J93834K66850K82466K04385J14381p987j61171k92420m24505n08785
$$ 501207650 501401484 501668334 501950800 502155185 502269566 502261579 502100408 501807988 501383483 500874698
3030.8E00874698n37693n26011n41330p02083q59290q56370p88540q09133r21309r66012
$$ 500874698 500337005 499810994 499269664 498567581 497708291 496851921 496063381 495254248 494332939 493366927
3051.2D93366927r02027q65340r10402r85354j039862j053244j038283r69887q71718
$$ 493366927 492464900 491599560 490689158 489703804 488663942 487610698 486572415 485602528 484730810
3069.5D84730810q82775j005351j099259j108855j045704r63568r32068r55910j018792
$$ 484730810 483848035 482842684 481743425 480634570 479588866 478625298 477693230 476737320 475718528
3087.9D75718528j031756r55582r26465r98586j111359j149147j077891j074075j190335
$$ 475718528 474686772 473731190 472804725 471806139 470694780 469545633 468467742 467393667 466203332
3106.2D66203332j229823j143545j172125j332343j351773j236439j149595j134425
$$ 466203332 464973509 463829964 462657839 461325496 459973723 458737284 457587689 456453264
3122.6D56453264j208961j310319j367658j392812j400113j420945j500368j538605
$$ 456453264 455244303 453933984 452566326 451173514 449773401 448352456 446852088 445313483
3138.9D45313483j458495j414687j494616j588583j629174j644969j630723j607836
$$ 445313483 443854988 442440301 440945685 439357102 437727928 436082959 434452236 432844400
3155.2D32844400j608342j610666j636714j672804j691252j715332j759530j790791
$$ 432844400 431236058 429625392 427988678 426315874 424624622 422909290 421149760 419358969
3171.5D19358969j765132j747132j779943j809031j814157j813859j834541j830697
$$ 419358969 417593837 415846705 414066762 412257731 410443574 408629715 406795174 404964477
3187.8D04964477j791150j795351j815975j818776j822948j831502j850426j835376
$$ 404964477 403173327 401377976 399562001 397743225 395920277 394088775 392238349 390402973
3204.1C90402973j789511j767903j745641j730532j746267j732379j709372j734227
$$ 390402973 388613462 386845559 385099918 383369386 381623119 379890740 378181368 376447141
3220.5C76447141j756102j754135j755565j741618j741499j741379j687944j654834
$$ 376447141 374691039 372936904 371181339 369439721 367698222 365956843 364268899 362614065
3236.8C62614065j680404j702994j707971j710564j674831j627653j637400j679748
$$ 362614065 360933661 359230667 357522696 355812132 354137301 352509648 350872248 349192500
3253.1C49192500j702458j688897j661450j640677j632244j632481j620979j593649
$$ 349192500 347490042 345801145 344139695 342499018 340866774 339234293 337613314 336019665
3269.4C36019665j559287j525611j504391j475156j442551j436443j444548j432091
$$ 336019665 334460378 332934767 331430376 329955220 328512669 327076226 325631678 324199587
3285.7C24199587j393467j370609j356155j324921j273841j240820j297831j384288
$$ 324199587 322806120 321435511 320079356 318754435 317480594 316239774 314941943 313557655
3302C13557655j413107j403332j361072j314789j339823j403004j465470j551926j588523
$$ 313557655 312144548 310741216 309380144 308065355 306725532 305322528 303857058 302305132 300716609
3320.4C00716609j609355j695961j717478j678437j705200j757860j795977j816869
$$ 300716609 299107254 297411293 295693815 294015378 292310178 290552318 288756341 286939472
3336.7B86939472j776457j723856j725584j715600j662732j627594j596808j582384
$$ 286939472 285163015 283439159 281713575 279997975 278335243 276707649 275110841 273528457
3353B73528457j605243j577169j527428j513749j495034j473844j464695j431942j381278
$$ 273528457 271923214 270346045 268818617 267304868 265809834 264335990 262871295 261439353 260058075
3371.4B60058075j342714j269489j140207j042843j059800j064569r54926q34435p87139
$$ 260058075 258715361 257445872 256305665 255262822 254203022 253138453 252183527 251349092 250561953
3389.7B50561953p48903o74501o41495o22779n78061n50404n37261m93527m02123l37958
$$ 250561953 249813050 249138549 248497054 247874275 247296214 246745810 246208549 245715022 245312899 244974941
3410.1B44974941l21656k36750j32561j04710p2316p972Q5846K04950K84523K94239
$$ 244974941 244653285 244416535 244283974 244179264 244106948 244098976 244184822 244389772 244674295 244968534
3430.5B44968534L76641N42552N82233N40673N94229O99147Q11309R30429R83417J014530
$$ 244968534 245345175 245887727 246469960 247010633 247604862 248304009 249115318 250045747 251029164 252043694
3450.9B52043694J055211J122475J219541J262098J258671J329661J460999J509219
$$ 252043694 253098905 254221380 255440921 256703019 257961690 259291351 260752350 262261569
3467.2B62261569J465768J450032J531839J601935J625597J661450J750678J834631
$$ 262261569 263727337 265177369 266709208 268311143 269936740 271598190 273348868 275183499
3483.6B75183499J832127J810760J855284J927912J934051J952231J995415K028644
$$ 275183499 277015626 278826386 280681670 282609582 284543633 286495864 288491279 290519923
3499.9B90519923K115309K168089K083987K068490K185315K281070K319991K320737
$$ 290519923 292635232 294803321 296887308 298955798 301141113 303422183 305742174 308062911
3516.2C08062911K340078K375782K408773K401143K470136K659917K753078K719999
$$ 308062911 310402989 312778771 315187544 317588687 320058823 322718740 325471818 328191817
3532.5C28191817K757430K834529K813607K812237K899617L077894L195286L141314
$$ 328191817 330949247 333783776 336597383 339409620 342309237 345387131 348582417 351723731
3548.8C51723731L153264L299326L289670L220737L334254L396302L284901L495187
$$ 351723731 354876995 358176321 361465991 364686728 368020982 371417284 374702185 378197372
3565.1C78197372M215151M302830L777563L693730L938675M093796M110694M016757
$$ 378197372 382412523 386715353 390492916 394186646 398125321 402219117 406329811 410346568
3581.5D10346568L883689M153759M846066M801839M157693M186511M479795M440785
$$ 410346568 414230257 418384016 423230082 428031921 432189614 436376125 440855920 445296705
3597.8D45296705M495144M554361M274189M219532M657984M653186M241496L944933
$$ 445296705 449791849 454346210 458620399 462839931 467497915 472151101 476392597 480337530
3614.1D80337530L584326L840893M476816M226267L726155M013180N500436N896926
$$ 480337530 483921856 487762749 492239565 496465832 500191987 504205167 509705603 515602529
3630.4E15602529M451871L990352M036248L944576L844082L414035K878368L152787
$$ 515602529 520054400 524044752 528081000 532025576 535869658 539283693 542162061 545314848
3646.7E45314848M372418M361689K900720K650559L298521L032744K550483K433598
$$ 545314848 549687266 554048955 556949675 559600234 562898755 565931499 568481982 570915580
3663E70915580K061426J845658K423346K456725J798034K432406K487957J409233J089871
$$ 570915580 572977006 574822664 577246010 579702735 581500769 583933175 586421132 587830365 588920236
3681.4E88920236Q43405N14329Q43763J302242P06673p152M2021M88639J119137J826942
$$ 588920236 589763641 590277970 591121733 592423975 593130648 593123496 593165517 593654156 594773293 596600235
3701.8E96600235J905441J516580J581967K237797K660394J794636Q15392O18934P63297
$$ 596600235 598505676 600022256 601604223 603842020 606502414 608297050 609112442 609731376 610494673
3720.1F10494673R12667Q80897O48856K87115J91152N32628R51767J054346L25143
$$ 610494673 611407340 612288237 612937093 613224208 613415360 613947988 614899755 615954101 616279244
3738.5F16279244n22971o6638J085222N44727R4533J089930R35913j26124j26779M33266
$$ 616279244 615756273 615689635 616774857 617319584 617414117 618504047 619439960 619313836 619187057 619620323
3758.9F19620323L74973k4140M8161K38359M44293M63485O259j73092J80066M69803
$$ 619620323 619995296 619971156 620019317 620257676 620701969 621165454 621171713 620998621 621178687 621648490
3779.3F21648490J83464q3626J00851J83642J31071L4809j46270j28150j29700R2209
$$ 621648490 621831954 621748328 621849179 622032821 622163892 622198701 622052431 621924281 621794581 621886790
3799.7F21886790N82933J84119L2544M13180r0063o19114k96652K78890M9293M8161
$$ 621886790 622469723 622653842 622686386 623099566 623009503 622390389 622093737 622372627 622421920 622470081
3820.1F22470081M89890P5102j12951j4424j52349j84656j57475J26541N02646K87115
$$ 622470081 622959971 623035073 622922122 622907698 622755349 622570693 622413218 622539759 623042405 623329520
3840.5F23329520L7790l1174l94523q02755n61118Q99195J445294k03312q69274m51922
$$ 623329520 623367310 623336136 622941613 622138858 621577740 622476935 623922229 623718917 622849643 622397721
3860.9F22397721R8646J64449k15948k4259L65615J56522n1856k71738k06232k146
$$ 622397721 622496367 622660816 622444868 622420609 622786224 622942746 622890890 622619152 622412920 622410774
3881.3F22410774j14560R6738J729l28064M5359J40190l47972m02093o5565J67311
$$ 622410774 622296214 622392952 622394681 622066617 622111976 622252166 621904194 621502101 621436536 621603847
3901.7F21603847L28064K38895j04666j92642j56701k54154j77562O7115J3470j77562
$$ 621603847 621931911 622170806 622066140 621873498 621716797 621462643 621285081 621352196 621365666 621188104
3922.1F21188104o7890O855j79589j54197J07884J09494j15871k22266j91450o9857
$$ 621188104 621120214 621127069 620947480 620793283 620901167 621010661 620894790 620672524 620481074 620411217
3942.5F20411217n1200j20223j9073N7280k325m7803q8513p4029L1233N0843m7922
$$ 620411217 620360017 620239794 620220721 620278001 620275676 620227873 620139360 620065331 620096564 620147407 620099485
3964.9F20099485r2924p6949n0545Q94N066l5524n1498k9862K8073K3842n7041q7261
$$ 620099485 620006561 619929612 619879067 619879961 619885027 619849503 619798005 619768143 619796216 619820058 619763017 619675756
3989.4F19675756l5108K6167J3888l3737
$$ 619675756 619640648 619666815 619680703 619646966
3997.5F19646966
$$ 619646966
##END=$$ End of the data block
