##TITLE=$$ Begin of the data block
##JCAMP-DX=5.00 $$ ACD/SpecManager v 10.08
##SPECTROMETER/DATA SYSTEM=Alpha
##DATE=11 Jun 2014 07:55:32
##DATA TYPE=INFRARED SPECTRUM
##DATA CLASS=XYDATA
##ORIGIN=
##OWNER=
##NPOINTS=1765
##FIRSTX=399.75695801
##LASTX=3997.56933594
##MAXX=3997.56933594
##MINX=399.75695801
##MAXY=0.62715697
##MINY=0.00862418
##XFACTOR=1.0000000000
##YFACTOR=1.000000000000000e-9
##FIRSTY=0.14613184
##DELTAX=2.03957629
##XUNITS=1/CM
##YUNITS=ARBITRARY UNITS
##XYDATA=(X++(Y..Y))
399.8A46131843O679908P252916Q005530Q038893Q196578Q124098P179320O258577
$$ 146131843 152811751 160064667 168070197 176109090 184305668 192429766 199609086 205867663
416.1B05867663P478923R038269P515252O556049O988778O907210O222010N611986
$$ 205867663 213346586 222384855 229900107 236456156 243444934 250352144 256574154 262186140
432.4B62186140N771309O348044O015926N247444N248994N306929M887879M534662
$$ 262186140 267957449 274305493 280321419 285568863 290817857 296124786 301012665 305547327
448.7C05547327M333556L774076K783984K625019L040343K316117J356960J707583
$$ 305547327 309880883 313654959 316438943 319063962 322104305 324420422 325777382 327484965
465C27484965K636940K775073K953142M204839N070984M579962L995359M463523N035997
$$ 327484965 330121905 332896978 335850120 340054959 345125943 349705905 353701264 358164787 363200784
483.4C63200784M303843L542155L873258L835857K855569K390564K798617K645522
$$ 363200784 367504627 371046782 374920040 378755897 381611466 384002030 386800647 389446169
499.7C89446169J705140J501918K110928J904935R80973R77129J588553J240104K92987
$$ 389446169 391151309 392653227 394764155 396669090 397650063 398627192 400215745 401455849 401748836
518.1D01748836L70711J065135Q13306J30921N18769J248598R49800M35353J075178
$$ 401748836 402119547 403184682 403997988 404128909 404647678 405896276 406846076 407281429 408356607
536.4D08356607K075165J886100J311004J636595J969903J431168R07212J197517J360089
$$ 408356607 410431772 412317872 413628876 415265471 417235374 418666542 419573754 420771271 422131360
554.8D22131360O32166K54423R90301J600921J274109R27270J284390J400412P41332
$$ 422131360 422763526 423017949 424008250 425609171 426883280 427810550 429094940 430495352 431236684
573.1D31236684M84556J015038J133024O57648Q40157J652211J660288Q67724P16359
$$ 431236684 431721240 432736278 433869302 434526950 435367107 437019318 438679606 439547330 440263689
591.5D40263689J157343R61840L32654K00450K58148m13060j287312j140743k85387
$$ 440263689 441421032 442382872 442715526 442915976 443174124 442761064 441473752 440333009 440047622
609.8D40047622J73300L35068Q72820J431734J375019J171828J423120J578480J158357
$$ 440047622 440220922 440555990 441428810 442860544 444235563 445407391 446830511 448408991 449567348
628.2D49567348Q45462J274615J976908K059489J704276J685559J692564J230955O30468
$$ 449567348 450412810 451687425 453664333 455723822 457428098 459113657 460806221 462037176 462667644
646.5D62667644L47972L27557O0052m63516o17563m00812m95434q01593q50826q22425
$$ 462667644 463015616 463343173 463403225 462939709 462322146 461921334 461425900 460624307 459773481 458951056
666.9D58951056m36455N2512J41829J90049q4400n79804p43479p78675j284271k119392
$$ 458951056 458514601 458567113 458708942 458898991 458814591 458234787 457491308 456712633 455428362 453308970
687.3D53308970k776534l448128m633785o123274p280439p925690q904606j0905444
$$ 453308970 450532436 447084308 442450523 436327249 429046810 421121120 412216514 401311070
703.7D01311070j2872547j3564706j2626499r995580o888926m985630l613889p1198
$$ 401311070 388438523 374873817 362247318 352251738 345362812 340377182 336763293 336692095
720C36692095O300360J3212353J8538803K1717608K2949606K2025525J8795342J4682501
$$ 336692095 342992455 356204808 374743611 396461219 419410825 441436350 460231692 474914193
736.3D74914193J1326760Q640439N919814L792286K916395K306342J223326O12676
$$ 474914193 486240953 494881392 500801206 504593492 507509887 509816229 511039555 511652231
752.6E11652231Q75533Q47339J44780j86801J94490L05951j85132l63052N7340O1690
$$ 511652231 512527764 513375103 513519883 513333082 513527572 513833523 513648391 513285339 513342679 513404369
773E13404369n78880p21157o1810K71738j53124l93808k08914l87073j007438j253843
$$ 513404369 512825489 512104332 512042522 512314260 512161136 511767328 511558414 511171341 510163903 508910060
793.4E08910060j003027r10878r23217m84347Q0228o4373o95407j032234j145899j581609
$$ 508910060 507907033 506996155 506072938 505588591 505668819 505604446 504909039 503876805 502730906 501149297
813.8E01149297k122641k277821k327293k696067l243447l593504l846795m401624
$$ 501149297 499026656 496748835 494421542 491725475 488482028 484888524 481041729 476640105
830.1D76640105n234748n939692o531239p475167q945972j1080265j4789462j7843664
$$ 476640105 471405357 465465665 458934426 451459259 442513287 431433022 416643560 398799896
846.4C98799896j3878017n455435l754645j0093004j7213017k2211283k6649147l2275915
$$ 398799896 384921879 379466444 375711799 365618795 348405778 326194495 299545348 267269433
862.7B67269433l9982394m8814475n1844404m0373191j9709140l825828N589969J5445113
$$ 267269433 227287039 178472564 126628160 86254969 66545829 62720001 68309970 83755083
879.1H3755083K7759694M0565178N2321285O0007229N8895141M9048871L6554783K6392013
$$ 83755083 111514777 152079955 204401240 264408469 323303610 372352481 408907264 435299277
895.4D35299277J9177795J4170617J0862946Q399964O142735M446626L645867L167569
$$ 435299277 454477072 468647689 479510635 487910599 494053334 498499960 502145827 505313396
911.7E05313396K535820K053082J834274J363992N87941O6876p4625k85149o92963
$$ 505313396 507849216 509902298 511736572 513100564 513688505 513755381 513680756 513395607 512702644
930E12702644q47876o41644o20723r37104j077235r53257j088500j580358j931607
$$ 512702644 511854768 511213124 510592401 509655297 508578062 507624805 506536305 504955947 503024340
948.4E03024340k061367k419800l033876l377349l432542l757208m324705m623323
$$ 503024340 500962973 498543173 495509297 492131948 488699406 484942198 480617493 475994170
964.7D75994170m720152n122512n776435o246239o617099p279784q063674q490175
$$ 475994170 471274018 466151506 460375071 454128832 447511733 440231949 432168275 423678100
981D23678100q592546q698702q714765q350134p824123p495552p229000o791682o386518
$$ 423678100 415085554 406386852 397672087 389321953 381497830 374002278 366773278 359981596 353595078
999.4C53595078o269753o335467o339401o243736o114065n854249n426258m952371
$$ 353595078 347325325 340989858 334650457 328406721 322292656 316438407 311012149 306059778
1015.7C06059778m459590l860265l195912k605021k134323j689255j171559o03259
$$ 306059778 301600188 297739923 294544011 291938990 289804667 288115412 286943853 286340594
1032B86340594o0528K78860K50816r1373n16057q14289r07660q39591n71042M1544
$$ 286340594 286280066 286558926 286809742 286718369 286202312 285388023 284480363 283640772 283069730 283111274
1052.4B83111274Q46535J531065K018481K282500K148659J563936N91636o63191j962871
$$ 283111274 283957809 285488874 287507355 289789855 291938514 293502450 294094086 293430895 291468024
1070.8B91468024l045559l688663l809512l576815l028869j837433j81824J378089
$$ 291468024 288422465 284733802 280924290 277347475 274318606 272481173 272299349 273677438
1087.1B73677438K802194L993511M422873L822327K592385J412689O85603M76241P10577
$$ 273677438 276479632 280473143 284896016 288718343 291310728 292723417 293409020 293885261 294595838
1105.4B94595838J181662J619786J845151J803368J530260J065433N65231K68280J54615
$$ 294595838 295777500 297397286 299242437 301045805 302576065 303641498 304206729 304475009 304629624
1123.8C04629624k2709l00169n16534p09534j040131j469731j829177k017469k022028
$$ 304629624 304606915 304306746 303790212 303080678 302040547 300570816 298741639 296724170 294702142
1142.2B94702142j827418j429797r72151o42389m71861l19033q0318K16514N86122
$$ 294702142 292874724 291444927 290472776 289830387 289358526 289039493 288959175 289175689 289761811
1160.5B89761811J068891J541227J738906J587480J338571J195848J089156R48220
$$ 289761811 290830702 292371929 294110835 295698315 297036886 298232734 299321890 300270110
1176.8C00270110Q20607O29634K08884m07755r73791j380056j780480k193868k378732
$$ 300270110 301090717 301720351 301929235 301521480 300547689 299167633 297387153 295193285 292814553
1195.2B92814553k325177k288998k281218k175868k044529k051800k216816k416015
$$ 292814553 290489376 288200378 285919160 283743292 281698763 279646963 277430147 275014132
1211.5B75014132k615034k864331l081888l160894l188431l270716l349751l302992
$$ 275014132 272399098 269534767 266452879 263291985 260103554 256832838 253483087 250180095
1227.8B50180095l189250l151969l149181l068522k989918l034830l097549l063410
$$ 250180095 246990845 243838876 240689695 237621173 234631255 231596425 228498876 225435466
1244.1B25435466k979041k965733l024086l055513l047705l076881l139109l146782
$$ 225435466 222456425 219490692 216466606 213411093 210363388 207286507 204147398 201000616
1260.4B01000616l115952l131807l198743l216505l211662l247023l311932l371060
$$ 201000616 197884664 194752857 191554114 188337609 185125947 181878924 178566992 175195932
1276.8A75195932l398686l432498l477141l502592l512130l555759l613443l654360
$$ 175195932 171797246 168364748 164887607 161385015 157872885 154317126 150703683 147049323
1293.1A47049323l669948l679186l673047l640204l626406l630326l605939l528223
$$ 147049323 143379375 139700189 136027142 132386938 128760532 125130206 121524267 117996044
1309.4A17996044l464207l390520l293202l268502l284522l242463l239028l302291
$$ 117996044 114531837 111141317 107848115 104579613 101295091 98052628 94813600 91511309
1325.7I1511309l311269l275826l179364l017202k954036l108077l216222l051646
$$ 91511309 88200040 84924214 81744850 78727648 75773612 72665535 69449313 66397667
1342F6397667k876617k852976k860524k824608k746325k648652k538998k439189k422735
$$ 66397667 63521050 60668074 57807550 54982942 52236617 49587965 47048967 44609778 42187043
1360.4D2187043k441191k304047k095949k034899j972086j903538j856588j689853
$$ 42187043 39745852 37441805 35345856 33310957 31338871 29435333 27578745 25888892
1376.7B5888892j547473j483176j403661j326103j310374j224026j054526j010895
$$ 25888892 24341419 22858243 21454582 20128479 18818105 17594079 16539553 15528658
1393A5528658j033322r58704q97922q17859p05306o44194n36989m31032l47988k41998
$$ 15528658 14495336 13536632 12638710 11820851 11115545 10471351 9934362 9503330 9155342 8913344
1413.4H913344j61271j27891K408J62934K18115K50640K66815K92599L11104L02070
$$ 8913344 8752073 8624182 8626590 8789524 9007639 9258279 9525094 9817693 10128797 10430867
1433.8A0430867L10214L69923L42987K62291J97634J82224K10505K05474J76470J27350
$$ 10430867 10741081 11111004 11453991 11716282 11913916 12096140 12306645 12512119 12688589 12815939
1454.2A2815939J31980K40498K80587K22125K15077K83921L12473L10879M29610N82343
$$ 12815939 12947919 13188417 13469004 13691129 13906206 14190127 14502600 14813479 15243089 15825432
1474.6A5825432N73905N62310N94204O66168P14738P61840Q81266J043646J052855
$$ 15825432 16399337 16961647 17555851 18222019 18936757 19698597 20579863 21623509 22676364
1493B2676364J080423J321679J453813J366102J169528J272222J885072J885399J595475
$$ 22676364 23756787 25078466 26532279 27898381 29067909 30340131 32225203 34110602 35706077
1511.3C5706077J585830J657791J729667J749069J974158K035685J875665J951475
$$ 35706077 37291907 38949698 40679365 42428434 44402592 46438277 48313942 50265417
1527.6E0265417J846104J863122K170708J971253J743409K432231K883304K550893
$$ 50265417 52111521 53974643 56145351 58116604 59860013 62292244 65175548 67726441
1543.9F7726441K515599K552695K789475L008523L124743L113367M267171N687050
$$ 67726441 70242040 72794735 75584210 78592733 81717476 84830843 89098014 94785064
1560.3I4785064M194640L700696M032843M320785M587464L862940L525056M234776
$$ 94785064 98979704 102680400 106713243 111034028 115621492 119484432 123009488 127244264
1576.6A27244264L912881L242150L196403L169388L041163K885491K728894K570644
$$ 127244264 131157145 134399295 137595698 140765086 143806249 146691740 149420634 151991278
1592.9A51991278K431720K268896K135143K067744K006337J865298J728281J646892
$$ 151991278 154422998 156691894 158827037 160894781 162901118 164766416 166494697 168141589
1609.2A68141589J502543J250431J180783J389340J263037J081377J187429J233101
$$ 168141589 169644132 170894563 172075346 173464686 174727723 175809100 176996529 178229630
1625.5A78229630J185611J171812J068443J153186J671285J846969J642808J667813
$$ 178229630 179415241 180587053 181655496 182808682 184479967 186326936 187969744 189637557
1641.8A89637557J757472K176300K551556K028897K340630L672659L019229K409890
$$ 189637557 191395029 193571329 196122885 198151782 200492412 204165071 207184300 209594190
1658.2B09594190K643615L124058L299743K915666L114015L671899L361091L420636
$$ 209594190 212237805 215361863 218661606 221577272 224691287 228363186 231724277 235144913
1674.5B35144913L777623L352180K974913L359854M577518M252970L484994L647238
$$ 235144913 238922536 242274716 245249629 248609483 253187001 257439971 260924965 264572203
1690.8B64572203L463179L717154M133284M222751M970223M239589L627538L954262
$$ 264572203 268035382 271752536 275885820 280108571 285078794 289318383 292945921 296900183
1707.1B96900183L682643L272623L028065L062963L686995L726899K973259K783924
$$ 296900183 300582826 303855449 306883514 309946477 313633472 317360371 320333630 323117554
1723.4C23117554K879203K717346K557188K470821L067791L305287K522409K518802
$$ 323117554 325996757 328714103 331271291 333742112 336809903 340115190 342637599 345156401
1739.7C45156401K742201K559096K436847K488672K814651K974391K539933K356290
$$ 345156401 347898602 350457698 352894545 355383217 358197868 361172259 363712192 366068482
1756.1C66068482K414823K292007K380133K238482J907706J803249J696110J757920
$$ 366068482 368483305 370775312 373155445 375393927 377301633 379104882 380800992 382558912
1772.4C82558912J582265Q92132K33323l02106q25644j476496k106816k489924k818615
$$ 382558912 384141177 385033309 385266632 384964526 384138882 382662386 380555570 378065646 375247031
1790.7C75247031k861619k329647j790613j238674l57300O01769J405328K194077L054112
$$ 375247031 372385412 370055765 368265152 367026478 366669178 367270947 368676275 370870352 373924464
1809.1C73924464L884852M374415M625082M899919M960417M679948M487485M439026
$$ 373924464 377809316 382183731 386808813 391708732 396669149 401349097 405836582 410275608
1825.4D10275608L997743L792435L774047L275872K895027K759069K485186K190441
$$ 410275608 414273351 418065786 421839833 425115705 428010732 430769801 433254987 435445428
1841.7D35445428K358228K544194K279431K118558K024322J870335J852273J893163
$$ 435445428 437803656 440347850 442627281 444745839 446770161 448640496 450492769 452385932
1858D52385932J841992J720846J581818J499057J658529J857787J748562J640916J587629
$$ 452385932 454227924 455948770 457530588 459029645 460688174 462545961 464294523 465935439 467523068
1876.4D67523068J508057J505256J536667J477331J346708J392841J520097J409561
$$ 467523068 469031125 470536381 472073048 473550379 474897087 476289928 477810025 479219586
1892.7D79219586J303434J396924J447618J378238J269043J265466J308888J262218
$$ 479219586 480523020 481919944 483367562 484745800 486014843 487280309 488589197 489851415
1909D89851415J223207J217723J175999J160115J207859J195609J241982J217276J061469
$$ 489851415 491074622 492292345 493468344 494628459 495836318 497031927 498273909 499491185 500552654
1927.4E00552654J046539J104653J082420J008630J015961J013040R77636J016080
$$ 500552654 501599193 502703846 503786266 504794896 505810857 506823897 507801533 508817613
1943.7E08817613J070559J055658R64642Q90493Q96633Q88407P88569P44939Q09491
$$ 508817613 509888172 510943830 511908472 512798965 513695598 514584005 515372574 516117513 516927004
1962.1E16927004Q53240Q45194R04381J002551J047074J008988R17733R03248R22263
$$ 516927004 517780244 518625438 519529819 520532370 521579444 522588432 523506165 524409413 525331676
1980.4E25331676Q58486P78377Q21531Q53121P93099P90060Q39591Q52465Q03531P20501
$$ 525331676 526190162 526968539 527790070 528643191 529436290 530226350 531065941 531918406 532721937 533442438
2000.8E33442438P08103P75993P50303O86467P18534P64310P26521O80327P09355P41721
$$ 533442438 534150541 534926534 535676837 536363304 537081838 537846148 538572669 539252996 539962351 540704072
2021.2E40704072O99162O20961O36399P06136P03514O31869O22749O80447O73353O31512
$$ 540704072 541403234 542024195 542660594 543366730 544070244 544702113 545324862 546005309 546678662 547310174
2041.6E47310174O60300P20143O93381O43492O65128P04527O71446O18398O26445O53684
$$ 547310174 547970474 548690617 549383998 550027490 550692618 551397145 552068591 552686989 553313434 553967118
2062E53967118O47128O09457O18577O71864O53923N77270N95749O76334O61194N72205
$$ 553967118 554614246 555223703 555842280 556514144 557168067 557745337 558341086 559017420 559678614 560250819
2082.4E60250819N78940O52969O06894N25773N45859N90503N39839M64917M81546N43654
$$ 560250819 560829759 561482728 562089622 562615395 563161254 563751757 564291596 564756513 565238059 565781713
2102.8E65781713N43653M59612M23193M56095M39465L85523M14490M73976M18663L27468
$$ 565781713 566325366 566784978 567208171 567664266 568103731 568489254 568903744 569377720 569796383 570123851
2123.2E70123851L58999M39346M17173L47435L59476M35233M18901L32833L50892M45545
$$ 570123851 570482850 570922196 571339369 571686804 572046280 572481513 572900414 573233247 573584139 574029684
2143.6E74029684M60088L93093M08411N31673N72861M92990M81546N72562O09338N37634
$$ 574029684 574489772 574882865 575291276 575822949 576395810 576888800 577370346 577942908 578552246 579089880
2164E79089880N28574O33538O56545N94914N98729O70552O61790N74172N92947P09057
$$ 579089880 579618454 580251992 580908537 581503451 582102180 582772732 583434522 584008694 584601641 585310698
2184.4E85310698P09414N92113N53608N99682O09457N51701N24223N64933N58495M53830
$$ 585310698 586020112 586612225 587165833 587765515 588374972 588926673 589450896 590015829 590574324 591028154
2204.8E91028154M08828N12183N68271M82738M36186N19276N40853M30166L85225M74453
$$ 591028154 591436982 591949165 592517436 593000174 593436360 593955636 594496489 594926655 595311880 595786333
2225.2E95786333N16117M42147M11153M72307M97222M50730M52519N12004N10037M13894
$$ 595786333 596302450 596744597 597155750 597628057 598125279 598576009 599028528 599540532 600050569 600464463
2245.6F00464463L75927M63962N23627M56929L83973M42505M96984M29451L76344M56512
$$ 600464463 600840390 601304352 601827979 602284908 602668881 603111386 603608370 604037821 604414165 604870677
2265.9F04870677N40137M68672L84509M66705N40614M18365L32355M16935M35292K95699
$$ 604870677 605410814 605879486 606263995 606730700 607271314 607689679 608022034 608438969 608874261 609169960
2286.3F09169960K14219K92003L28779K21491J56582K38061K57373R9301r835O4671
$$ 609169960 609384179 609676182 610004961 610226452 610383034 610621095 610878468 610977769 610967934 611032605
2306.7F11032605R0122M292L0279J02043j2576k28584k43068J2517J93894Q3923K5690
$$ 611032605 611122727 611127019 611157298 611259341 611246765 611018181 610775113 610787630 610981524 611065447 611091137
2329.2F11091137K33173L63767K50936J51277K10046L63291O52790J061797Q34942
$$ 611091137 611324310 611688077 611939013 612090290 612300336 612663627 613316417 614378214 615213156
2347.5F15213156j18613q48949q26300l70919m5240J75953N18798Q10862R12249J000762
$$ 615213156 615094543 614245594 613419294 613048375 613003135 613179088 613697886 614508748 615420997 616421759
2367.9F16421759J159787J243413J160919J057685J056790J021981Q12829N61714M17531
$$ 616421759 617581546 618824959 619985878 621043563 622100353 623122334 623935163 624496877 624914408
2386.3F24914408L47197K56121J58787J62065K38478K27809J34885J08361J52111J35899
$$ 624914408 625261605 625517726 625676513 625838578 626077056 626304865 626439750 626548111 626700222 626836121
2406.7F26836121M4406K6464R9778J18256K8014k2411K6345l219j09613j19090n9783
$$ 626836121 626880527 626906991 627006769 627125025 627153039 627130628 627156973 627153754 627044141 626925051 626865268
2429.1F26865268j16349k57611k70963k01821k49982l84569m46677m40776n10693o74844
$$ 626865268 626748919 626491308 626220345 626018524 625768542 625383973 624937296 624496520 623985827 623310983
2449.5F23310983p75695p89344q73864j055002j201749j315355j497448j707851j856387
$$ 623310983 622535288 621745944 620872080 619817078 618615329 617299974 615802526 614094675 612238288
2467.9F12238288j994491k251148k562463k763868k915442l160417l429234l595829
$$ 612238288 610243797 607992649 605430186 602666318 599750876 596590459 593161225 589565396
2484.2E89565396l685116l774941l825188l735781l546476l317535l062487k815425
$$ 589565396 585880280 582105339 578280151 574544370 570997894 567680359 564617872 561802447
2500.5E61802447k611876k474844k397239k323628k217769k138794k049506j850664
$$ 561802447 559190571 556715727 554318488 551994860 549777091 547638297 545588791 543738127
2516.8E43738127j570463j262248q97884m47274K0504M52876Q77262J318037J743138
$$ 543738127 542167664 540905416 540007532 539560258 539580762 540033638 540910900 542228937 543972075
2535.2E43972075K073526K310038K527356K721787K843737K864421K791285K662301
$$ 543972075 546045601 548355639 550882995 553604782 556448519 559312940 562104225 564766526
2551.5E64766526K498150K313078K128183J954675J759589J551747J391292J241565
$$ 564766526 567264676 569577754 571705937 573660612 575420201 576971948 578363240 579604805
2567.8E79604805J064002R01222P76351O80864O12616N45800M67002M18544L88265
$$ 579604805 580668807 581570029 582346380 583027244 583639860 584185660 584652662 585071206 585459471
2586.2E85459471L25441K66910K60651K97010L19600L21746L58104L87311M11988M89413
$$ 585459471 585784912 586051822 586312473 586609483 586929083 587250829 587608933 587996244 588408232 588897645
2606.6E88897645N81444O69837P56204Q26001R05037J005411J096547J162052J191854
$$ 588897645 589479089 590148926 590905130 591731131 592636168 593641579 594738126 595900178 597092032
2624.9E97092032J204610J236022J257658J254082J241624J199424J130700J092017
$$ 597092032 598296642 599532664 600790322 602044404 603286028 604485452 605616152 606708169
2641.2F06708169J097620J057684R41515Q33750P28607O06358N08785M12107L19719
$$ 606708169 607805789 608863473 609804988 610638738 611367345 611973703 612482488 612894595 613214314
2659.6F13214314K48611J38104J2040k8312k4140n5552j13725j47283j36137j44363
$$ 613214314 613462925 613601029 613613069 613584757 613560617 613505065 613391340 613244057 613107920 612963557
2680F12963557j67727j58012j83106k56002k73585k44796k44975k61903k61366k53201
$$ 612963557 612795830 612637818 612454712 612198710 611925125 611680329 611435354 611173451 610912085 610658884
2700.4F10658884k77877l44395l83556l62575l46482l56794l63648l48269l62933m45604
$$ 610658884 610381007 610036612 609653056 609290481 608943999 608587205 608223557 607875288 607512355 607066751
2720.8F07066751m87447m37439l59237l56078m45068m77612m19974l95656m02808l98100
$$ 607066751 606579304 606141865 605782628 605426550 604981482 604503870 604083896 603688240 603285432 602887332
2741.2F02887332m16994m56452n06341n07534m60029m57704m83334n06520n31852n51284
$$ 602887332 602470338 602013886 601507545 601000011 600539982 600082278 599598944 599092424 598560572 598009288
2761.6E98009288n57482n54681n84543o55233p13289p06792o41108o21616o79434p34448
$$ 598009288 597451806 596897125 596312582 595657349 594944060 594237268 593596160 592974544 592295110 591560662
2782E91560662p94351q97706r59635r13262q88348r76979j059652j034260j010060
$$ 591560662 590766311 589868605 588908970 587995708 587107360 586130381 585070729 584036469 583026409
2800.3E83026409j079440j150370j194894j257121j321376j347244j370370j446426
$$ 583026409 581946969 580796599 579601705 578344584 577023208 575675964 574305594 572859168
2816.6E72859168j530230j588881j656115j726687j803935j909375k007961k097964
$$ 572859168 571328938 569740057 568083942 566357255 564553320 562643945 560635984 558538020
2832.9E58538020k236128k450705k634287k820432l234565l800511m101098l714860
$$ 558538020 556301892 553851187 551216900 548396468 545161903 541361392 537260294 533545434
2849.3E33545434k782702j943946j521766j394510j377166j447796j673937j950205
$$ 533545434 530762732 528818786 527297020 525902510 524525344 523077548 521403611 519453406
2865.6E19453406k124786k218068k188086j903653j523078j339793j308262j257897
$$ 519453406 517328620 515110552 512922466 511018813 509495735 508155942 506847680 505589783
2881.9E05589783j210272j174450j110613j048148j016021r99123r28461q07166p72149
$$ 505589783 504379511 503205061 502094448 501046300 500030279 499031156 498102695 497295529 496523380
2900.2D96523380q20040q57711r37909j194239j661688k100676k203882j965612j542539
$$ 496523380 495703340 494845629 493907720 492713481 491051793 488951117 486747235 484781623 483239084
2918.6D83239084j002490m95732j57416N9724K63453N42223P58916Q04991Q59618R67473
$$ 483239084 482236594 481740862 481583446 481643170 481906623 482448846 483207762 484012753 484872371 485839844
2939D85839844R43482P94053P01427O41614M60923K10315O4016K1904J7703R0867K67983
$$ 485839844 486783326 487577379 488278806 488920420 489381343 489591658 489655674 489677578 489695281 489786148 490054131
2961.4D90054131M88966O68645Q00550R05931R18329Q68171Q55685P86990O62714O20752
$$ 490054131 490543097 491211742 492012292 492918223 493836552 494704723 495560408 496347398 497010112 497630864
2981.8D97630864O02305N25713M40240L25769K30551K55108K96950L26932L54826L35515
$$ 497630864 498233169 498758882 499199122 499524891 499755442 500010550 500307500 500634432 500989258 501324773
3002.2E01324773L36528L45289K92719K39014K52247K96116L01659K40982J28746n0366
$$ 501324773 501661301 502006590 502299309 502538323 502790570 503086686 503388345 503629327 503758073 503707707
3022.6E03707707k11358k81453l91484n04911n12719m82678n32746p07627q59678q62807
$$ 503707707 503496349 503214896 502823412 502318501 501805782 501323104 500790358 500082731 499223053 498360246
3043D98360246p96675q06719r02683r37104q82626q59975r00299r67681j015693j030266
$$ 498360246 497563571 496756852 495854169 494917065 494034439 493174464 492274165 491306484 490290791 489260525
3063.4D89260525j029939r64016q75652r07391j015514j061916j026273r67503r62764
$$ 489260525 488230586 487266570 486390918 485483527 484468013 483406097 482379824 481412321 480449557
3081.8D80449557r93550r71168r62049j003772r85622r48429j019389j131892j120805
$$ 480449557 479456007 478484839 477522790 476519018 475533396 474584967 473565578 472433686 471312881
3100.1D71312881j038701j066953j186818j212716j128852j155287j298189j346231
$$ 471312881 470274180 469207227 468020409 466807693 465678841 464523554 463225365 461879134
3116.4D61879134j275897j176506j134724j213342j325726j361430j356303j376301
$$ 461879134 460603237 459426731 458292007 457078665 455752939 454391509 453035206 451658905
3132.8D51658905j400382j460910j551568j512766j423061j476645j575202j623303
$$ 451658905 450258523 448797613 447246045 445733279 444310218 442833573 441258371 439635068
3149.1D39635068j661151j642764j573831j570284j619757j626700j637667j709491
$$ 439635068 437973917 436331153 434757322 433187038 431567281 429940581 428302914 426593423
3165.4D26593423j749367j756608j797676j820147j797974j759202j737624j756907
$$ 426593423 424844056 423087448 421289772 419469625 417671651 415912449 414174825 412417918
3181.7D12417918j829594j902819j882523j820683j802296j804679j792372j791715
$$ 412417918 410588324 408685505 406802982 404982299 403180003 401375324 399582952 397791237
3198C97791237j824946j845419j836359j809180j770467j753867j761019j756310j759559
$$ 397791237 395966291 394120872 392284513 390475333 388704866 386950999 385189980 383433670 381674111
3216.4C81674111j790553j784593j740724j730383j756876j769096j771182j757204
$$ 381674111 379883558 378098965 376358241 374627858 372870982 371101886 369330704 367573500
3232.7C67573500j698107j676798j715451j731068j732320j722008j662880j623541
$$ 367573500 365875393 364198595 362483144 360752076 359019756 357297748 355634868 354011327
3249C54011327j657337j722664j734942j664877j637727j681834j682162j641244j623422
$$ 354011327 352353990 350631326 348896384 347231507 345593780 343911946 342229784 340588540 338965118
3267.4C38965118j618475j595169j556575j516730j471460j428962j424998j452088
$$ 338965118 337346643 335751474 334194899 332678169 331206709 329777747 328352749 326900661
3283.7C26900661j444310j393408j368641j367987j356691j358926j353621j343251
$$ 326900661 325456351 324062943 322694302 321326315 319969624 318610698 317257077 315913826
3300C15913826j368522j410991j421392j382947j363963j417667j508385j541465j543075
$$ 315913826 314545304 313134313 311712921 310329974 308966011 307548344 306039959 304498494 302955419
3318.4C02955419j614452j695305j719325j716167j718194j758575j847535j879394
$$ 302955419 301340967 299645662 297926337 296210170 294491976 292733401 290885866 289006472
3334.7B89006472j824499j804888j824647j802623j750976j712710j692712j695991
$$ 289006472 287181973 285377085 283552438 281749815 279998839 278286129 276593417 274897426
3351B74897426j695811j680017j670331j657843j628340j586467j538813j497507j459300
$$ 274897426 273201615 271521598 269851267 268193424 266565084 264978617 263439804 261942297 260482997
3369.3B60482997j412601j390785j377284j278967j145869j108945j094162j037777
$$ 260482997 259070396 257679611 256302327 255023360 253877491 252768546 251674384 250636607
3385.7B50636607r53361q30486p35179p02217p08208p15911o53923n38110m96209n29125
$$ 250636607 249683246 248852760 248117581 247415364 246707156 245991245 245337322 244799212 244303003 243773878
3406.1B43773878n11617l96117k89247k57656k22608j40608o2719k4959M3943J77682
$$ 243773878 243262261 242866144 242576897 242319241 242096633 241956025 241893306 241868347 241912290 242089972
3426.5B42089972K53022K50980L75211N50270N80833N59836O12542P10249Q15004R31964
$$ 242089972 242342994 242593974 242969185 243519455 244100288 244660124 245272666 245982915 246797919 247729883
3446.8B47729883R58219R79483J103848J209796J273036J330763J326859J342803J444280
$$ 247729883 248688102 249667585 250771433 251981229 253254265 254585028 255911887 257254690 258698970
3465.2B58698970J508474J507193J506657J556933J603901J644194J730621J824677
$$ 258698970 260207444 261714637 263221294 264778227 266382128 268026322 269756943 271581620
3481.5B71581620J832485J834512J896769J933306J946777J932949J953185K000063
$$ 271581620 273414105 275248617 277145386 279078692 281025469 282958418 284911603 286911666
3497.8B86911666K031416K101243K173751K175153K201616K255023K277762K319842
$$ 286911666 288943082 291044325 293218076 295393229 297594845 299849868 302127630 304447472
3514.2C04447472K350330K382905K412319K459735K507358K549678K652914K768367
$$ 304447472 306797802 309180707 311593026 314052761 316560119 319109797 321762711 324531078
3530.5C24531078K795101K787381K819389K827972K822131K895951L128738L268808
$$ 324531078 327326179 330113560 332932949 335760921 338583052 341479003 344607741 347876549
3546.8C47876549L158569L162891L370195L403098L318846L372043L429056L380119
$$ 347876549 351035118 354198009 357568204 360971302 364290148 367662191 371091247 374471366
3563.1C74471366L570021M213929M318505L837109L765732M016340M164278M179836
$$ 374471366 378041387 382255316 386573821 390410930 394176662 398193002 402357280 406537116
3579.4D06537116M097908L978938M268944M983247M921019M232108M262954M584998
$$ 406537116 410635024 414613962 418882906 423866153 428787172 433019280 437282234 441867232
3595.7D41867232M553348M597157M647702M365832M301161M739791M733801M302084
$$ 441867232 446420580 451017737 455665439 460031271 464332432 469072223 473806024 478108108
3612.1D78108108M005879L631711L850311M497230M282028L799170M115343N639136
$$ 478108108 482113987 485745698 489596009 494093239 498375267 502174437 506289780 511928916
3628.4E11928916O003022M457236L957808M041016L974199L837526L354072K824664
$$ 511928916 517931938 522389174 526346982 530387998 534362197 538199723 541553795 544378459
3644.7E44378459L143132M393757M411935K913654K619088L314376L066718K537251
$$ 544378459 547521591 551915348 556327283 559240937 561860025 565174401 568241119 570778370
3661E70778370K407491K028227J810908K433420K524435J816809K307117K365947J415551
$$ 570778370 573185861 575214088 577024996 579458416 581982851 583799660 586106777 588472724 589888275
3679.4E89888275J138031Q70824N05984Q30114J277268O60300L1531J59502N31435
$$ 589888275 591026306 591897130 592403114 593233228 594510496 595170796 595202327 595361829 595893264
3697.7E95893264J072883J822353J914918J474381J533270K208352K678215J857341
$$ 595893264 596966147 598788500 600703418 602177799 603711069 605919421 608597636 610454977
3714F10454977Q39889O00338P71582R12308Q18313O32464L58165K19285M87685R57013
$$ 610454977 611294866 611895204 612666786 613579094 614397407 615029871 615388036 615607321 616095006 617052019
3734.4F17052019J073658K88367n27799o4432J078724O03498J14023R78410Q54433
$$ 617052019 618125677 618414044 617886245 617821813 618900537 619504035 619618058 620596468 621450901
3752.8F21450901p7426q7798M32908M14074j371j4663J51813M24505M94361K9027j87099
$$ 621450901 621373475 621285677 621718585 622132659 622131288 622116625 622268438 622692943 623187304 623216331 623029232
3775.2F23029232J55926M50313J44839r2625J46269K23697J12414j0550j56880j14142
$$ 623029232 623185158 623635471 623780310 623687685 623833954 624057651 624170065 624159515 624002635 623888493
3795.6F23888493j34886O7830N79417K07543K3485L63528q2790n51582k64942K45153
$$ 623888493 623753607 623821437 624400854 624608397 624631882 624995410 624912620 624361038 624096096 624341249
3816F24341249L1412P9930M95076N5432q8453L2127j69992k63513j90615J77324N56171
$$ 624341249 624372661 624452591 624947667 625003099 624914646 624946773 624776781 624513268 624322653 624499977 625056148
3838.4F25056148K64883k0981n0605l73542p86781n91397Q16941J420736j29759p94769
$$ 625056148 625321031 625300050 625249445 624875903 624089122 623497725 624314666 625735402 625605643 624810874
3858.8F24810874m30405J00375J76072k15650k4497L31401P7665r1374k72274k11537
$$ 624810874 624380469 624480844 624656916 624441266 624416769 624748170 624825835 624734461 624462187 624250650
3879.2F24250650K1339p1645Q9705j6570k61724J53303J52648m39644n02587j33395
$$ 624250650 624271989 624200344 624290049 624273479 624011755 624165058 624317706 623878062 623375475 623242080
3899.6F23242080J34051L91722L76105k5093k25783k29359k42888j24693L9458l5882
$$ 623242080 623376131 623767853 624143958 624118865 623893082 623663723 623420835 623296142 623335600 623299718
3920F23299718j69993o3955j1266j65701j32441O2942M8340r2030j77979k08140r6142
$$ 623299718 623129725 623065770 623054504 622888803 622756362 622819304 622867644 622775614 622597635 622389495 622293353
3942.5F22293353k4855o1750L1054P6890q4341j98126r5069M3750P3611O6281J4662
$$ 622293353 622268498 622206748 622237802 622314692 622230351 622032225 621937156 621980906 622054517 622120798 622135460
3964.9F22135460o9797j03473j01567r0181k5452L9995K4140l1650m5002O676J609
$$ 622135460 622065663 621962190 621860623 621770442 621744990 621784985 621809125 621777475 621732473 621739149 621740758
3987.3F21740758p7664m7744O1572O1452q464
$$ 621740758 621663094 621615350 621676922 621738374 621729910
3997.5F21729910
$$ 621729910
##END=$$ End of the data block
