##TITLE=$$ Begin of the data block
##JCAMP-DX=5.00 $$ ACD/SpecManager v 10.08
##SPECTROMETER/DATA SYSTEM=Alpha
##DATE=11 Jun 2014 19:36:16
##DATA TYPE=INFRARED SPECTRUM
##DATA CLASS=XYDATA
##ORIGIN=
##OWNER=
##NPOINTS=1765
##FIRSTX=399.75695801
##LASTX=3997.56933594
##MAXX=3997.56933594
##MINX=399.75695801
##MAXY=0.69515526
##MINY=0.11326305
##XFACTOR=1.0000000000
##YFACTOR=1.000000000000000e-9
##FIRSTY=0.42285457
##DELTAX=2.03957629
##XUNITS=1/CM
##YUNITS=ARBITRARY UNITS
##XYDATA=(X++(Y..Y))
399.8D22854573Q627116Q378566Q965939Q519381P644802P888586P922619O622553
416.1D87424135O750614P575065N479812M312217N324722N436361M263997M133165
432.4E30700088M752695M139125L473461M044473M063726K745688K352416K912581
448.7E59184253K338469J457334J851022K005637O72757M08650J452565J158059L48150
467.1E70876896J287461K433836K018809K245307L698409L437579K144038K813101
483.4E90955436L546119K078772J316309K566099K573907J012683J305819K506494
499.7F07861638J275003j33336J190842J803100K3603l12626J220882Q84473n58078
518.1F13255501L70741J491427J52946n70357J049995J300574l36171p3075J640618
$$ y = [422854573, 431481689, 439860255, 448826194, 457345575, 464990377, 472878963, 480801582, 487424135, 494174749, 501749814, 507229626, 511541843, 516866565, 522302926, 526566923, 530700088, 535452783, 539591908, 543065369, 547109842, 551173568, 553919256, 556271672, 559184253, 561522722, 562980056, 564831078, 566836715, 567509472, 567918122, 569370687, 570528746, 570876896, 572164357, 574598193, 576617002, 578862309, 582560718, 585998297, 588142335, 590955436, 594501555, 596580327, 597896636, 600462735, 603036642, 604049325, 605355144, 607861638, 609136641, 609003305, 610194147, 611997247, 612020850, 611708224, 612929106, 613813579, 613255501, 613626242, 615117669, 615270615, 614700258, 615750253, 617050827, 616714656, 616641581, 618282199]
536.4F18282199J172841j08779R44197K085746Q43286J40011J484990J374603l76225
554.8F25842869Q822J531601P57813k73347J208663K169132M36783l42607J166224
573.1F32505953J188994l63529K84135J773954O02960n83946R77397J799106M4823
591.5F38229847m59731J183808R54151q72552m76480N08488j001656k069772k53200
609.8F35742903Q15272n99921p42137J132011J231313j4603Q15749J981855O07073
628.2F40969515m00424J317739K153755N41389L49879J904189J368285l69192K45452
646.5F48080587J278699j26839j100242K66135N58138j087249r72151P20977R9421
664.9F47717476k579868j526713J898586N46098q44180M41014J002372o06120q40068
$$ y = [618282199, 619455040, 619346261, 620290458, 622376204, 623219490, 623359501, 624844491, 626219094, 625842869, 625851691, 627383292, 628141105, 627867758, 629076421, 631245553, 631682336, 631339729, 632505953, 633694947, 633331418, 633615553, 635389507, 635992467, 635408521, 636385918, 638185024, 638229847, 637770116, 638953924, 639908075, 639035523, 638559043, 639067531, 638065875, 635996103, 635742903, 636558175, 635958254, 635216117, 636348128, 637579441, 637564838, 638380587, 640362442, 640969515, 640569091, 641886830, 644040585, 644581974, 644931853, 646836042, 648204327, 647835135, 648080587, 649359286, 649232447, 648132205, 648398340, 648956478, 647869229, 646897078, 647618055, 647717476, 645137608, 643610895, 645509481, 646055579, 645211399, 645652413, 646654785, 646048665, 645208597]
683.3F45208597M30763m20332k331376j917422j282096l172993m922748m572928n106092
701.6F21913373p724106r256542q902013q889198q594990o418645m088343k727866
717.9E65311670O06656P017374J2418449J4572859J5559614J5903652J3600409R721994
734.2F54712677P594049O461501L975690J958489K298236K343178O38306R3043J236617
752.6F81311786J011431l02910J26063J171053L03924o72042K84671Q36373l66867
771F83703482p47681L41893L78072n04494L7313R49800J45912o89566J11937L98398
791.4F84125066q15988r74118K52783K48492p46072l00884O28352o8784r57310m46141
811.7F80945396k49505j297652j537383o40452q28445j820504j506985r42349j919449
$$ y = [645208597, 645639360, 645219028, 642887652, 640970230, 639688134, 636515141, 631592393, 627019465, 621913373, 614189267, 604932725, 596030712, 587141514, 578546524, 572127879, 568039536, 565311670, 565918326, 572935700, 585354149, 599927008, 615486622, 631390274, 644990683, 654712677, 662306726, 668768227, 672743917, 674702406, 677000642, 679343820, 679982126, 680075169, 681311786, 682323217, 682020307, 682146370, 683317423, 683621347, 682949305, 683233976, 684070349, 683703482, 682955801, 683297694, 683675766, 683171272, 683208585, 684158385, 684304297, 683614731, 683726668, 684125066, 683309078, 682334960, 682587743, 682836235, 682090163, 681789279, 682417631, 682348847, 681391537, 680945396, 680695891, 679398239, 677860856, 677220404, 676391959, 674571455, 673064470, 672122121, 670202672]
830.1F70202672k896845k599060k805055m194617n054772n812704q894742j1765241
846.4F26179636q201421j512348j240671o638885j1422157j5398025k0538509k7209580
862.7E34018040l7648708n4666310o9220365o1497002l2793492o598741J0470032K7841717
879.1C09905171M5717985N7891399O2704205O0214818M9501240L4378111K2159815
893.3F42472744J5059233J0339558O923199N366265M437030K884805J808822J879513
909.6F91171169J613498O83844N27799Q72851K86102n46038l96610k23398r87053j428008
930F91574156q62121p16210j211643r67979l43621p33495j368463j042247p84158j507223
950.4F82036996k009332j709342j953900k870560l003418k614916l064453l707111
$$ y = [670202672, 667305827, 664706767, 661901712, 657707095, 652652323, 646839619, 637944877, 626179636, 617978215, 616465867, 615225196, 608586311, 597164154, 581766129, 561227620, 534018040, 496369332, 441703022, 372482657, 310985655, 278192163, 271593422, 282063454, 309905171, 355623156, 413514555, 476218760, 536433578, 585934818, 620312929, 642472744, 657531977, 667871535, 674794734, 680160999, 684598029, 687482834, 689291656, 691171169, 692784667, 693468511, 693996310, 694869161, 695155263, 694609225, 694212615, 693989217, 693002164, 691574156, 690712035, 689995825, 688784182, 687816203, 687472582, 686739087, 685370624, 684328377, 683544219, 682036996, 680027664, 678318322, 676364422, 673493862, 670490444, 667875528, 664811075, 661103964]
966.8F61103964l452778l277600m037559m587054m366934m645288n624831n885482
983.1F25226438n448103n600035n961716n497992m891038m971087m935205m367233
999.4E83554029m299640m874826m973650m564345m639744m955888m573822l951550
1015.7E46720564l885388l726006k966344k442062k449095k083719j228630q20280
1032E27119040p93516l69191Q1241k31683q23260r05096q38042j015305p82967J41979
1052.4E21583200Q80002J134873J561761K031028J771271J006544M15087k88248j480997
1070.8E28614521k414107k541602k534151k667844k270639j305342m66526M22597J891256
1089.1E16728163L205061L314793K525866J683593Q52167Q4520l7074M64201P34031
$$ y = [661103964, 657651186, 654373586, 650336027, 645748973, 641382039, 636736751, 631111920, 625226438, 619778335, 614178300, 608216584, 602718592, 597827554, 592856467, 587921262, 583554029, 579254389, 574379563, 569405913, 564841568, 560201824, 555245936, 550672114, 546720564, 542835176, 539109170, 536142826, 533700764, 531251669, 529167950, 527939320, 527119040, 526325524, 525956333, 526037574, 525805891, 524982631, 524077535, 523239493, 522224188, 521441221, 521583200, 522463202, 523598075, 525159836, 527190864, 528962135, 529968679, 530383766, 530095518, 528614521, 526200414, 523658812, 521124661, 518456817, 516186178, 514880836, 514414310, 514836907, 516728163, 519933224, 523248017, 525773883, 527457476, 528309643, 528394163, 528357089, 528821290, 529555321]
1107.5E29555321O80625R89735J438856J266361P33137N35726M48883Q6606j33276
1125.8E35601974K9206N4240k32398l96550m42863q08835j233041j147211q89837r13799
1146.2E29620886q47876m76480l56197o06120n66065j59383Q2851L01659R36269J524866
1166.6E29454410J470566J244843J407206J562834J420319J333475J280904Q40544
1182.9E40015101J40191l16620o36995j178682j646876j733244j797855k071380k125740
1201.3E28647900j860619j791418j956522j936197j874864k143622k520084k632082
1217.6E11932492k622783k799869k946496k867877k840638k940506k899706k724678
1233.9D89289939k702504k798229k740831k618640k715051k820433k720058k690881
$$ y = [529555321, 530235946, 531225681, 532664537, 533930898, 534664035, 535199761, 535648644, 535735250, 535601974, 535631180, 535685420, 535453022, 535056472, 534613609, 533804774, 532571733, 531424522, 530534685, 529620886, 528773010, 528296530, 527940333, 527334213, 526768148, 526608765, 526691616, 526993275, 527929544, 529454410, 530924976, 532169819, 533577025, 535139859, 536560178, 537893653, 539174557, 540015101, 540155292, 539838672, 539201677, 538022995, 536376119, 534642875, 532845020, 530773640, 528647900, 526787281, 524995863, 523039341, 521103144, 519228280, 517084658, 514564574, 511932492, 509309709, 506509840, 503563344, 500695467, 497854829, 494914323, 492014617, 489289939, 486587435, 483789206, 481048375, 478429735, 475714684, 472894251, 470174193, 467483312]
1250.3D67483312k870530k962202k887904k926529l070176l060013k926975k989650
1266.6D43789333l154755l175675l165186l283381l394544l393740l470957l637105
1282.9D17113990l707737l712803l883004m117579m215449m263729m438102m631191
1299.2C84144396m684598m725456m827112m912793m865557m844934m909605m878551
1315.5C45495790m816979m882306m956901m994005n109995n282730n425453n403460
1331.8C04623961n300939n318880n580246n811155n694628n539298n584538n681902
1348.1B60112375n736262n773410n798816n789787n686283n705387n947575n872964
1364.5B13801891n509228n452439n343914n226791n364746n162448m858553m790291
$$ y = [467483312, 464612782, 461650580, 458762676, 455836147, 452765971, 449705958, 446778983, 443789333, 440634578, 437458903, 434293717, 431010336, 427615792, 424222052, 420751095, 417113990, 413406253, 409693450, 405810446, 401692867, 397477418, 393213689, 388775587, 384144396, 379459798, 374734342, 369907230, 364994437, 360128880, 355283946, 350374341, 345495790, 340678811, 335796505, 330839604, 325845599, 320735604, 315452874, 310027421, 304623961, 299323022, 294004142, 288423896, 282612741, 276918113, 271378815, 265794277, 260112375, 254376113, 248602703, 242803887, 237014100, 231327817, 225622430, 219674855, 213801891, 208292663, 202840224, 197496310, 192269519, 186904773, 181742325, 176883772, 172093481]
1380.8A72093481m614294m286274m188582m145012l868207l907278m191682m111573
1397.1A38780579m002512l768608l397539l239222k888031k427868k031141j600563
1413.4A15425095j156241p53656k52150L03433P85984J187555J427375J661338J699760
1431.8A20328493J565904J741454J882143J460210J223892J149416J060024J031294
1448.1A31442830R02668P19770O64294R99198J313343J007140R23455J302033J498506
1466.4A40773237J299843J401812K003595K249599K001583J933143K044499K222910
1482.8A55930221K314836K591982L177792L515214L147185L249839M143968M325554
1499.1A82396591L729105L216251L910467N679638M787147L587305L619686L903151
$$ y = [172093481, 167479187, 163192913, 159004331, 154859319, 150991112, 147083834, 142892152, 138780579, 134778067, 131009459, 127611920, 124372698, 121484667, 119056799, 117025658, 115425095, 114268854, 113515198, 113263048, 113566481, 114352465, 115540020, 116967395, 118628733, 120328493, 121894397, 123635851, 125517994, 126978204, 128202096, 129351512, 130411536, 131442830, 132345498, 133065268, 133729562, 134728760, 136042103, 137049243, 137972698, 139274731, 140773237, 142073080, 143474892, 145478487, 147728086, 149729669, 151662812, 153707311, 155930221, 158245057, 160837039, 164014831, 167530045, 170677230, 173927069, 178071037, 182396591, 186125696, 189341947, 193252414, 198932052, 203719199, 207306504, 210926190, 214829341]
1515.4B14829341M160180M164130M589677M397273L793478L898278L585055L629550
1531.7B47046962M212663L567547L130972M711956N236298M118621L864169L930956
1548B79820144M414559M698574M780233M846990O893873Q346767N180716M522413N120814
1566.4C28625083N437940N558789M322827L937930M845500M024476L056138L080845
1582.7C62889528L052742K877295K687931K448797K270669K206951K022833J803845
1599C82260591J707852J635521J450450J343518J306355J091152P79599Q94428J147359
1617.4C93616825O36548M44830P59899P34836N85675N53906M78089R03785J789123
1635.7D00503516J535505R65059J110196J457960K288639K512545J456379K272487
$$ y = [214829341, 218989521, 223153651, 227743328, 232140601, 235934079, 239832357, 243417412, 247046962, 251259625, 254827172, 257958144, 262670100, 267906398, 272025019, 275889188, 279820144, 284234703, 288933277, 293713510, 298560500, 305454373, 313801140, 318981856, 323504269, 328625083, 334063023, 339621812, 343944639, 347882569, 352728069, 356752545, 359808683, 362889528, 365942270, 368819565, 371507496, 373956293, 376226962, 378433913, 380456746, 382260591, 383968443, 385603964, 387054414, 388397932, 389704287, 390795439, 391575038, 392469466, 393616825, 394253373, 394698203, 395458102, 396192938, 396778613, 397332519, 397810608, 398714393, 400503516, 402039021, 403004080, 404114276, 405572236, 407860875, 410373420, 411829799, 414102286]
1652D14102286L978282K300948J553893K261281L159464L250152K626746L151685L945977
1670.4D40330714L258646L279864L632129K952069K642810L529578N043924L912032
1686.7D68581766K779364L009528K895892L657728M258007M021347M529506L329277
1703D97062415K728730L118456K676785K348780K338291K724707L562391K942979J656711
1721.4E21160245J687586K036810J956821J861930J923978K915144K719343J403629
1737.7E37665486J794458K221405J864612J816273K102137K488315K259970J517593
1754E53730249J558185J743972J628578J892030J553715J100838J212179J415611J740634
1772.4E67575991J200915K75552R8347J8359m65095r89378j450419j854062j872182
$$ y = [414102286, 418080568, 420381516, 421935409, 424196690, 427356154, 430606306, 433233052, 436384737, 440330714, 443589360, 446869224, 450501353, 453453422, 456096232, 459625810, 464669734, 468581766, 471361130, 474370658, 477266550, 480924278, 485182285, 489203632, 493733138, 497062415, 499791145, 502909601, 505586386, 507935166, 510273457, 512998164, 516560555, 519503534, 521160245, 522847831, 524884641, 526841462, 528703392, 530627370, 533542514, 536261857, 537665486, 539459944, 541681349, 543545961, 545362234, 547464371, 549952686, 552212656, 553730249, 555288434, 557032406, 558660984, 560553014, 562106729, 563207567, 564419746, 565835357, 567575991, 568776906, 569052458, 569150805, 569169164, 568704069, 567714691, 566264272, 564410210, 562538028]
1790.7E62538028j681745j842678j847803j200378k52068L67939P43508J359463K201557
1809.1E60385823K867461K976596K983928L216326L178477K801716K726317K775788
1825.4E83912432K338708K258777K146662J523494J384020J472473J170457J018047
1841.7E97225070J635551J772047J060545Q35240Q93473Q94785R18687R22739R20356
1860.1F07078493Q98182P43330P12335J120865J171231O29127M98474O89924P65621
1878.4F14307582P47323P13289O59764N94616P51972Q19445N62846N58794O75619O00218
1898.8F20991468N43833N13852N03003N81384O89626O45995M04954L00288N89371P05480
1919.2F26469254M63427M97877M99606L64721L87192M04060L87966L75510L42607L39508
$$ y = [562538028, 560856283, 559013605, 557165802, 555965424, 555713356, 556081295, 556824803, 558184266, 560385823, 563253284, 566229880, 569213808, 572430134, 575608611, 578410327, 581136644, 583912432, 586251140, 588509917, 590656579, 592180073, 593564093, 595036566, 596207023, 597225070, 598860621, 600632668, 601693213, 602528453, 603421926, 604316711, 605235398, 606158137, 607078493, 607976675, 608720005, 609432340, 610553205, 611724436, 612353563, 612852037, 613541961, 614307582, 615054905, 615768194, 616427958, 617022574, 617774546, 618593991, 619156837, 619715631, 620391250, 620991468, 621535301, 622049153, 622552156, 623133540, 623823166, 624469161, 624874115, 625174403, 625763774, 626469254, 626932681, 627430558, 627930164, 628294885, 628682077, 629086137, 629474103, 629849613, 630192220, 630531728]
1939.6F30531728N29468N99623L56019K19106K34783K88367L50297L24785K65718K54512
1960F33954406J93953J74344L32534M37558L40342K98262L35395L15667K94208K80917
1980.4F36957586K71916K51770K33114J99795K45750L40223K43723J41919J96040K42352
2000.8F39324188K10345J61469J43349J63675J74641J38998J48535K32041K03371Q8334
2021.2F40988946R0837J60277J85728J69099J60515J34945Q5473P5519J21355J70529
2041.6F42343223J60396J40131J50561J54793J36495J27196J21117J19150J11341J01686
2062F43666089J45733J52230R6560J06334J63317J54972J04666Q1599O6757O2346R6083
2084.4F44896686J19090J04427Q2851O3121O4791P7962R4057Q2373M5419M6909M8935
$$ y = [630531728, 631061196, 631660819, 632016838, 632235944, 632470727, 632759094, 633109391, 633434176, 633699894, 633954406, 634148359, 634322703, 634655237, 635092795, 635433137, 635731399, 636066794, 636382461, 636676669, 636957586, 637229502, 637481272, 637714386, 637914181, 638159931, 638500154, 638743877, 638885796, 639081836, 639324188, 639534533, 639696002, 639839351, 640003026, 640177667, 640316665, 640465200, 640697241, 640900612, 640988946, 641079783, 641240060, 641425788, 641594887, 641755402, 641890347, 641975820, 642051339, 642172694, 642343223, 642503619, 642643750, 642794311, 642949104, 643085599, 643212795, 643333912, 643453062, 643564403, 643666089, 643811822, 643964052, 644060612, 644166946, 644330263, 644485235, 644589901, 644671500, 644738257, 644800603, 644896686, 645015776, 645120203, 645203054, 645266175, 645330966, 645408928, 645502985, 645585358, 645630777, 645677686, 645726621]
2106.9F45726621L0875J5259j2994k7835J311J8955J9669K6941J5676j19k920j0074
2131.3F45801365l4511k7179K1576L5882m76k146M8220O3062L9935M5061N4657M2200
2155.8F46087646R4235J68622J59383J05738R1374J25707J42872J12057P7247R9063
2176.2F47263944J46210J73152J71363J39773J06812R9480J17302J20461J03533J01387
2196.6F48543417J05799P6234M3929M7445M7266L7671O1571Q5235M6253J788M2975
2219F49139583R9123N9843O020K2173N7816L5465l874K0861N7042N2452L0875L3736
2243.5F49611115L4869n483l9816k4557p630j0908K2591M0233p093l1054J1742M5836
2268F49639845M2975P8320J09315L8982k5332J728j2398j19686j98543j85191j87815
$$ y = [645726621, 645757496, 645772755, 645759761, 645731926, 645733237, 645752192, 645771861, 645798802, 645814478, 645814359, 645811439, 645801365, 645766854, 645739675, 645761251, 645797133, 645796657, 645794511, 645842731, 645905793, 645945728, 645990789, 646045446, 646087646, 646181881, 646350503, 646509886, 646615624, 646706998, 646832705, 646975577, 647087634, 647164881, 647263944, 647410154, 647583306, 647754669, 647894442, 648001254, 648100734, 648218036, 648338497, 648442030, 648543417, 648649216, 648725450, 648769379, 648816824, 648864090, 648901761, 648963332, 649048567, 649094820, 649096608, 649139583, 649238706, 649298549, 649304569, 649326742, 649384558, 649420023, 649416149, 649437010, 649494052, 649546504, 649577379, 649611115, 649645984, 649640501, 649600685, 649576128, 649568498, 649557590, 649580181, 649620414, 649613321, 649582267, 649594009, 649639845, 649682820, 649761140, 649870455, 649909437, 649884105, 649885833, 649873435, 649753749, 649555206, 649370015, 649182200]
2290.4F49182200k78651l30448l07918l54528m66884n42819o07550p06613p74205p09891
2310.8F44102693n55814o09576r53913j144648r41932o40750o10709p29919n53250
2329.2F37362182j88231j37329l62337m64082k75612K86818J548886K451062M51386
2347.5F40672743k484619l385008k464115j459301o79433J54495P90417J404465J937329
2365.9F34486973K103567K118111K132356J968801J652539J356244J087546P42436
2382.2F47648573L81052J55509O8247j3113r7573j44362j56760j34290j13427j11103
2402.6F47482753j39475j65939j16647p6472j48178k12073j86324j56939j67906j93477
2423F45919323k24888k61665k86519k70129k11179k02834k61367l02672l19302l65794
$$ y = [649182200, 648903549, 648573101, 648265183, 647910655, 647443771, 646900952, 646293402, 645586789, 644812584, 644102693, 643546879, 642937303, 641983390, 640838742, 639896810, 639256060, 638645351, 637915432, 637362182, 637173951, 637036622, 636674285, 636210203, 635934591, 636221409, 637770295, 640221357, 640672743, 638188124, 634803116, 632339001, 630879700, 630200267, 630354762, 631145179, 632549644, 634486973, 636590540, 638708651, 640841007, 642809808, 644462347, 645818591, 646906137, 647648573, 648029625, 648185134, 648253381, 648240268, 648142695, 647998333, 647841573, 647707283, 647593856, 647482753, 647343278, 647177339, 647060692, 646984220, 646836042, 646623969, 646437645, 646280706, 646112800, 645919323, 645694435, 645432770, 645146251, 644876122, 644664943, 644462109, 644200742, 643898070, 643578768, 643212974]
2443.4F43212974m32968m48644m37737m57585m71651m85599n97298p46310p98345p94708
2463.8F37542129q54254r79185j055658j109660j241922j410306j522362j598477j699031
2482.1F26071274j798570j899660k009034k019345j913012j817584j751661j659691
2498.5F11202717j595080j573801j498819j418232j428962j434982j371324j264453
2514.8E99617064j149714j047850r09149o70433l95656j98901m887K60353N11288P12753
2535.2E96724868Q87692J025438J097739J153588J240850J249671J135408J025260
2551.5F05540514R55641Q19266O49035N66542N03540M10855L38197K69592K00092J40846
2571.9F10394120P7129K1398r418k9027m7028o7234q8334j06335j17302j45376j76012
$$ y = [643212974, 642780006, 642331362, 641893625, 641436040, 640964389, 640478790, 639881492, 639135182, 638336837, 637542129, 636687875, 635708690, 634653032, 633543372, 632301450, 630891144, 629368782, 627770305, 626071274, 624272704, 622373044, 620364010, 618344665, 616431653, 614614069, 612862408, 611202717, 609607637, 608033836, 606535017, 605116785, 603687823, 602252841, 600881517, 599617064, 598467350, 597419500, 596510351, 595839918, 595444262, 595245361, 595240474, 595500827, 596012115, 596724868, 597612560, 598637998, 599735737, 600889325, 602130175, 603379846, 604515254, 605540514, 606496155, 607315421, 607964456, 608530998, 609034538, 609445393, 609783590, 610053182, 610253274, 610394120, 610471249, 610492647, 610483229, 610454202, 610407174, 610339940, 610251606, 610145271, 610027969, 609882593, 609706581]
2594.3F09706581j37806p4864o6280p7665n2810j5437N603N1677J26064J78814J93655
2616.8F09837532K05934K39253K58863K36452K39670L15011L65912L22938K51294K39610
2637.1F12512469K59459K35737J87158J56403J19626P4506M4406j4902j11579j54138
2657.5F13309145j29700j64449k68102l10599k86937k83301k99335k84671k92480l42727
2677.9F10646844l52323l14415l00467l48270l72648l26753l18169l74079m00662l66152
2698.3F07172906l32355l58224m07517m17292l96252l94523l97801l70384l93211m53294
2718.7F03252053m30882m02510m36962m08947l31521l42488m08709m29809m15266m01020
2739.1E99243939l68357l47852l97444m59194m44830l90470l92854m52161m75407m26292
$$ y = [609706581, 609568775, 609493911, 609427631, 609349966, 609297156, 609281719, 609287322, 609338999, 609465063, 609643877, 609837532, 610043466, 610282719, 610541582, 610778034, 611017704, 611332715, 611698627, 612021565, 612272859, 612512469, 612771928, 613007665, 613194823, 613351226, 613470852, 613545358, 613589764, 613574862, 613463283, 613309145, 613179445, 613014996, 612746894, 612436295, 612149358, 611866057, 611566722, 611282051, 610989571, 610646844, 610294521, 609980106, 609679639, 609331369, 608958721, 608631968, 608313799, 607939720, 607539058, 607172906, 606840551, 606482327, 606074810, 605657518, 605261266, 604866743, 604468942, 604098558, 603705347, 603252053, 602821171, 602418661, 601981699, 601572752, 601241231, 600898743, 600490034, 600060225, 599644959, 599243939, 598875582, 598527730, 598130286, 597671092, 597226262, 596835792, 596442938, 595990777, 595515370, 595089078]
2759.5E95089078l93748m43161m85420m58360m69804n34951n32389m85063n09023n73159
2779.9E90204000n62548n25713n93722o79731o30618n88059o83963p57456p19070o80686
2800.3E83782434p05599p27892p57098q54314r22620q91268q53360q87990r53496r65714
2820.7E75263083r43244r66608j049161j150191j237809j305581j375019j478076j587570
2839.1E64169824j736939k026498k350092k490997k286077j754880j213848r10223
2855.4E49400270p86603p41064q07941r80139j132786j221061j295686j313388j149654
2873.7E39971948q98779q03232q33929q16404p81715p99418q15570p93815p83503p89106
2894.1E31856477p00116n87821o25908o86646o57737p11083r15349j153588j358748
$$ y = [595089078, 594695330, 594252169, 593766749, 593308389, 592838585, 592303634, 591771245, 591286182, 590777159, 590204000, 589641452, 589115739, 588522017, 587842286, 587211668, 586623609, 585939646, 585182190, 584463120, 583782434, 583076835, 582348943, 581591845, 580737531, 579814911, 578923643, 578070283, 577182293, 576228797, 575263083, 574319839, 573353231, 572304070, 571153879, 569916070, 568610489, 567235470, 565757394, 564169824, 562432885, 560406387, 558056295, 555565298, 553279221, 551524341, 550310493, 549400270, 548613667, 547872603, 547064662, 546084523, 544951737, 543730676, 542434990, 541121602, 539971948, 539073169, 538269937, 537436008, 536619604, 535837889, 535038471, 534222901, 533429086, 532645583, 531856477, 531156361, 530568540, 529942632, 529255986, 528598249, 527887166, 526971817, 525818229, 524459481]
2912.5E24459481j463234j391709j144469q29458n76437l80516j82688L2485K26259
2930.8E18749714L27945L62813M00543M01616L15488K26974J98782J59561L3200j40905
2951.2E21035731k44916k76327k83360k55287k06292j29044o258P1585J8239k4021
2971.6E19700050R3580K24054K52962L12090M20570M31716L34144K43545J60813Q3446
2992E22256970Q2851P7724J0491n8115o0618J8955K1040j01566j81020j57058j06752
3014.5E21802902j00672j52946k25842l11791l87907m44532n17189n76079o02961n94616
3034.9E17888367o17981p04944p14481o77109p07149p20739p10071p85887q33988p41601
3055.3E10674417o94931p84158q46863q00729p28905p24077p64430p70628p66039p88272
$$ y = [524459481, 522996247, 521604538, 520460069, 519630611, 519054174, 518673658, 518490970, 518523455, 518749714, 519077659, 519440472, 519841015, 520242631, 520558119, 520785093, 520983875, 521143436, 521176636, 521035731, 520790815, 520514488, 520231128, 519975841, 519769549, 519640505, 519634247, 519705832, 519724071, 519700050, 519793630, 520017684, 520270646, 520582736, 521003306, 521435022, 521769166, 522012711, 522173524, 522256970, 522339821, 522417545, 522428036, 522369921, 522309303, 522328258, 522349298, 522247732, 522066712, 521909654, 521802902, 521702230, 521549284, 521323442, 521011651, 520623744, 520179212, 519662023, 519085944, 518482983, 517888367, 517270386, 516565442, 515850961, 515173852, 514466703, 513745964, 513035893, 512250006, 511416018, 510674417, 509979486, 509195328, 508348465, 507547736, 506818831, 506094754, 505330324, 504559696, 503793657, 503005385]
3075.6E03005385q01563p78675p62761p81744p77364p57098p66516p71165p27832p16031
3096D95364636q28206r10700q65847q39799q68649q72015q65549q85308q96603r11504
3116.4D86620456r40204r14097q86380r53704j022160j053036j054734r88751j003325
3134.8D77804065j093358j097232j073033j090318j111656j107246j124799j157969
3151.1D68948454j146704j172036j244992j260013j247763j239598j215369j198768
3167.4D59223211j218647j261681j282215j263887j225531j273185j382202j347572
3183.7D48968291j245647j259745j305252j320779j343876j315028j251012j249432
3200.1D38677520j274646j290858j320034j298100j242965j243025j255542j271218
$$ y = [503005385, 502203822, 501425147, 500662386, 499880642, 499103278, 498346180, 497579664, 496808499, 496080667, 495364636, 494536430, 493625730, 492759883, 491920084, 491051435, 490179420, 489313871, 488428563, 487531960, 486620456, 485680252, 484766155, 483879775, 482926071, 481903911, 480850875, 479796141, 478807390, 477804065, 476710707, 475613475, 474540442, 473450124, 472338468, 471231222, 470106423, 468948454, 467801750, 466629714, 465384722, 464124709, 462876946, 461637348, 460421979, 459223211, 458004564, 456742883, 455460668, 454196781, 452971250, 451698065, 450315863, 448968291, 447722644, 446462899, 445157647, 443836868, 442492992, 441177964, 439926952, 438677520, 437402874, 436112016, 434791982, 433493882, 432250917, 431007892, 429752350, 428481132]
3216.4D28481132j281142j244486j239657j296938j299381j214981j167953j191109
3232.7D18545485j206905j224101j268148j290262j230776j130134j147270j236290
3249D08811599j214594j134574j127929j182407j202792j215130j249551j232416j174122
3267.4C98078084j128972j139074j122892j048744j056969j098543j064182j030892
3283.7C89387816j051754j029372r41902r09925r83864j041591j009881r86845r55641
3302C80477041r14127r45210r94563j036823j112491j152545j112729j097322j149446
3320.4C70961785j198321j208782j239390j309156j350462j321167j225919j184076
3336.7C60924512j305938j412183j321047j212955j199037j153469j123935j181543
$$ y = [428481132, 427199990, 425955504, 424715847, 423418909, 422119528, 420904547, 419736594, 418545485, 417338580, 416114479, 414846331, 413556069, 412325293, 411195159, 410047889, 408811599, 407597005, 406462431, 405334502, 404152095, 402949303, 401734173, 400484622, 399252206, 398078084, 396949112, 395810038, 394687146, 393638402, 392581433, 391482890, 390418708, 389387816, 388336062, 387306690, 386364788, 385454863, 384470999, 383429408, 382419527, 381432682, 380477041, 379562914, 378617704, 377623141, 376586318, 375473827, 374321282, 373208553, 372111231, 370961785, 369763464, 368554682, 367315292, 366006136, 364655674, 363334507, 362108588, 360924512, 359618574, 358206391, 356885344, 355672389, 354473352, 353319883, 352195948, 351014405]
3353C51014405j183748j102566j061112j085669j094490j013011r52125j029521j144290
3371.4C41347873j084924r05394q37088q93563r52661q70406p28280o87957o39498
3389.7C33748102n89222p11649p70360n74351m47124n56052p06732o66589m81128l78788
3410.1C27866107m00156m22895m15712l32296j88142k08467k83838j57505J5766K6702
3430.5C25499564K385P7486N7339j14917r6351P0691K36243M97758M57227J90199K28137
3453C27105761L87281M51356N07206N72502N90027O32733P31200O37382M47720N30035
3473.4C32593203P10129P11531P57187R02206Q51423Q03560R32127R07749P76976Q69692
3493.8C40815783J049697R14425P42673J097531J319706R03279Q64505J263440J248151
$$ y = [351014405, 349830657, 348728091, 347666979, 346581310, 345486820, 344473809, 343521684, 342492163, 341347873, 340262949, 339357555, 338520467, 337626904, 336674243, 335803837, 335075557, 334387600, 333748102, 333158880, 332447231, 331676871, 331102520, 330655396, 330099344, 329392612, 328726023, 328244895, 327866107, 327465951, 327043056, 326627344, 326295048, 326106906, 325898439, 325614601, 325457096, 325472862, 325499564, 325501949, 325579435, 325636774, 325521857, 325425506, 325496197, 325732440, 326230198, 326687425, 326877624, 327105761, 327493042, 327944398, 328451604, 329024106, 329614133, 330246866, 330978066, 331615448, 332063168, 332593203, 333303332, 334014863, 334772050, 335674256, 336525679, 337329239, 338261366, 339169115, 339946091, 340815783, 341865480, 342779905, 343522578, 344620109, 345939815, 346843094, 347707599, 348971039, 350219190]
3512.1C50219190R90391R32157R45449R97871J316696J494944J388848J446247J346171
3530.5C61077964J048684J191527J485020J262456R59486J251697J985223K110570
3546.8C72372627J307369J194387J762152J523882J151562J394063J335204Q07821
3563.1C82849067J797587M002363L131926P54535O63042J510620J807511J857340J481146
3581.5C99855137Q28504J883746M155278K944261N31166J290054K445548K083212K089143
3599.8D18106049J957208P77096R58115K923727L203422K160727J464099P18832K489388
3618.2D34758663M084021J138657j698792j22785O338090P050544J089304J73182J213043
3636.5D54023927J301825J305610K72245r16928J446724P401019O533652p59184j016825
$$ y = [350219190, 351209581, 352141738, 353087187, 354085058, 355401754, 356896698, 358285546, 359731793, 361077964, 362126648, 363318175, 364803195, 366065651, 367025137, 368276834, 370262057, 372372627, 373679996, 374874383, 376636535, 378160417, 379311979, 380706042, 382041246, 382849067, 384646654, 388649017, 391780943, 392535478, 393198520, 394709140, 396516651, 398373991, 399855137, 400683641, 402567387, 406722665, 409666926, 410198092, 411488146, 413933694, 416016906, 418106049, 420063257, 420840353, 421798468, 424722195, 427925617, 430086344, 431550443, 432269275, 434758663, 438842684, 439981341, 438282549, 438159764, 444497854, 451548398, 452637702, 452810884, 454023927, 455325752, 456631362, 456903607, 455986679, 457433403, 464834422, 471368074, 470608890, 469592065]
3654.9D69592065K824992J798927p2002k4349r44703o61552L246575L087014j38044
3673.2D78708923M323542M885793r30578k160251k350300k293706J657903N750984
3689.6D87592310K441734j876384k206564j283169L51757K525151J198679j861125
3705.9D86882389j273990K860814N580008J342953k814919k263755l53694O15061R01579
3724.2D91476446O07044j637429k691418J99825M269033M484058j123011n931139k151579
3742.6D87501830N571723J508325j974314M331350L631085k987921l090024O33299
3758.9D95125353O30826j680165r82494L70294J599223J628756j170516k486199n95480
3777.3D92439598J775235P49618q46148r3132r209n99206j090794j279176k39908n77212
$$ y = [469592065, 472417057, 474215984, 474143982, 474119633, 473174930, 472513378, 475759953, 478846967, 478708923, 483032465, 487918258, 486987680, 484827429, 482477129, 480183423, 481841326, 487592310, 490034044, 488157660, 485951096, 484667927, 485019684, 487544835, 488743514, 486882389, 485608399, 488469213, 494049221, 495392174, 492577255, 490313500, 489959806, 490574867, 491476446, 492083490, 490446061, 487754643, 487954468, 492223501, 496707559, 495584548, 489653409, 487501830, 493073553, 494581878, 492607564, 496938914, 500569999, 497582078, 494492054, 495125353, 495756179, 494076014, 493093520, 493463814, 495063037, 496691793, 495521277, 493035078, 492439598, 494214833, 494964451, 494118303, 494025171, 494015962, 493416756, 492325962, 491046786, 490806878, 490229666]
3797.7D90229666K90305L562241M50910q94428J821667j374781m571378j897037K241939
3816D89859104O59734J206368L596276r69141k713740j532644j226992o46948p72208
3834.4D87459809J079499L701151J482993q05378j141101l129482n463779l321529
3850.7D79862183P301838J0315537k084166o324678l202439N49764J009464j328886
3867D86098617N51939K750933L89904j455188k758651r89289J022041j18047J214266
3885.4D86706525J16348j826912J014024M22031l301144k516359Q51631K645582K962262
3903.7D87073988R81778k023995k332717j475692j216591J09732J388580K70039r18955
3922.1D81856167j93357l1501j033545l22789J138240L55125j108915j311242n62400
$$ y = [490229666, 490519971, 494082212, 494533122, 493638694, 495460361, 494085580, 489514202, 487617165, 489859104, 490518838, 491725206, 495321482, 494352341, 491638601, 490105957, 488878965, 488232017, 487459809, 488539308, 492240459, 493723452, 492918074, 491776973, 488647491, 483183712, 479862183, 487164021, 497479558, 495395392, 489070714, 485868275, 486418039, 487427503, 486098617, 486650556, 489401489, 489791393, 488336205, 485577554, 484588265, 485610306, 485492259, 486706525, 486822873, 484995961, 486009985, 486432016, 483130872, 480614513, 481466144, 484111726, 487073988, 488055766, 486031771, 483699054, 482223362, 481006771, 481116503, 482505083, 482775122, 481856167, 481662810, 481631309, 480597764, 480274975, 481413215, 481768340, 480659425, 479348183, 478785783]
3940.4D78785783N40048K02566o16282O0171L12686m18961o11901l73513k69085o5506
3960.8D77546006O706l13640l79830k11269k28554j77145j3649j34230l41415k52486
3981.2D75500494j26481k41220l13520j46717j11193k25633j65790j46926
3997.5D74023014
$$ y = [478785783, 479325831, 479528397, 478912115, 478972286, 479284972, 478866011, 478254110, 477880597, 477611512, 477546006, 477552712, 477239072, 476859242, 476647973, 476419419, 476242274, 476228625, 476094395, 475752980, 475500494, 475374013, 475132793, 474819273, 474672556, 474561363, 474335730, 474169940, 474023014]
##END=$$ End of the data block
