##TITLE=$$ Begin of the data block
##JCAMP-DX=5.00 $$ ACD/SpecManager v 10.08
##SPECTROMETER/DATA SYSTEM=Alpha
##DATE=11 Jun 2014 19:36:16
##DATA TYPE=INFRARED SPECTRUM
##DATA CLASS=XYDATA
##ORIGIN=
##OWNER=
##NPOINTS=1765
##FIRSTX=399.75695801
##LASTX=3997.56933594
##MAXX=3997.56933594
##MINX=399.75695801
##MAXY=0.69507802
##MINY=0.11345116
##XFACTOR=1.0000000000
##YFACTOR=1.000000000000000e-9
##FIRSTY=0.42241076
##DELTAX=2.03957629
##XUNITS=1/CM
##YUNITS=ARBITRARY UNITS
##XYDATA=(X++(Y..Y))
399.8 422410756 430783927 439094454 448275387 456903219 464571923 472505182 480367959 486836791
416.1 486836791 493474245 500907421 506358624 510719717 515724123 520749688 525155962 529671848
432.4 529671848 534473538 538533628 542077303 546299875 550375402 552733362 554702580 557588995
448.7 557588995 560074508 561651111 563584983 565656900 566283822 566558599 568085670 569454789 569805801
467.1 569805801 571095169 573684633 575692356 577799261 581541181 585068464 587019265 589527965
483.4 589527965 593181431 595711410 597140193 599405885 601813972 602822185 603972495 606281459
499.7 606281459 607601702 607546270 608626783 610464573 610713780 610557020 611870825 612815261 612218201
518.1 612218201 612438321 613875210 614164233 613580287 614436984 615726590 615423739 615225136 616807044
536.4 616807044 618023455 617967069 619087756 621335387 622122884 622249722 623880744 625330508 624851227
554.8 624851227 624648154 626036406 626720726 626364648 627569437 629831135 630403399 630245388 631544292
573.1 631544292 632655203 632110596 632234573 633897960 634600997 634175360 635124683 636885583 637002528
591.5 637002528 636631131 637848616 638774574 637864053 637343764 637783349 636752725 634723783 634509981
609.8 634509981 635345161 634757757 634058177 635292053 636585474 636523664 637245536 639198124 639876723
628.2 639876723 639570415 640848160 642861128 643350065 643708706 645641804 647081256 646757543 646959126
646.5 646959126 648156822 647994995 646889925 647238433 647966862 646916091 645852387 646557093 646667182
664.9 646667182 644059598 642546773 644534588 645220518 644441187 644768715 645597637 644873977 643971443
683.3 643971443 644415081 644129038 641981125 640146971 638854265 635659099 630661726 625972748 620819390
701.6 620819390 613127112 603897870 594982326 586124659 577644646 571277738 567171335 564484298
717.9 564484298 565144300 572164893 584547818 599069059 614589930 630500615 644126892 653794944
734.2 653794944 661295652 667768240 671842575 673821449 676042438 678367913 679093242 679260492 680521548
752.6 680521548 681569040 681290925 681358635 682421803 682736754 682187974 682516992 683311284 682912648 682161748
773 682161748 682522416 682938755 682437479 682432473 683401227 683649719 683033049 683111429 683436632 682594538 681599915
795.4 681599915 681806147 682087243 681503415 681335151 681973875 681885481 680915952 680445433 680159092 678859055
815.8 678859055 677403867 676845431 675997078 674110353 672575593 671649098 669759095 666852415 664210081
834.2 664210081 661388516 657236397 652271926 646550715 637676418 625821114 617554843 616091609
850.5 616091609 614855468 608146727 596710861 581338167 560837150 533690572 496113032 441514850
866.8 441514850 372316629 310815901 278065085 271576881 282166153 310063750 355770022 413578510
883.1 413578510 476199418 536412060 585942686 620334446 642493010 657557845 667937696
897.4 667937696 674883902 680195510 684576094 687501192 689384997 691235960 692743301 693374097 693916619
915.8 693916619 694811583 695078015 694489241 694067597 693815768 692845345 691508591 690726578 690052271 688857794
936.2 688857794 687881172 687521756 686788619 685409665 684330344 683526278 682005703 679957986 678198755
954.5 678198755 676216304 673361480 670387387 667794466 664780855 661141455 657727301 654458523
970.8 654458523 650382578 645711303 641300440 636686981 631098986 625214756 619755507 614165008
987.1 614165008 608234167 602774203 597911119 592912018 587907314 583507001 579223156 574361384
1003.5 574361384 569386780 564831436 560213029 555279374 550717592 546773612 542873561 539094985
1019.8 539094985 536102235 533703804 531300366 529215872 527984440 527181983 526399672 526015580 526073635
1038.1 526073635 525818050 524968386 524062812 523247957 522269011 521526754 521671414 522520602 523625553
1056.5 523625553 525162160 527194798 528974712 529964685 530385435 530140579 528697073 526284039 523715317
1074.8 523715317 521149695 518477678 516229749 514951646 514517784 514933884 516793549 520010233 523321807
1093.2 523321807 525794625 527445316 528289080 528364658 528336108 528820992 529585719 530292928 531281590 532718718
1113.6 532718718 534000039 534764707 535342276 535798550 535854757 535705566 535738409 535788715 535543978 535145640
1134 535145640 534708321 533891320 532658398 531537890 530670226 529770672 528956413 528497159 528114438 527482629
1154.4 527482629 526906788 526743650 526837170 527137518 528038740 529534101 531005979 532252371 533654273
1172.7 533654273 535230279 536653936 537962854 539243460 540103674 540238559 539913237 539297044 538141012
1191.1 538141012 536484003 534732103 532935262 530881226 528770924 526907146 525104880 523141086
1207.4 523141086 521203995 519332588 517168105 514619708 512010276 509431481 506634653 503659725
1223.7 503659725 500773132 497936279 495003581 492118537 489415079 486714482 483905911 481166303
1240.1 481166303 478534639 475770980 472913027 470195681 467529774 464684993 461730570 458839089
1256.4 458839089 455910355 452835560 449765623 446834028 443858743 440722048 437552065 434385538
1272.7 434385538 431096792 427707314 424316287 420814544 417140543 413434416 409755379 405893981
1289 405893981 401763022 397517115 393243670 388829321 384219259 379534125 374809504 369985461 365058333
1307.4 365058333 360154152 355270594 350356579 345507354 340731055 335851073 330862463 325863302
1323.7 325863302 320770442 315493166 310050160 304633796 299342990 294030488 288432449 282602191
1340 282602191 276919872 271398783 265821666 260161608 254445016 248656556 242826968 237013921 231319383
1358.3 231319383 225623727 219678476 213778496 208250836 202820674 197506234 192284718 186909959
1374.7 186909959 181740671 176895455 172132671 167535096 163243085 159031972 154876947 151037902
1391 151037902 147177264 142992273 138854891 134862319 131123379 127732545 124477208 121576808 119156353
1409.3 119156353 117125191 115507975 114346407 113631241 113451160 113774434 114513502 115659282 117084570
1427.7 117084570 118758574 120469697 122037344 123780049 125676274 127151087 128369510 129485458
1444 129485458 130521506 131566361 132504165 133258790 133936375 134925187 136246175 137286589 138222679
1462.4 138222679 139493063 140963420 142292708 143734753 145726308 147938237 149918601 151842907
1478.7 151842907 153910831 156187654 158542931 161143482 164309606 167820200 170983687 174250364
1495 174250364 178398564 182723790 186465234 189695850 193603396 199304685 204141691 207739457 211346582
1513.4 211346582 215243369 219403282 223580077 228207260 232646331 236453548 240349025 243938997
1529.7 243938997 247567728 251768231 255334884 258467287 263172984 268428445 272574842 276447058
1546 276447058 280392468 284838468 289557725 294360757 299251586 306157708 314500809 319698453 324208230
1564.3 324208230 329290181 334684700 340226531 344575405 348536551 353375047 357388765 360457361
1580.7 360457361 363569885 366648108 369532794 372218609 374649704 376871616 379024088 381040603
1597 381040603 382859379 384539068 386124969 387554646 388898253 390181482 391207457 391903102 392709374
1615.3 392709374 393803060 394462347 394938767 395676166 396366745 396940947 397494942 397955090 398823500
1633.7 398823500 400584191 402139366 403126597 404244930 405731142 408055067 410568088 412007868
1650 412007868 414304823 418398142 420790285 422376543 424665540 427871406 431186825 433879822 437070280
1668.4 437070280 441040605 444332719 447642684 451302230 454290241 456971377 460529506 465610743
1684.7 465610743 469561875 472346276 475345612 478234828 481865436 486112148 490216315 494861394
1701 494861394 498240829 500984013 504114747 506811917 509195745 511563897 514302552 517883122 520839691
1719.3 520839691 522492588 524175882 526234090 528222442 530098438 532030761 534956396 537695467
1735.7 537695467 539126396 540955484 543223143 545115829 546922266 549002469 551478028 553728521
1752 553728521 555256784 556844234 558617294 560273647 562185526 563731134 564806819 566029191 567497671
1770.3 567497671 569278777 570480347 570725679 570800960 570824921 570379555 569415569 567973375 566112697
1788.7 566112697 564225018 562492967 560625732 558807194 557615519 557338715 557713807 558500111 559888899
1807 559888899 562100112 564977050 567962348 570953131 574173510 577356994 580183506 582942665 585725784
1825.4 585725784 588065922 590353012 592546642 594102204 595487654 596930921 598078251 599122465
1841.7 599122465 600789130 602543950 603567183 604381561 605286837 606219649 607173979 608113170 609041274
1860.1 609041274 609929502 610656798 611375749 612505078 613671482 614295244 614805162 615529358 616329968
1878.4 616329968 617081165 617760301 618389249 618990004 619763851 620595217 621176898 621766508 622452319 623047292
1898.8 623047292 623602033 624129534 624633729 625217915 625912249 626544237 626922429 627218366 627834797 628579259
1919.2 628579259 629071772 629567444 630045235 630402982 630801797 631230235 631649017 632049978 632408559 632747710
1939.6 632747710 633259654 633847773 634200573 634410620 634651124 634946764 635280371 635604739 635882378 636122406
1960 636122406 636314869 636533260 636919320 637381375 637713552 637991548 638307273 638613284 638935208 639250875
1980.4 639250875 639495611 639691889 639925599 640186429 640496910 640860379 641093969 641214132 641380727 641613245
2000.8 641613245 641847134 642025054 642161548 642318010 642492533 642659724 642866731 643133581 643339753 643433154
2021.2 643433154 643519342 643655241 643819869 643971682 644113123 644262493 644405842 644525826 644652426 644806385
2041.6 644806385 644937932 645060599 645214021 645366549 645489573 645620406 645774126 645930707 646070004 646186352
2062 646186352 646335423 646488070 646574616 646664202 646814883 646974146 647114515 647237957 647321522 647379756 647464156
2084.4 647464156 647566557 647665143 647777557 647880137 647950888 648000419 648060918 648140430 648199439 648240685 648289382
2106.9 648289382 648338437 648359418 648354352 648354292 648379862 648417354 648443997 648459136 648464143 648469746 648491323 648510218 648496091
2133.4 648496091 648488402 648525953 648555934 648547232 648552060 648600101 648666561 648727000 648791969 648864746 648910403 648974538
2157.9 648974538 649126410 649311841 649436533 649521053 649632335 649778247 649938047 650069356 650182486 650314271
2178.2 650314271 650476754 650676787 650851071 650937498 651005149 651122868 651242673 651336908 651445568 651582301
2198.6 651582301 651684225 651728094 651778042 651839852 651873469 651914477 652022123 652138531 652184129 652208209 652258694
2221.1 652258694 652291298 652315438 652382493 652468562 652500927 652492285 652532279 652616322 652678609 652712941 652755082 652787745
2245.6 652787745 652760625 652708650 652689576 652675331 652662933 652716339 652796865 652823865 652805984 652793169 652814627
2268 652814627 652870834 652973592 653090239 653120697 653080404 653102994 653158665 653091550 652898550 652690887 652483761
2290.4 652483761 652202308 651873171 651566386 651224375 650778234 650245249 649643302 648930609 648109913 647374272
2310.8 647374272 646860659 646273315 645285547 644094169 643102288 642423868 641803086 641099036 640605927
2329.2 640605927 640457332 640288234 639873803 639449060 639290035 639608264 641071558 643463373 643949866
2347.5 643949866 641521573 638122678 635600030 634141147 633485079 633723199 634626985 635990918 637846529
2365.9 637846529 639945030 642074466 644205689 646177232 647871315 649283230 650410354 651190639
2382.2 651190639 651614964 651796758 651833594 651764274 651663303 651575208 651483834 651365221 651227891 651123106
2402.6 651123106 651026130 650876403 650725365 650623679 650489450 650279462 650088489 649963856 649829209 649637461
2423 649637461 649410307 649167001 648923814 648698449 648492396 648250461 647948802 647640467 647333503 646966994
2443.4 646966994 646543682 646135926 645724118 645259440 644768834 644260049 643658400 642920196 642125785 641336679
2463.8 641336679 640486956 639527380 638499260 637379110 636087894 634640157 633117378 631532729 629846334
2482.1 629846334 628047109 626134574 624138117 622144520 620234609 618414044 616661310 614980578
2498.5 614980578 613365531 611799181 610298693 608854890 607419491 606009126 604669034 603419304
2514.8 603419304 602251530 601166427 600239873 599573016 599190712 599032640 599073827 599349439 599854767
2533.1 599854767 600552917 601425350 602445722 603556693 604734600 605990946 607246339 608384788 609403133
2551.5 609403133 610343218 611179709 611894250 612524331 613040686 613433301 613772988 614052832 614248872 614369571
2571.9 614369571 614428163 614473462 614507258 614483476 614419103 614369035 614312291 614202023 614075422 613952577 613808632
2594.3 613808632 613683462 613602996 613537312 613468409 613416791 613419712 613451838 613485456 613571525 613740146 613961995
2616.8 613961995 614213467 614494026 614789307 615041614 615271389 615589619 615983725 616321206 616549850 616761386
2637.1 616761386 617020249 617268622 617473900 617664397 617818117 617901385 617932022 617898822 617768824 617587924
2657.5 617587924 617433131 617276132 617064655 616817772 616559803 616274595 615951896 615657270 615393102 615082800
2677.9 615082800 614737272 614408076 614097238 613766730 613412142 613067269 612723529 612353981 611972928 611609578
2698.3 611609578 611253321 610877454 610493898 610122323 609757364 609356046 608931363 608570158 608212054 607766330
2718.7 607766330 607317030 606916487 606510937 606116295 605766773 605395496 604969561 604552865 604160964 603759885
2739.1 603759885 603362739 602982640 602615535 602231681 601806700 601400912 601024508 600594103 600114882 599664390
2759.5 599664390 599236310 598775625 598305464 597868800 597421706 596891761 596326709 595842838 595383644 594847977
2779.9 594847977 594285786 593716383 593075097 592377722 591741145 591167569 590522826 589796484 589093745 588422179
2800.3 588422179 587719321 586989641 586221635 585361362 584436178 583537281 582695961 581828654 580891550 579945087
2820.7 579945087 578976572 577933311 576833963 575702727 574503183 573197365 571817160 570352435
2837 570352435 568768203 567035079 565026045 562665045 560115933 557769179 555982053 554773152 553899109
2855.4 553899109 553138912 552399218 551591694 550595403 549435973 548226535 546955705 545645177 544495583
2873.7 544495583 543611288 542823255 541988254 541159987 540350556 539520979 538701713 537912250 537135005 536367893
2894.1 536367893 535664797 535043180 534402966 533720255 533073425 532387435 531486690 530324101 528954744
2912.5 528954744 527476430 526055813 524872959 524033010 523490608 523126662 522932529 522951722 523167074
2930.8 523167074 523515880 523919344 524326146 524711430 525050759 525330424 525556922 525718570 525744855 525600493
2951.2 525600493 525358975 525099218 524848461 524604619 524375498 524223089 524198651 524239659 524245560 524239600 524352908
2973.7 524352908 524602950 524877846 525181413 525576770 526011825 526385009 526657104 526833117 526952207 527063906
2994.1 527063906 527122021 527114511 527073383 527013779 527021408 527051389 526953399 526785493 526669919 526580453 526442230
3016.5 526442230 526246727 526022077 525707424 525299132 524866700 524369180 523801386 523229241 522666395 522038281
3036.9 522038281 521306574 520542145 519781232 519035876 518341184 517668426 516905904 516064525 515317857 514647007
3057.3 514647007 513850033 512951612 512134314 511424065 510729492 509997010 509226859 508421302 507603407 506800950
3077.7 506800950 506020665 505242646 504450977 503683627 502928734 502125561 501312315 500584364 499886662 499059767
3098.1 499059767 498149335 497290909 496437937 495555848 494707108 493848711 492898792 491930991 491023958 490109921
3118.5 490109921 489164889 488218069 487249494 486268699 485239357 484138191 483066887 482019335 480931610
3136.8 480931610 479869723 478849858 477785647 476648271 475477248 474315941 473187029 472039193
3153.2 472039193 470824093 469567358 468305022 467070699 465861201 464630753 463385165 462130696
3169.5 462130696 460814178 459464252 458178759 456937045 455624253 454238415 452898175 451602757
3185.8 451602757 450276822 448976636 447715819 446383268 444993317 443657339 442363083 441062510
3202.1 441062510 439771622 438467324 437136680 435808688 434503734 433226824 431934953 430644840
3218.4 430644840 429399550 428138435 426819235 425525010 424327791 423163712 421956658 420692831
3234.7 420692831 419387877 418079197 416806519 415627390 414530724 413381577 412125945 410850108
3251.1 410850108 409636080 408499599 407354265 406119198 404846907 403605342 402384371 401186675
3267.4 401186675 400039047 398902923 397751510 396633625 395538568 394410461 393312573 392304540
3283.7 392304540 391294003 390242517 389250606 388336450 387370646 386302948 385213792 384146273 383144319
3302 383144319 382215351 381254911 380211562 379130065 378056526 376969993 375817746 374612868 373403341
3320.4 373403341 372191697 370970666 369728774 368416160 367030799 365628779 364309192 363112569
3336.7 363112569 361873686 360502899 359136313 357835144 356571108 355375141 354203761 352977961
3353 352977961 351758540 350597829 349463612 348342866 347263724 346265674 345303833 344261974 343116254
3371.4 343116254 342002094 341000438 340061575 339149833 338234901 337345570 336536676 335804462 335155308
3389.7 335155308 334527820 333803505 333063066 332475096 331963360 331323743 330570877 329930633 329490900 329121351
3410.1 329121351 328712374 328251600 327750683 327359319 327168852 326965481 326679289 326516926 326531142 326586664
3430.5 326586664 326656014 326749086 326735646 326581478 326514155 326609433 326860696 327383280 327870458 328103542
3450.9 328103542 328347683 328700304 329141647 329665631 330206245 330760717 331431031 332228601 332904279 333375216
3471.3 333375216 333929092 334677607 335439116 336213976 337089747 337917566 338725090 339657813 340579361 341415316
3491.7 341415316 342319399 343362182 344314516 345145464 346337557 347708285 348609358 349488765 350777626
3510.1 350777626 352051824 353117824 354142994 355157465 356184065 357495129 359027833 360488921
3526.4 360488921 361984432 363408774 364551842 365784287 367305726 368660450 369702935 370948941
3542.7 370948941 372897565 375040233 376428127 377680808 379472196 381043583 382277995 383739889
3559 383739889 385102749 385947168 387831032 391979784 395248801 396037728 396695524 398272634 400210172
3577.4 400210172 402155399 403638095 404453754 406378180 410648942 413730085 414338350 415671915 418187439
3595.7 418187439 420340031 422459066 424467027 425385743 426518172 429551929 432818562 435014278
3612.1 435014278 436480314 437243342 439824343 443980396 445191741 443597227 443590313 450064451 457218975
3630.4 457218975 458338499 458563358 459882170 461286962 462658525 462976962 462106138 463569134 470944107
3648.8 470944107 477532715 476936191 476077348 479008943 480864435 480835110 480885178 480008185 479328930
3667.1 479328930 482551247 485721022 485670865 490022331 494891405 493972510 491924375 489676744 487342715
3685.5 487342715 488907218 494666666 497165352 495307267 493090868 491814256 492196053 494731873
3701.8 494731873 495964199 494188249 492997855 495893121 501442432 502723992 499862164 497608393
3718.1 497608393 497308493 497982293 498920858 499526143 497894764 495215148 495391309 499637634 504165828
3736.5 504165828 503097296 497180879 495067954 500667870 502135634 500131309 504407287 507996738
3752.8 507996738 505094349 502154768 502913296 503550291 501762688 500717103 501139641 502806664 504432857
3771.1 504432857 503222942 500701845 500068963 501854479 502706885 501971662 501879454 501741529 501031458
3789.5 501031458 499949157 498723924 498506069 497913122 498188466 501776040 502278507 501441360 503309250
3807.8 503309250 501945198 497337371 495412886 497707516 498397917 499564350 503130078 502149522 499462724
3826.2 499462724 498006970 496845156 496208757 495394677 496375263 499996603 501544774 500879347 499788642
3844.6 499788642 496615827 491114587 487755954 494996935 505291045 503204644 496898860 493759304
3860.9 493759304 494362354 495405376 494117320 494721919 497523725 497876346 496324182 493537873 492589384
3879.2 492589384 493613333 493455410 494701207 494912088 493159592 494209707 494580239 491181999 488613963
3897.6 488613963 489428192 492009908 494941771 495978773 494048148 491757035 490257710 489022851
3913.9 489022851 489142299 490555048 490872592 490002245 489815205 489718646 488616943 488301396 489485174
3932.3 489485174 489879429 488776773 487425327 486853004 487460464 487714261 487060666 487038344 487328291
3950.6 487328291 486991137 486468196 486107707 485806555 485715806 485711455 485380083 484990150 484802544 484589666
3971 484589666 484377414 484309435 484200120 483987510 483819187 483667374 483412832 483149856 483030736 482870579
3991.4 482870579 482584625 482394874 482250541
3997.5 482250541
##END=$$ End of the data block
