##TITLE=$$ Begin of the data block
##JCAMP-DX=5.00 $$ ACD/SpecManager v 10.08
##SPECTROMETER/DATA SYSTEM=Alpha
##DATE=11 Jun 2014 19:36:16
##DATA TYPE=INFRARED SPECTRUM
##DATA CLASS=XYDATA
##ORIGIN=
##OWNER=
##NPOINTS=1765
##FIRSTX=399.75695801
##LASTX=3997.56933594
##MAXX=3997.56933594
##MINX=399.75695801
##MAXY=0.69508994
##MINY=0.11350524
##XFACTOR=1.0000000000
##YFACTOR=1.000000000000000e-9
##FIRSTY=0.42130294
##DELTAX=2.03957629
##XUNITS=1/CM
##YUNITS=ARBITRARY UNITS
##XYDATA=(X++(Y..Y))
399.8 421302944 429840714 438121229 447154224 455658585 463331938 471347839 479173958 485636890
416.1 485636890 492576599 500225723 505227685 509172261 514315486 519455016 523665190 527959228
432.4 527959228 532685101 536844194 540314376 544115722 548189044 551227033 553665280 556541562
448.7 556541562 558932006 560485482 562395215 564406812 565057158 565456033 566889942 568014145 568440259
467.1 568440259 569814146 572100997 573870122 576009750 579796612 583412290 585497499 588026941
483.4 588026941 591677248 594198346 595630109 597977579 600289285 601151347 602421582 604833901 606030762
501.7 606030762 605906069 607083321 608936489 609103501 608909607 610211670 611145854 610612333 611030459
520.1 611030459 612606525 612734258 611873269 612648666 613943636 613679230 613672376 615487993 616801023
538.4 616801023 616673291 617668390 619878113 620727181 620790660 622161448 623402059 622938812 622867703 624303699
558.8 624303699 625096202 624965549 626221657 628366470 628886998 628699124 629902601 631007493 630592167
577.2 630592167 630880713 632701516 633431196 632857502 633661389 635335922 635375500 634952903 636095285
595.6 636095285 636981249 636196911 635859787 636409402 635383189 633262694 633002043 633889019 633336186
613.9 633336186 632574081 633716762 634975255 634909868 635690749 637766123 638491869 638098001 639317513
632.3 639317513 641434908 642033994 642396152 644353628 645869851 645513177 645583689 646772385 646715641
650.6 646715641 645655096 645979583 646634459 645503461 644489348 645341814 645586967 643017352 641350925
669 641350925 643208265 643848002 643077791 643465877 644317150 643572628 642641366 643058598 642759204 640570998
689.4 640570998 638672411 637366772 634232044 629311323 624659359 619517565 611832500 602608979
705.7 602608979 593721747 584918261 576503992 570194244 566105485 563398242 564044058 571100771 583556592
724 583556592 598123789 613646507 629520714 643098772 652752638 660202026 666549504 670543909
740.4 670543909 672591209 674959660 677360237 678088784 678265035 679549336 680599213 680267274 680273592
758.7 680273592 681349576 681698501 681171358 681582093 682456613 682050645 681294203 681714833 682146251 681593657
779.1 681593657 681596637 682623088 682879090 682209730 682278931 682669938 681830764 680790186 681044161 681370258
799.5 681370258 680690527 680450201 681174636 681178451 680222511 679781079 679560363 678253174 676712215 676140785
819.9 676140785 675366163 673500419 671929777 670982778 669097126 666221142 663637817 660885096 656710029
838.3 656710029 651633680 645843208 636965990 625183523 617015004 615554035 614272833 607568026
854.6 607568026 596176863 580855966 560375094 533243895 495686144 441095531 371978015
868.9 371978015 310603380 277930051 271494955 282128483 310049921 355787128 413646847 476288378
885.2 476288378 536456287 585951746 620361805 642516673 657564223 667938828 674879730 680251122
901.5 680251122 684688449 687540531 689336479 691214740 692759693 693362176 693894207 694818854 695089936
919.8 695089936 694486737 694120824 693981290 693020761 691570401 690723717 690073729 688864172 687811852
938.2 687811852 687411129 686705530 685383916 684343040 683547556 682025969 679964125 678168774 676162183
956.6 676162183 673321962 670382559 667796791 664733410 661038160 657606125 654340982 650295138
972.9 650295138 645677805 641294956 636689186 631123364 625251830 619794607 614190519 608231485
989.2 608231485 602759302 597891629 592894614 587901592 583505690 579212189 574330747 569339395
1005.5 569339395 564797103 560213566 555327535 550815463 546870351 542940974 539166808 536207080
1021.8 536207080 533809662 531355381 529234529 527999163 527197123 526437163 526104033 526185930 525895000
1040.2 525895000 525008738 524104476 523277938 522271097 521534503 521695137 522558630 523700058 525276005
1058.5 525276005 527329683 529108822 530083179 530492842 530235887 528765619 526322007 523747146 521209836
1076.9 521209836 518558562 516317487 515044510 514611304 515050590 516907334 520066559 523373306 525922179
1095.2 525922179 527649999 528533101 528602719 528537691 528980315 529712737 530427814 531436563 532851577
1113.6 532851577 534096658 534846544 535438359 535940647 536021650 535827219 535810828 535869420 535648406 535280049
1134 535280049 534894705 534107804 532862127 531721234 530849576 529919326 529026330 528534591 528204083 527628064
1154.4 527628064 527061343 526878059 526954591 527256370 528165877 529659688 531133711 532399416 533817649
1172.7 533817649 535384357 536769867 538046300 539341688 540247142 540384054 540017724 539394200 538265646
1191.1 538265646 536628902 534871995 533054650 530992031 528887272 527031898 525229752 523253322
1207.4 523253322 521301031 519419134 517247736 514692485 512087226 509522378 506720304 503737807
1223.7 503737807 500885248 498095751 495174885 492274046 489538908 486809433 484005541 481284142
1240.1 481284142 478668153 475928754 473077148 470336944 467655033 464808673 461852729 458945811
1256.4 458945811 455982834 452899784 449858963 446928293 443915188 440756977 437603801 434461534
1272.7 434461534 431164563 427742988 424342394 420873672 417244136 413537294 409803271 405891687
1289 405891687 401756346 397540003 393293262 388873369 384249449 379573435 374847949 370001018 365076602
1307.4 365076602 360197365 355316013 350384384 345521837 340732783 335843474 330860406 325870752
1323.7 325870752 320780635 315495998 310041904 304605931 299290180 293974727 288386315 282553107
1340 282553107 276865691 271362573 265815496 260144353 254374653 248569965 242780507 237001032 231309593
1358.3 231309593 225596473 219646260 213780969 208266035 202810615 197481155 192251354 186879903
1374.7 186879903 181732923 176905379 172154486 167567283 163291559 159089550 154915810 151051119
1391 151051119 147174150 142998204 138908148 134950146 131200418 127787530 124517016 121633127 119254000
1409.3 119254000 117240377 115618534 114453807 113720879 113505237 113845974 114638500 115795031 117202915
1427.7 117202915 118874557 120588519 122154132 123909391 125823215 127286240 128500953 129657432
1444 129657432 130735770 131786764 132718787 133462667 134100631 135051101 136396721 137463287 138399154
1462.4 138399154 139689595 141192630 142521292 143961400 146000654 148265496 150248095 152160168
1478.7 152160168 154231876 156508431 158856645 161470324 164665610 168190584 171358123 174645945
1495 174645945 178832218 183166236 186883137 190100670 194006145 199688733 204526931 208158359 211802140
1513.4 211802140 215730622 219921738 224124610 228750184 233167097 236973211 240882114 244491294
1529.7 244491294 248163253 252423376 256008983 259116173 263804525 269072264 273250937 277179897
1546 277179897 281163275 285605520 290319294 295111179 299942613 306783915 315168351 320447385 325016707
1564.3 325016707 330138415 335532337 341046751 345386922 349356025 354221582 358276784 361364841
1580.7 361364841 364466816 367516905 370377809 373065025 375497550 377701223 379846931 381874830
1597 381874830 383686781 385313988 386827439 388209194 389524102 390787303 391805947 392480940 393221289
1615.3 393221289 394229054 394837022 395263046 395941734 396611005 397183806 397715539 398149490 399022192
1633.7 399022192 400785744 402324885 403339148 404504269 405990005 408283412 410854727 412394166
1650 412394166 414714158 418820024 421311468 423002630 425355941 428596020 431949526 434679300 437896103
1668.4 437896103 441901177 445249498 448622912 452341408 455377340 458095551 461679548 466786802
1684.7 466786802 470780641 473625869 476699501 479637861 483304232 487583876 491643786 496249378
1701 496249378 499684960 502493501 505676746 508419514 510843992 513231158 515945971 519503832 522488534
1719.3 522488534 524197161 525949180 528073668 530097365 531982005 533921182 536865354 539630949
1735.7 539630949 541080832 542905092 545147538 547033072 548844874 550916910 553396285 555695355
1752 555695355 557287097 558906972 560674787 562312067 564216554 565780520 566881180 568102419 569537997
1770.3 569537997 571289480 572525382 572863817 573001504 573019445 572557807 571576893 570097566 568201661
1788.7 568201661 566305161 564615607 562794864 560990930 559808612 559525192 559885681 560681283 562082708
1807 562082708 564297795 567193568 570220828 573256493 576509595 579722643 582567215 585317492 588088930
1825.4 588088930 590422273 592706680 594915986 596495986 597904980 599375904 600539267 601573944
1841.7 601573944 603234112 605007470 606060445 606892586 607810915 608772278 609753311 610698104 611610889
1860.1 611610889 612482905 613211930 613960743 615145624 616357565 617003143 617519140 618230402 618992686
1878.4 618992686 619705856 620402098 621088266 621703088 622440457 623271227 623905480 624528825 625196517 625757277
1898.8 625757277 626314700 626887858 627444625 628053963 628725111 629320681 629704595 630020499 630625784 631340265
1919.2 631340265 631824374 632353604 632870436 633248568 633676648 634116352 634496093 634868085 635242701 635597229
1939.6 635597229 636101305 636680603 637035787 637263834 637539864 637856722 638182163 638500452 638796270 639064968
1960 639064968 639266253 639468968 639826894 640273154 640631497 640953064 641296446 641616583 641936243 642244399
1980.4 642244399 642519295 642763555 643002927 643233001 643497407 643821061 644048989 644189775 644381762 644618571
2000.8 644618571 644836187 645014048 645183682 645387352 645595908 645760596 645930231 646162152 646348655 646429062
2021.2 646429062 646533728 646718919 646922231 647097349 647257686 647405028 647526264 647635937 647771120 647935688
2041.6 647935688 648081541 648236394 648415983 648573339 648708701 648848832 649002254 649170458 649324298 649448812
2062 649448812 649602830 649767518 649871588 649966478 650108457 650247633 650361180 650490284 650635660 650759459
2082.4 650759459 650857151 650943339 651037514 651149631 651244879 651328683 651425779 651526749 651605487 651639521 651662648
2104.8 651662648 651715279 651775897 651806295 651825130 651863098 651903391 651908755 651903331 651942790 652002394 652023017 652021945
2129.3 652021945 652041018 652045429 652029395 652043879 652078748 652098238 652133405 652205825 652267873 652305245 652370393 652479768
2153.8 652479768 652571678 652650356 652782679 652949512 653075755 653166413 653287530 653450251 653620183 653763175
2174.2 653763175 653894067 654044628 654211998 654395640 654585361 654720902 654797077 654908538 655073524 655211926
2194.6 655211926 655318081 655440927 655530632 655556917 655607700 655707300 655782402 655836105 655931413 656036079 656082511
2217 656082511 656105995 656175792 656248868 656287014 656345189 656429827 656464815 656444550 656462610 656552851 656650960 656703234
2241.5 656703234 656752408 656815946 656822801 656771898 656750858 656776071 656798482 656847298 656917155 656928957 656893134 656892002
2265.9 656892002 656949639 657021880 657108963 657219350 657282114 657295346 657362401 657434165 657354832 657138109 656912744
2288.4 656912744 656680644 656369090 656041265 655755877 655436456 655018330 654504299 653912127 653206229 652388453
2308.8 652388453 651649952 651118636 650509059 649506330 648326814 647404552 646798730 646164596 645364404
2327.1 645364404 644762754 644579768 644463241 644126117 643753111 643597484 643922687 645423114 647839606
2345.5 647839606 648335278 645898104 642492294 639965296 638486445 637841165 637970269 638698339 640153825
2363.8 640153825 642179132 644311666 646428466 648555219 650567830 652319193 653781295 654974580
2380.2 654974580 655817270 656268895 656445682 656495988 656465888 656366885 656254232 656174660 656107008 656007886 655879676
2402.6 655879676 655744076 655608892 655493140 655400157 655260146 655057728 654870093 654717803 654567242 654408216
2423 654408216 654225051 654001117 653751910 653514504 653312862 653091192 652826786 652554333 652239501 651847184
2443.4 651847184 651415825 651005328 650612473 650174499 649686813 649172485 648564160 647830248 647042632 646236062
2463.8 646236062 645372689 644436061 643437028 642324090 641039133 639596581 638054729 636438429 634740710
2482.1 634740710 632957578 631050050 629014134 626972258 625054717 623256743 621513546 619817674
2498.5 619817674 618193090 616624951 615109265 613659680 612243414 610831499 609453976 608191133
2514.8 608191133 607059479 606024623 605130494 604458570 604053319 603902578 603975594 604273260 604794025
2533.1 604794025 605523348 606428802 607458770 608579755 609782457 611061513 612349451 613525510 614560723
2551.5 614560723 615528405 616404474 617108703 617698669 618226349 618658006 618997216 619279802 619512498 619666874
2571.9 619666874 619750202 619809031 619840980 619821191 619768023 619718850 619661748 619538009 619373262 619240403 619140804
2594.3 619140804 619060695 618998230 618941069 618886948 618857741 618859291 618881047 618941963 619063437 619233489 619420826
2616.8 619420826 619624197 619886816 620215476 620535553 620822668 621142864 621506393 621836007 622095525 622351348
2637.1 622351348 622626901 622870028 623067677 623234034 623364389 623458326 623522878 623527944 623438418 623290837
2657.5 623290837 623159111 623027861 622812986 622515380 622215867 621944427 621674120 621408999 621135890 620813787
2677.9 620813787 620468795 620164454 619890392 619561911 619177520 618816853 618467033 618084252 617708445 617380381
2698.3 617380381 617084205 616771817 616393864 615972996 615569711 615170598 614777386 614436150 614089310 613671362
2718.7 613671362 613233685 612804711 612370789 611981750 611647964 611293197 610886216 610469043 610088646 609728694
2739.1 609728694 609346569 608950794 608566046 608169854 607742608 607340813 606987953 606588006 606105864 605631888
2759.5 605631888 605205476 604775667 604326427 603887618 603431463 602903247 602353096 601869941 601407290 600878179
2779.9 600878179 600314796 599766374 599159241 598463118 597805560 597203732 596545160 595835090 595151782 594486058
2800.3 594486058 593766630 592989683 592191756 591349185 590473652 589629412 588791370 587880313 586892903 585915864
2820.7 585915864 584959328 583936274 582848728 581738532 580543876 579213321 577800095 576319873
2837 576319873 574738383 572993219 570965409 568596005 566026866 563650966 561839938 560629129 559773624
2855.4 559773624 559003592 558219314 557390928 556415558 555276871 554065406 552782416 551466763 550316453
2873.7 550316453 549425781 548634768 547806501 546984732 546188176 545388043 544586778 543784201 542974949 542191505
2894.1 542191505 541522086 540936828 540294111 539600134 538929522 538223267 537334919 536181211 534819484
2912.5 534819484 533373594 531981230 530803800 529936612 529343009 528978944 528836310 528887987 529114485
2930.8 529114485 529453993 529840052 530264616 530673981 530994177 531252682 531483591 531629264 531645298 531551003
2951.2 531551003 531375408 531120539 530817330 530530989 530302525 530186176 530206859 530281007 530299246 530294299
2971.6 530294299 530410409 530647159 530914068 531282187 531776547 532217443 532518983 532767057 532959044 533058822
2992 533058822 533148229 533231676 533254802 533226252 533189654 533206761 533218741 533109486 532919765 532784343 532710552
3014.5 532710552 532599688 532441854 532247305 531922698 531484842 531028807 530532777 529997766 529438674 528863311
3034.9 528863311 528243065 527495265 526704371 525977552 525267124 524544358 523828149 523070872 522250473 521462917
3055.3 521462917 520718932 519909024 519041181 518224716 517489314 516768575 516010404 515237510 514463246 513658047
3075.6 513658047 512840509 512059093 511283219 510466516 509675205 508950949 508189917 507348359 506555438 505833268
3096 505833268 505015373 504105091 503224850 502357125 501473069 500594556 499706537 498761594 497786224 496857166
3116.4 496857166 495943815 495007604 494075537 493121505 492107242 491003305 489861757 488798857 487745047
3134.8 487745047 486624539 485519886 484454900 483362913 482222050 481092066 479983330 478806287
3151.1 478806287 477533370 476254821 474997222 473723978 472457558 471223742 469994724 468753159
3167.4 468753159 467503369 466203183 464849740 463516265 462229222 460914701 459516793 458106488
3183.7 458106488 456755102 455415994 454067618 452731043 451349378 449969977 448687732 447403848
3200.1 447403848 446049899 444680393 443299949 441953272 440683395 439402193 438080460 436735272
3216.4 436735272 435394019 434118897 432846069 431483030 430106670 428844690 427658170 426440239
3232.7 426440239 425157428 423825204 422497302 421206087 419982702 418844312 417669743 416366577
3249 416366577 415041804 413806587 412652463 411495656 410250098 408943415 407676637 406475306 405305296
3267.4 405305296 404168755 403047115 401914597 400779992 399631977 398491412 397374332 396262109
3283.7 396262109 395168006 394135088 393186331 392234027 391165048 390033156 388967544 387949914 386926621
3302 386926621 385936558 384961188 383928120 382803649 381620765 380447000 379278839 378087103 376862794
3320.4 376862794 375614494 374381542 373114526 371740520 370289266 368822992 367443472 366168946
3336.7 366168946 364840865 363418013 362036079 360710889 359396130 358136117 356898069 355624080
3353 355624080 354390323 353228182 352081329 350918412 349751562 348663777 347662747 346607208 345417082
3371.4 345417082 344220370 343150705 342190713 341255724 340297312 339407265 338622779 337849647 337131441
3389.7 337131441 336491317 335736066 334905386 334265471 333780736 333202064 332474828 331802934 331299394 330872297
3410.1 330872297 330449849 330025524 329590499 329231590 329020977 328790337 328480840 328294724 328264892 328245044
3430.5 328245044 328273207 328385144 328406662 328292280 328258693 328358173 328557193 328997135 329449087 329692036
3450.9 329692036 329974711 330401361 330903649 331465781 332073092 332707971 333408326 334169745 334803462 335293710
3471.3 335293710 335904390 336670160 337420464 338242084 339220345 340126127 340971768 341944844 342886716 343698233
3491.7 343698233 344624639 345748961 346739054 347572744 348789692 350207210 351138532 352027386 353392094
3510.1 353392094 354820281 356002241 357060015 358065486 359084338 360427171 362028658 363574654
3526.4 363574654 365146726 366608620 367777914 369061798 370667219 372102469 373185813 374499768
3542.7 374499768 376593739 378857583 380265176 381535530 383424163 385103464 386393726 387904793
3559 387904793 389343619 390272409 392247081 396464139 399779350 400653273 401437789 403171003 405266970
3577.4 405266970 407296509 408792049 409655213 411684632 416057199 419236332 419931680 421325147 423934549
3595.7 423934549 426201344 428406715 430525303 431563169 432765156 435857356 439241290 441595167
3612.1 441595167 443214387 444111556 446804732 451090783 452450722 450977236 451037705 457524806 464701474
3630.4 464701474 465885431 466199577 467629164 469158441 470647275 471056819 470255256 471807808 479352772
3648.8 479352772 486113787 485553682 484648764 487594277 489555985 489628345 489721894 488863528 488263071
3667.1 488263071 491637498 494921923 494929254 499341577 504230917 503293335 501232684 498987317 496667445
3685.5 496667445 498233467 504011214 506579757 504805326 502673984 501446605 501845062 504446924
3701.8 504446924 505757749 503973365 502743900 505694687 511338115 512624443 509741902 507487297
3718.1 507487297 507199824 507894158 508833468 509441197 507827103 505174756 505392134 509646595 514158607
3736.5 514158607 513065994 507083118 504911661 510521114 512034833 510143101 514639497 518357337
3752.8 518357337 515374064 512276113 512938917 513615966 511923015 510895491 511242568 512897372 514653027
3771.1 514653027 513530731 511006594 510383666 512170732 512973607 512199402 512143552 512100101 511428177
3789.5 511428177 510271549 508971393 508736312 508118629 508404434 512104928 512699366 511876941 513741732
3807.8 513741732 512335956 507657707 505702853 508067369 508850336 510050654 513656318 512679398 509923995
3826.2 509923995 508380294 507160485 506525278 505747676 506806314 510563493 512172461 511403799 510195732
3844.6 510195732 507037878 501607299 498273492 505550146 515938103 513913691 507585406 504318774
3860.9 504318774 504793108 505840182 504612803 505204797 507967830 508376300 506915152 504175246 503296137
3879.2 503296137 504401982 504226267 505438864 505650997 503853321 504875541 505287170 501926422 499370724
3897.6 499370724 500191987 502791703 505762577 506811202 504833758 502500176 501008689 499812722
3913.9 499812722 499981582 501429141 501732945 500832677 500660300 500593424 499473155 499129206 500323117
3932.3 500323117 500732362 499649823 498334050 497744143 498273224 498505205 497955143 498068780 498406380
3950.6 498406380 498029500 497429609 497034252 496741682 496604562 496556014 496267527 495901108 495661199 495469958
3971 495469958 495396227 495435745 495325387 495040148 494830638 494693518 494409323 494043887 493837237 493730843
3991.4 493730843 493634969 493592054 493464291
3997.5 493464291
##END=$$ End of the data block
