##TITLE=$$ Begin of the data block
##JCAMP-DX=5.00 $$ ACD/SpecManager v 10.08
##SPECTROMETER/DATA SYSTEM=Alpha
##DATE=11 Jun 2014 19:36:16
##DATA TYPE=INFRARED SPECTRUM
##DATA CLASS=XYDATA
##ORIGIN=
##OWNER=
##NPOINTS=1765
##FIRSTX=399.75695801
##LASTX=3997.56933594
##MAXX=3997.56933594
##MINX=399.75695801
##MAXY=0.69522357
##MINY=0.11365112
##XFACTOR=1.0000000000
##YFACTOR=1.000000000000000e-9
##FIRSTY=0.42044556
##DELTAX=2.03957629
##XUNITS=1/CM
##YUNITS=ARBITRARY UNITS
##XYDATA=(X++(Y..Y))
399.8D20445561Q714229Q313656Q740425Q328855P550150P797599P868022O589949
416.1D84348446O603927P320672N385428M208148N005777N168557M170537M013717
432.4E26225209M826486M505039L564655L852964L830135K398193K059817K883673
448.7E54146171K597093J748324J941621K094984P89225M08173J488447J131773J50561
467.1E66496372J253009K598345K119005K245247L615678L345012K046407K644300
483.4E86363375L556729K268552J351238K497553K450705Q41498J190007K383292J228988
501.7F04131937l8922J330376J991987J61827k98620J201511Q72552o26504K05576
520.1F08931720J408875K51115n41807R05395J165688m00901k3782J865089J338243
$$ plain form
399.8 420445561 429159790 437473446 446213871 454542726 462092876 469890475 477758497 484348446
416.1 484348446 490952373 498273045 503658473 507866621 512872398 518040955 522211492 526225209
432.4 526225209 531051695 535556734 539121389 542974353 546804488 549202681 551262498 554146171
448.7 554146171 556743264 558491588 560433209 562528193 563317418 563725591 565214038 566345811 566496372
467.1 566496372 567749381 570347726 572466731 574711978 578327656 581672668 583719075 586363375
483.4 586363375 589920104 592188656 593539894 596037447 598488152 599329650 600519657 602902949 604131937
501.7 604131937 604093015 605423391 607415378 607577205 607278585 608480096 609352648 608726144 608931720
520.1 608931720 610340595 610591710 610049903 610955298 612120986 611720085 611696303 613561392 614899635
538.4F14899635j69694R11593K155722P73906K6644J630604J632213l67283k00451
556.8F21292889J394153P15494l58522J142442K198100N31793j66774J391053J252830
575.2F29393458n28633Q3685J696050O89149n11706R41872J827717J71125l73184J127779
595.6F34517312Q48174q83281m15981N68211j045763k202988l00288Q27372o00577
613.9F31312191o75380J224160J293600N3585Q70943K036035O91831l67046J223386
632.3F37663305K046168M98473L42906K029180J537145m67182r179J232028k7358j039028
652.7F43806458L90529P30395j051604r81391P77960J04964k646566j588881J928270
671F41470134O37830p94411M13239R39965o47068q75175L99053l17693k158820j867354
$$ plain form
538.4 614899635 614729941 615641534 617797256 618571162 618597806 620228410 621860623 621493340 621292889
556.8 621292889 622687042 623402536 623044014 624186456 626384556 626916349 626749575 628140628 629393458
575.2 629393458 628864825 628948510 630644560 631333709 630822003 631763875 633591592 633762717 633389533 634517312
595.6 634517312 635365486 634482205 634066224 634634435 633588672 631385684 631085396 631912768 631312191
613.9 631312191 630636811 631860971 633154571 633208156 634079099 636115134 636806965 636439919 637663305
632.3 637663305 639709473 640207946 640550852 642580032 644117177 643649995 643640816 644872844 644845486 643806458
652.7 643806458 644196987 644927382 643875778 642894387 643672347 643777311 641130745 639541864 641470134
671 641470134 642107964 641313553 641726792 642666757 642019689 641144514 641543567 641225874 639067054 637199700
691.4F37199700j295865l166258m923821m585802n129755p713019r165407q808374
707.7E92411399q817375q477509o279945l959716k639293O23464P022322J2408614
724E82291961J4517128J5510202J5898466J3626933R710729P527232O461978M076362
740.4F69620991K042114K284348K261818O01113J51157J333594J068473l35753J6511
758.7F79044366J116693M01258n29945L84212R02057l56973p92324L32951M67003m03524
779.1F80565774Q9109J021088K26557o62744J36554M37975q39949j065731J93417L15070
799.5F80417120n73456j56581O67333r7513r80556m01795j67370j218080j455426n84066
819.9F75449610q35479j874566j534700r06169j893640k933621k597273k750277m178882
$$ plain form
691.4 637199700 635903835 632737577 627813756 623227954 618098199 610385180 601219773 592411399
707.7 592411399 583594024 575116515 568836570 564876854 562237561 562861025 569883347 582291961
724 582291961 596809089 612319291 628217757 641844690 651555419 659082651 665544629 669620991
740.4 669620991 671663105 673947453 676209271 676810384 676961541 678295135 679363608 679027855 679044366
758.7 679044366 680161059 680562317 680032372 680416584 681318641 680961668 680169344 680502295 680969298 680565774
779.1 680565774 680654883 681675971 681902528 681239784 681376338 681814313 680974364 679908633 680102050 680417120
799.5 680417120 679843664 679687083 680354416 680256903 679276347 678874552 678707182 677489102 676033676 675449610
819.9 675449610 674614131 672739565 671204865 670298696 668405056 665471435 662874162 660123885 655945003
838.3F55945003n051196n761802q826852j1753618q194566j465142j271367o730199
854.6F06890261j1413276j5331388k0526170k7170003l7512064n4466456o8967432
868.9C71503472o1213672l2508552o308287J0694861K7955532M5797944N7950765O2706322
885.2D76578385O0158938M9464106L4400583K2120237J4959574J0302186O908357N321741
901.5F80214107M435301K936542J830399J834810J554727O54757N31614R18627L12686
919.8F95223570n97179m51326k23935r78947j440704q46564o55473j177728r74476
938.2F87877238l14951o94692j419246j128972q07166j505494k033532j759171k007008
956.6F76207006k900958l018379k606929l019154l670692l453553l280103m030526
$$ plain form
838.3 655945003 650893807 645132005 636305153 624551535 616356969 614891827 613620460 606890261
854.6 606890261 595476985 580145597 559619427 532449424 494937360 440470904 371503472
868.9 371503472 310289800 277781248 271472961 282167822 310123354 355921298 413872063 476578385
885.2 476578385 536737323 586201429 620602012 642722249 657681823 667984009 674892366 680214107
901.5 680214107 684649408 687585950 689416349 691251159 692805886 693460643 693992257 694910884 695223570
919.8 695223570 694626391 694175065 693951130 692972183 691531479 690684915 690029442 688851714 687877238
938.2 687877238 687562287 686867595 685448349 684319377 683512211 682006717 679973185 678214014 676207006
956.6 676207006 673306048 670287669 667680740 664661586 660990894 657537341 654257238 650226712
972.9F50226712m581451m369915m667103n639613n850792n386829n558968n932748
989.2F08239293n453706m849851n000710n033791m417360m242778m815817m974604
1005.5E69450676m544854m586220m930317m561722l910005l868997l772021k996206
1021.8E36280334k408087k381504k045810j242340q33094p88092l77655N3942k78056
1040.2E25979638q78036r25422q31127j004696p54773J76966R01282J150012J604974
1058.5E25418818K123713J805604R26316L64363k61962j477600k451479k573371k547741
1076.9E21326661k642453k223014j304448m94897M24385J927733L244638L318489K513349
1095.2E26090443J702964Q66354N4717m3213N16116P81834O95527R99272J454472J287997
$$ plain form
972.9 650226712 645645261 641275346 636608243 630968630 625117838 619731009 614172041 608239293
989.2 608239293 602785587 597935736 592935026 587901235 583483875 579241097 574425280 569450676
1005.5 569450676 564905822 560319602 555389285 550827563 546917558 543048561 539276540 536280334
1021.8 536280334 533872247 531490743 529444933 528202593 527369499 526581407 526203752 526257694 525979638
1040.2 525979638 525101602 524176180 523345053 522340357 521585584 521762550 522663832 523813844 525418818
1058.5 525418818 527542531 529348135 530274451 530638814 530376852 528899252 526447773 523874402 521326661
1076.9 521326661 518684208 516461194 515156746 514661849 515086234 517013967 520258605 523577094 526090443
1095.2 526090443 527793407 528659761 528714478 528671265 529187381 529969215 530664742 531664014 533118486 534406483
1115.6E34406483P65741N68569M70757R5308j58787j7881K7001k46942l91066m14789
1136E35104394q04186j249790j143217q58009q92460q59857m88997l31699n76079n75125
1156.4E27324975j62662J15872L08454Q77261J455188J457393J277924J446783J586855
1174.8E35688043J388132J247525J242042Q71480J28805l81946o34432j107157j622915
1193.1E36819577j762926j810551k064526k137363j885057j802027j963973j950860
1209.5E21442294j880348k142667k514780k596199k588451k809704k968967k864957
1225.8E01076221k829343k947151k889961k688945k689212k825916k772063k636254
1242.1D78797376k742082k832502k702087k674818k872586k970398k890974k940565
$$ plain form
1115.6 534406483 535172224 535740793 536211550 536306858 536148071 536130190 536157191 535910249 535519183 535104394
1136 535104394 534300208 533050418 531907201 531049192 530156732 529296875 528807878 528476179 527900100 527324975
1156.4 527324975 527162313 527278185 527586639 528463900 529919088 531376481 532654405 534101188 535688043
1174.8 535688043 537076175 538323700 539565742 540437222 540566027 540184081 539549649 538442492 536819577
1193.1 536819577 535056651 533246100 531181574 529044211 527159154 525357127 523393154 521442294
1209.5 521442294 519561946 517419279 514904499 512308300 509719849 506910145 503941178 501076221
1225.8 501076221 498246878 495299727 492409766 489720821 487031609 484205693 481433630 478797376
1242.1 478797376 476055294 473222792 470520705 467845887 464973301 462002903 459111929 456171364
1258.4D56171364l089905l066391k936780k998948l148377l155530l139168l302693
1274.7D31333572l453702l413826l454954l637552l729373l738016l898710m120946
1291D01886493m217893m270136m452080m645943m686505m733503m849583m925400m884422
1309.4C60221028m877299m919857m866898m808068m893482m979074n010038n107463
1325.7C20758849n262702n416066n407423n311936n343109n615711n831421n680978
1342B76889503n518943n562425n657345n749821n813137n821750n809813n708322n716026
1360.4B25531921n922646n827620n506694n448998n309924n233735n394608n142510
1376.7A81745186m808887m766032m614741m284635m201174m147559l833339l890112
$$ plain form
1258.4 456171364 453081459 450015068 447078288 444079340 440930963 437775433 434636265 431333572
1274.7 431333572 427879870 424466044 421011090 417373538 413644165 409906149 406007439 401886493
1291 401886493 397668600 393398464 388946384 384300441 379613936 374880433 370030850 365105450 360221028
1309.4 360221028 355343729 350423872 345556974 340748906 335855424 330876350 325866312 320758849
1325.7 320758849 315496147 310080081 304672658 299360722 294017613 288401902 282570481 276889503
1342 276889503 271370560 265808135 260150790 254400969 248587832 242766082 236956269 231247947 225531921
1360.4 225531921 219609275 213781655 208274961 202825963 197516039 192282304 186887696 181745186
1376.7 181745186 176936299 172170267 167555526 163270891 159069717 154922158 151088819 147198707
1393A47198707m209459m084572l919512l716365l387242l239118k888277k414912k004564
1411.4A17334686j577027j152433p49305k04802L55356P94194J164705J406535J676798
1429.7A19048707J740694J601860J769997J906544J483321J235128J149267J073405
1446A31008923J070172R52094P66635O91101R92880J316472J037643R38132J295030
1464.4A40069082J516849J356483J450643K011746K239167K010346J955196K083570
1480.7A54693082K294376K377704K605051L182560L565699L221914L304124M156858
1497A79401368M330858L777713L281698L940582N711228M860818L631845L627971L913209
1515.4B16477290M196808M208415M639358M479900L868341L941193L610909L645167
$$ plain form
1393 147198707 142989248 138904676 134985164 131268799 127881557 124642439 121754162 119339250 117334686
1411.4 117334686 115757659 114605226 113855921 113651119 114006475 114800669 115965374 117371909 119048707
1429.7 119048707 120789401 122391261 124161258 126067802 127551123 128786251 129935518 131008923
1446 131008923 132079095 133031189 133797824 134488925 135481805 136798277 137835920 138774052 140069082
1464.4 140069082 141585931 142942414 144393057 146404803 148643970 150654316 152609512 154693082
1480.7 154693082 156987458 159365162 161970213 165152773 168718472 171940386 175244510 179401368
1497 179401368 183732226 187509939 190791637 194732219 200443447 205304265 208936110 212564081 216477290
1515.4 216477290 220674098 224882513 229521871 234001771 237870112 241811305 245422214 249067381
1531.7B49067381M244611L617286L158361M710943N261689M188359L943294L996849
1548B82188773M460931M741460M825026M838109O828815Q437603N346328M598588N124450
1566.4C31390083N406380N546242M333317L917545M829287M070431L121138L120810
1582.7C65735233L024459K807051K666413K452821K197742K096892J980513J770109
1599C84731233J600117J497924J340181J240015J168638R49323O56069P20977R56655
1617.4C94861132N77927M04745O20335N98967N18978N11676M33117Q24988J714408
1635.7D01066273J596213J090675J214982J531302K343685K616525J571416K373606
1652D15404677M218638K591104J767337K426058L312230L432989K798707L262490M038244
$$ plain form
1531.7 249067381 253311992 256929278 260087639 264798582 270060271 274248630 278191924 282188773
1548 282188773 286649704 291391164 296216190 301054299 307883114 316320717 321667045 326265633 331390083
1566.4 331390083 336796463 342342705 346676022 350593567 355422854 359493285 362614423 365735233
1582.7 365735233 368759692 371566743 374233156 376685977 378883719 380980611 382961124 384731233
1599 384731233 386331350 387829274 389169455 390409470 391578108 392527431 393183500 393904477 394861132
1617.4 394861132 395439059 395843804 396464139 397063106 397582084 398093760 398526877 399351865 401066273
1635.7 401066273 402662486 403753161 404968143 406499445 408843130 411459655 413031071 415404677
1652 415404677 419623315 422214419 423981756 426407814 429720044 433153033 435951740 439214230 443252474
1670.4D43252474L383637L418326L784031L114551K763986L592372N150468M086583
1686.7D72546428K941907L154933K988845L682167M277140M099905M698038L515899
1703E01905262K852858L210485K780854K460063K410114K723038L559291L060520J812935
1721.4E26775420J801133K137542K021193J868487J929998K952218K803802J483739
1737.7E43773532J834512K269566J928150J846612K104163K511859K320766J585603
1754E60174763J607657J788020J692056J958490J597047J111269J218497J452506J785219
1772.4E74385524J246929L18766J04248j6928m80294r48131j408100j848817j905680
1790.7E69447517j735806j850069j820624j195848k60114L97920Q15154J423120K231300
$$ plain form
1670.4 443252474 446636111 450054437 453838468 456953019 459717005 463309377 468459845 472546428
1686.7 472546428 475488335 478643268 481632113 485314280 489591420 493691325 498389363 501905262
1703 501905262 504758120 507968605 510749459 513209522 515619636 518342674 521901965 524962485 526775420
1721.4 526775420 528576553 530714095 532735288 534603775 536533773 539485991 542289793 543773532
1737.7 543773532 545608044 547877610 549805760 551652372 553756535 556268394 558589160 560174763
1754 560174763 561782420 563570440 565262496 567220986 568818033 569929302 571147799 572600305 574385524
1772.4 574385524 575632453 575951219 576055467 576038539 575558245 574610114 573202014 571353197 569447517
1790.7 569447517 567711711 565861642 564041018 562845170 562585056 562982976 563798130 565221250 567452550
1809.1E67452550K902210L050744L066778L277898L246784K889455K799570K807916
1825.4E91493905K326130K246798K204358J619756J446545J494766J186013J032174
1841.7F05050445J647770J812041J102209Q51750R17435R42767R58264R48071R47356
1860.1F15178108R01520P53046P65621J174510J208782O54042N24580P37429P97152
1878.4F22694790P40588P09713O83248O27398P97331Q86202O01590N48720O64950O07073
1898.8F29561603N68152N56647N49019O21259P06494O43313M19914L35753O08862O98268
1919.2F35269284M56929N12720N25415L88920M32491M67181M23491L88861L66509L44038
1939.6F39575839M97401N96463L96193K61604K86341L19719L29197L10242K74181K64109
$$ plain form
1809.1 567452550 570354760 573405504 576472282 579750180 582996964 585886419 588685989 591493905
1825.4 591493905 593820035 596066833 598271191 599890947 601337492 602832258 604018271 605050445
1841.7 605050445 606698215 608510256 609612465 610464215 611381650 612324417 613282681 614230752 615178108
1860.1 615178108 616079628 616832674 617598295 618772805 619981587 620635629 621160209 621897638 622694790
1878.4 622694790 623435378 624145091 624828339 625455737 626253068 627139270 627740860 628289580 628954530 629561603
1898.8 629561603 630129755 630686402 631235421 631856680 632563174 633206487 633626401 633962154 634571016 635269284
1919.2 635269284 635726213 636238933 636764348 637153268 637585759 638052940 638476431 638865292 639231801 639575839
1939.6 639575839 640073240 640669703 641065896 641327500 641613841 641933560 642262757 642572999 642847180 643111289
1960F43111289K37226K33114L56495M54188L67820L00586L25143L30985L32177L05473
1980.4F46354496K61367K42233K67029K84195L31402L59535K25484J37389J93238K35200
2000.8F48891568K25902J93715J63734J95861K27153J82211J74225K45511K19107J14322
2021.2F50833309J04069J57357J97947J87695J61707J46985J32322J33217J62899J98186
2041.6F52415693J77383J47403J54376J47581J22010J38343J77860J96755J74820J41144
2062F53993368J61767J57654J05441J20819J89304J94252J43349J05262Q5771Q2373
2082.4F55339360J21117J52826J21117J07646J24693J18673Q6307O2585O4552P3790
2102.8F56372666Q5354P4506M5121K4438K3424L9220N8770M4585K5808N5790O5089
$$ plain form
1960 643111289 643348515 643581629 643938124 644392312 644760132 645060718 645385861 645716846 646049023 646354496
1980.4 646354496 646615863 646858096 647125125 647409320 647740722 648100257 648325741 648463130 648656368 648891568
2000.8 648891568 649117470 649311185 649474919 649670780 649897933 650080144 650254369 650499880 650718987 650833309
2021.2 650833309 650937378 651094735 651292682 651480377 651642084 651789069 651921391 652054608 652217507 652415693
2041.6 652415693 652593076 652740479 652894855 653042436 653164446 653302789 653480649 653677404 653852224 653993368
2062 653993368 654155135 654312789 654418230 654539049 654728353 654922605 655065954 655171216 655256987 655339360
2082.4 655339360 655460477 655613303 655734420 655842066 655966759 656085432 656171739 656234324 656298876 656372666
2102.8 656372666 656458020 656532526 656577647 656602085 656625509 656664729 656723499 656768084 656793892 656849682 656914771
2125.2F56914771J7106j192K9028K7179K0743N0902N9545J7405R119P1347R9182O8069
2149.7F57383204O5267R4592Q9050J00672J73866K18511J68741J07527J14739J50859
2170.1F58667028J70350J51336J45376J71721K00450K24710J99020J15394Q2434J37806
2190.5F60265625J70648J46150J21117J14024Q6426O2049Q9466J24812J00553N3525
2210.9F61334395P8679R8705N2273O5029J30117R2148Q941L0816Q9407O0498P630K0981
2235.4F62069619P7903J14441R6798R4473P5042j8537o2942m590M8280L3558M2617
2257.8F62566662Q7678O6996J7047J3232K4617N2750J19150J46031P6711J4603N6029
2280.2F63241506O9975n3226j87397k15173k00451k43425k89261k78473l19422m33206
$$ plain form
2125.2 656914771 656931877 656930685 656959713 656986892 657007635 657058537 657118082 657135487 657144606 657215953 657315135 657383204
2149.7 657383204 657448471 657543063 657632113 657732785 657906651 658125162 658293903 658401430 658516169 658667028
2170.1 658667028 658837378 658988714 659134090 659305811 659506261 659730971 659929991 660045385 660127819 660265625
2190.5 660265625 660436273 660582423 660703540 660817564 660903990 660966039 661055505 661180317 661280870 661334395
2210.9 661334395 661413074 661511779 661564052 661629081 661759198 661851346 661860287 661891103 661980510 662041008 662048638 662069619
2235.4 662069619 662147522 662261963 662358761 662453234 662528276 662509739 662446797 662442207 662490487 662524045 662566662
2257.8 662566662 662654340 662721336 662738383 662751615 662776232 662828982 662948132 663094163 663170874 663185477 663241506
2280.2 663241506 663311481 663258255 663070858 662855685 662655234 662411809 662122548 661844075 661524653 661091447
2300.6F61091447n27084o00517o90043p85231p35402n26727n85377r99808j201630
2319F54439628r57966o03139n28216o99223o19530k35141j10566l15488m23371k53678
2339.4F49693310K73526J463473K382755N43356k336740l320635k471030j459062p32660
2357.7F44036293N6267Q43704J561820K000511K112150K183795K222419K039432J734078
2376.1F58790469J467943J206994Q56758M82916K14279Q7082J252q2254j15633j10090
2396.5F62799716j04666j00672r6321j17242j36793r1970l9995j03891k03669j94669
2416.9F61609828j42931j48595j60754j56939j86920k36749k57731k28524k15709k39432
2437.3F59635544k67029l07858l65853m10795m08352m04179m39644m88043n29766o09576
$$ plain form
2300.6 661091447 660564363 659963846 659273803 658488572 657753170 657226443 656641066 655641258 654439628
2319 654439628 653481662 652878523 652350307 651651084 651031554 650796413 650685847 650370359 649946988 649693310
2339.4 649693310 649966836 651430309 653813064 654356420 652019680 648699045 646228015 644768953 644036293
2357.7 644036293 644092560 644936264 646498084 648498595 650610745 652794540 655016959 657056391 658790469
2376.1 658790469 660258412 661465406 662322164 662805080 663019359 663106441 663107693 663025439 662909806 662799716
2396.5 662799716 662695050 662594378 662498057 662380815 662244022 662152052 662112057 662008166 661804497 661609828
2416.9 661609828 661466897 661318302 661157548 661000609 660813689 660576940 660319209 660090685 659874976 659635544
2437.3 659635544 659368515 659060657 658694804 658284009 657875657 657471478 657031834 656543791 656014025 655404449
2457.7F55404449o97554p30216p72655q62122r52899j023948j124680j285673j452446
2476F46502256j543998j584947j676739j825094j943529j997411k022207j992106j885593
2494.4F30030632j758099j653552j585424j545071j489222j436472j425684j420021
2510.7F17717087j384139j282632j153052j032412q63612o51180m16995j55568Q4639
2529F10862136L04818N48482P70628R32634J058758J152455J235903J319527J296103
2547.4F19481444J164019J071454J014769Q83579P17044O30677N54859M32730L42429
2565.8F26293004K92182K36332J55628R1672P6711O2048J4603k3603l4094o7294j15752
2588.2F26981437j26362j18255j04249o6697l8982l5167l5882k8967j0133K4318Q3864
$$ plain form
2457.7 655404449 654706895 653976679 653204024 652341902 651389003 650365055 649240375 647954702 646502256
2476 646502256 644958258 643373311 641696572 639871478 637927949 635930538 633908331 631916225 630030632
2494.4 630030632 628272533 626618981 625033557 623488486 621999264 620562792 619137108 617717087
2510.7 617717087 616332948 615050316 613897264 612864852 612001240 611350060 610933065 610777497 610862136
2529 610862136 611166954 611715436 612486064 613418698 614477456 615629911 616865814 618185341 619481444
2547.4 619481444 620645463 621716917 622731686 623615265 624332309 624962986 625517845 625950575 626293004
2565.8 626293004 626585186 626821518 626977146 627068818 627145529 627207577 627222180 627198577 627164483 627097189 626981437
2588.2 626981437 626855075 626736820 626632571 626565874 626526892 626491725 626455843 626426876 626416743 626441061 626524925
2610.6F26524925J56999K10166K29657K49326K95877L30627L04163K80320L33727L93331
2631F29309118L56912K76447K68936K86460K62379K10226J55389J33932J27971J00732
2651.4F31488502J2398j19329j54376r9301j30534k18690k36392k22504k51114l13878
2671.8F29754782l37065k93791k79963l29792l15369k58207k80559l21031l23295l40998
2692.2F26674712l72410l80039l54231l23832l45349l81947l85463l87668l96133l79026
2712.6F22968614l44276l47674l93391m31597m48406m26888l37243k74718l28422m26054
2733F19209945m52816m13239l96252l83794l47078l35992l76105m06205l88504l90946
2753.4F15319014m39883m50372l94345l78012m52698m99427m60029m53472n09500n26309
$$ plain form
2610.6 626524925 626681924 626892090 627121747 627371073 627666950 627997577 628301740 628582060 628915787 629309118
2631 629309118 629666030 629942477 630211413 630497873 630760252 630970478 631125867 631259799 631387770 631488502
2651.4 631488502 631500900 631381571 631227195 631127894 630997360 630778670 630542278 630319774 630068660 629754782
2671.8 629754782 629417717 629123926 628843963 628514171 628198802 627940595 627660036 627339005 627015710 626674712
2692.2 626674712 626302302 625922263 625568032 625244200 624898851 624516904 624131441 623743773 623347640 622968614
2712.6 622968614 622624338 622276664 621883273 621451676 621003270 620576382 620239139 619964421 619635999 619209945
2733 619209945 618757129 618343890 617947638 617563844 617216766 616880774 616504669 616098464 615709960 615319014
2753.4 615319014 614879131 614428759 614034414 613656402 613203704 612704277 612244248 611790776 611281276 610754967
2773.8F10754967m79758m66287n16534n40078n53488o29187o90818o41346n88596o42955
2794.2F05005920p10189p02382o84022p15971p45893p78675q50976q84532q49188q36611
2814.6E97247481r01222r78470r86159r84907j034617j080811j122892j206637j307725
2832.9E87644041j382709j487017j621961j761973k004862k356529k594769k414942
2849.3E72019279j832545j242161q99732p59780p30693p97213r77754j177788j263380
2867.6E62338233j291573j298785j158238r11772p89106p98702p94530p99656q39710
2886E53656161q49366q06809p68125p58409o76036n68867o12617o95645o68347o92547
2906.4E46559393q86380j157463j401961j508653j413643j155079q33451n69702l66270
$$ plain form
2773.8 610754967 610275209 609808922 609292388 608752310 608198822 607569635 606878817 606237471 605648875 605005920
2794.2 605005920 604295731 603593349 602909327 602193356 601447463 600668788 599817812 598933280 598084092 597247481
2814.6 597247481 596346259 595367789 594381630 593396723 592362106 591281295 590158403 588951766 587644041
2832.9 587644041 586261332 584774315 583152354 581390381 579385519 577028990 574434221 572019279
2849.3 572019279 570186734 568944573 568044841 567285061 566554368 565757155 564779401 563601613 562338233
2867.6 562338233 561046660 559747875 558589637 557677865 556888759 556090057 555295527 554495871 553656161
2886 553656161 552806795 551999986 551231861 550473452 549797416 549228549 548615932 547920287 547251940 546559393
2906.4 546559393 545673013 544515550 543113589 541604936 540191293 539036214 538202763 537633061 537266791
2924.7E37266791j60992M3452K13325L34382M29749M69446M21584L35574K73645K33293
2945.1E39860249J76549Q1896o2346j87397k58506k96533k74598k22206j32740J6391
2965.5E38700759J03951O2048K5094J15693K21192K55883L49522M70221M56512L57985
2985.9E41118860K90871J94549Q3209R9182J33454O4016k7239l4810M1783K7716j22249
3008.3E41869342j96695j17838m8876p2718j47462k42829l52621m13001m31239m80116
3028.7E39365947n37634o11603o48081o58214p10428p25985p21991p18414o94693p27415
3049.1E32611489q18670q51035p75456p18415p82311q55803q35061p77841p50482p62403
3069.5E24684012p78794p88272q42452q62062p63535p29442p95960p97451p77960q15809
$$ plain form
2924.7 537266791 537105799 537149251 537362576 537696958 538126707 538596153 539017737 539353311 539626956 539860249
2945.1 539860249 540036798 540118694 540056348 539868951 539610445 539313912 539039314 538817108 538684368 538700759
2965.5 538700759 538804710 538866758 538891852 539007545 539228737 539484620 539834142 540304363 540760875 541118860
2985.9 541118860 541409731 541604280 541687489 541786671 541920125 541984141 541956902 541922092 541963875 541991591 541869342
3008.3 541869342 541672647 541554809 541505933 541433215 541285753 541042924 540690303 540277302 539846063 539365947
3028.7 539365947 538828313 538216710 537568629 536910415 536199987 535474002 534752011 534033597 533338904 532611489
3049.1 532611489 531792819 530941784 530166328 529447913 528665602 527809799 526974738 526196897 525446415 524684012
3069.5 524684012 523905218 523116946 522274494 521412432 520648897 519919455 519123495 518326044 517548084 516732275
3089.9E16732275q29577p65681p64787q87990r35734q60631q49724r06706q96811q82745
3110.3E08151889r57787j012087r87589r70364r51231r35673r77814j021147j090378
3128.7D99247819j128822j045794j044720j145274j146823j096666j137405j196265
3145D90306050j183063j192242j234979j249730j251310j245737j250714j284123j299560
3163.4D79114592j299590j312107j327455j359313j374245j321435j271010j350045
3179.7D68499392j463324j445859j394421j391560j365274j340568j386553j436472
3196D57275361j411319j365066j351803j347154j388133j419127j378745j355141j347870
3214.3D44911003j359701j360387j322955j334577j376689j351327j291632j275569
$$ plain form
3089.9 516732275 515902698 515137017 514372230 513484240 512548506 511687875 510838151 509931445 509034634 508151889
3110.3 508151889 507194102 506182015 505194426 504224062 503272831 502337158 501359344 500338197 499247819
3128.7 499247819 498118997 497073203 496028483 494883209 493736386 492639720 491502315 490306050
3145 490306050 489122987 487930745 486695766 485446036 484194726 482948989 481698275 480414152 479114592
3163.4 479114592 477815002 476502895 475175440 473816127 472441882 471120447 469849437 468499392
3179.7 468499392 467036068 465590209 464195788 462804228 461438954 460098386 458711833 457275361
3196 457275361 455864042 454498976 453147173 451800019 450411886 448992759 447614014 446258873 444911003
3214.3 444911003 443551302 442190915 440867960 439533383 438156694 436805367 435513735 434238166
3230.7D34238166j277745j304865j317769j300425j325667j300573j209915j225113
3247D23976094j311660j296044j221627j221478j264065j258522j231462j229078j257121
3265.3D12685037j282215j234621j186580j193583j176238j145065j148969j121193
3281.6D03196573j076013j115948j126021j016944r57966j034439j109332j097947
3298C94661963j067698j046807j041591j072794j087844j104862j190841j270324j286417
3316.3C84492785j273275j263439j280874j303256j354009j426667j458674j465261
3332.6C73667330j393199j294077j389354j556129j530021j414418j334518j260639
3348.9C62494975j276225j369148j362324j269132j198589j185149j209349j148701
$$ plain form
3230.7 434238166 432960421 431655556 430337787 429037362 427711695 426411122 425201207 423976094
3247 423976094 422664434 421368390 420146763 418925285 417661220 416402698 415171236 413942158 412685037
3265.3 412685037 411402822 410168201 408981621 407788038 406611800 405466735 404317766 403196573
3281.6 403196573 402120560 401004612 399878591 398861647 397903681 396869242 395759910 394661963
3298 394661963 393594265 392547458 391505867 390433073 389345229 388240367 387049526 385779202 384492785
3316.3 384492785 383219510 381956071 380675197 379371941 378017932 376591265 375132591 373667330
3332.6 373667330 372274131 370980054 369590700 368034571 366504550 365090132 363755614 362494975
3348.9 362494975 361218750 359849602 358487278 357218146 356019557 354834408 353625059 352476358
3365.3C52476358j059562j131385j264364j235097j091183j000344j002044j023888
3381.6C43668491r51678q63820q40307p55995o85573p73579p94976o40750n57244o27578
3402C36176991p28249p02858n51313m61966m70370m91440n03868l97176k17855k24769
3422.4C31427127l04192j82063o049K0176L4690R9003M0799j07050p5727N7667K41697
3444.8C31246078N44876N09232K44677K73019L92855M50491N58466O78480P08699P20501
3465.2C36327374P99239P00652N17935O39975Q39859Q27134Q56548R63807Q91269Q77529
3485.6C44241321J044035J060158R36896R73284J108676J011402R39518J327991J471549
3504C54114830R96948R91583J414358J428604J209021J128942J140773J189143J459449
$$ plain form
3365.3 352476358 351416796 350285411 349021047 347785950 346694767 345694423 344692379 343668491
3381.6 343668491 342716813 341852993 341012686 340256691 339571118 338797539 338002563 337361813 336804569 336176991
3402 336176991 335448742 334745884 334194571 333732605 333262235 332770795 332266927 331869751 331651896 331427127
3422.4 331427127 331122935 330940872 330934823 330954999 330989689 331088692 331129491 331022441 330946714 331004381 331246078
3444.8 331246078 331790954 332300186 332544863 332817882 333210737 333661228 334219694 334898174 335606873 336327374
3465.2 336327374 337126613 337827265 338345200 338985175 339825034 340652168 341508716 342472523 343363792 344241321
3485.6 344241321 345285356 346345514 347282410 348255694 349364370 350375772 351315290 352643281 354114830
3504 354114830 355111778 356103361 357517719 358946323 360155344 361284286 362425059 363614202 365073651
3522.3C65073651J634568J567692J652240J551509J207203J368403J769901J562148
3538.6C77387315J184106J417428K146185K302855J527846J427829J995593J766622
3554.9C91155779J395941J613230J512319R88394K059966M330993L450602J034081
3571.3D07541305R36031J827121K139986K126932J678675J036525K173334M535914
3587.6D23995823L363520R03964J602828K740115K342880K307743K272039J189083
3603.9D40717995J310796L216147L509909K458572J728386J018196K846778M445821
3620.2D61252600J498342j332522K09659O629795P351876J384258M70787J531065J633703
3638.6D80629563J657367N91099o85125J639753P657945O901920m07219p73042L035337
$$ plain form
3522.3 365073651 366708219 368275911 369928151 371479660 372686863 374055266 375825167 377387315
3538.6 377387315 378571421 379988849 382135034 384437889 385965735 387393564 389389157 391155779
3554.9 391155779 392551720 394164950 395677269 396665663 398725629 403056622 406507224 407541305
3571.3 407541305 408477336 410304457 412444443 414571375 416250050 417286575 419459909 423995823
3587.6 423995823 427359343 428263307 429866135 432606250 434949130 437256873 439528912 440717995
3603.9 440717995 442028791 445244938 448754847 451213419 452941805 453960001 456806779 461252600
3620.2 461252600 462750942 461418420 461628079 468257874 475609750 476994008 477464795 478995860 480629563
3638.6 480629563 482286930 482878029 482192904 483832657 491490602 498392522 497985303 497212261 500247598
3656.9E00247598K027452J50740J91927p81656o05940L348529L388047J47999M476070
3675.3E12590766M944563q52823j986742k215982k299607J623869N853892K652406
3691.6E20310342j689195k106369j274228L65615K644300J379013j730978j203418
3707.9E16695082K910197N643129J400113k794504k231717k83003P08044R81152O57022
3726.3E23685515j596510k663136J92761M255712M587830j019836n970359k151549
3742.6E19320428N678416J518070j994907M409611L767907k834022k932369P70151
3758.9E27703285O73354j750171j026988L98576J667499J739741j129627k550543o69181
3777.3E25055945J786351Q72374p07984l6836m2975o47724j113295j296997k71440
$$ plain form
3656.9 500247598 502275050 502425790 502617717 501836061 501230121 504578650 507966697 508114696 512590766
3675.3 512590766 517535329 516682506 514695764 512479782 510180175 511804044 517657936 520310342
3691.6 520310342 518621147 516514778 515240550 515606165 518250465 519629478 517898500 516695082
3707.9 516695082 519605279 525248408 526648521 523854017 521622300 521339297 522047341 523028493 523685515
3726.3 523685515 522089005 519425869 519618630 523874342 528462172 527442336 521471977 519320428
3742.6 519320428 524998844 526516914 524522007 528931618 532699525 529865503 526933134 527703285
3758.9 527703285 528376639 526626468 525599480 525998056 527665555 529405296 528275669 525725126 525055945
3777.3 525055945 526842296 527714670 527006686 526969850 526926875 526279151 525165856 523868859 523597419
3795.6E23597419o26027L07142L748775O32942q32379J868248j391530m681349j945436
3814E20677805K356052O68407J080632L698826q01921k712429j568734j193941n77628
3832.3E21627069q08895R50158L716886J682579o34134j084566l128946n526781l502726
3850.7E13290644P186651J0520577j875698o295622l258347M98533J024783j287699
3867E19803822N91159K817929M57823j375854k716541j007676R95159j59681J263380
3885.4E20669520K52008j763761J066804M50909l365278k568602Q41438K613247K963602
3903.7E21159887J077116j941085k292335j421273j184940R6559J398206L06010r18507
3922.1E16279638k22027q6189j096844k98858J274109M50730j133561j352251n79297
$$ plain form
3795.6 523597419 522971392 523278534 527027309 527660251 526827872 528696120 527304590 522623241 520677805
3814 520677805 523033857 523702264 524782896 528481722 527679801 524967372 523398638 522204697 521627069
3832.3 521627069 520818174 521768332 525485218 527167797 526533663 525449097 522320151 516793370 513290644
3850.7 513290644 520477295 530997872 529122174 522826552 519568205 520066738 521091521 519803822
3867 519803822 520394981 523212910 523670733 522294879 519578338 518570662 519565821 519406140 520669520
3885.4 520669520 520921528 519157767 520224571 520675480 517310202 514741600 515583038 518196285 521159887
3903.7 521159887 522237003 520295918 518003583 516582310 515397370 515493929 516892135 517198145 516279638
3922.1 516279638 516057611 515971422 514874578 514575720 515849829 516300559 515166998 513814747 513235450
3940.4E13235450N53369K66671n67674N6565L47435l17454n77927m18246k79724m5002
3960.8E12253463M3392k40683l31879k11775k21431j72735r238o5446k22266j84417
3981.2E10636985j45971k52784k79367j26660j01745j99914j22010r9183
3997.5E09309351
$$ plain form
3940.4 513235450 513788819 514055490 513487816 513544381 513891816 513574362 512996435 512578189 512298465 512253463
3960.8 512253463 512296855 512056172 511724293 511512518 511291087 511118352 511109114 511043668 510821402 510636985
3981.2 510636985 510491014 510238230 509958863 509832203 509730458 509530544 509408534 509309351
3997.5 509309351
##END=$$ End of the data block
