##TITLE=$$ Begin of the data block
##JCAMP-DX=5.00 $$ ACD/SpecManager v 10.08
##SPECTROMETER/DATA SYSTEM=Alpha
##DATE=11 Jun 2014 19:36:16
##DATA TYPE=INFRARED SPECTRUM
##DATA CLASS=XYDATA
##ORIGIN=
##OWNER=
##NPOINTS=1765
##FIRSTX=399.75695801
##LASTX=3997.56933594
##MAXX=3997.56933594
##MINX=399.75695801
##MAXY=0.69518328
##MINY=0.11382748
##XFACTOR=1.0000000000
##YFACTOR=1.000000000000000e-9
##FIRSTY=0.41805845
##DELTAX=2.03957629
##XUNITS=1/CM
##YUNITS=ARBITRARY UNITS
##XYDATA=(X++(Y..Y))
399.8 418058455 426521510 435029328 444097787 452492267 460076988 467918783 475478113 481664926
416.1 481664926 488249838 495763749 501198769 505480587 510570526 515743017 520096540 524334192
432.4 524334192 529049993 533460975 536987364 540416360 543911755 546612144 549158037 552181959
448.7 552181959 554526865 555954874 557787418 559824467 560419202 560616612 561953962 563010335 563290775
467.1 563290775 564795554 567459166 569511890 571784496 575446069 578727961 580590069 583119035
483.4 583119035 586762369 589149237 590598285 593225479 595772386 596615016 597723305 600043774 601348460
501.7 601348460 601349652 602465749 604265809 604473650 604328215 605725646 606770337 606241286 606493771
520.1 606493771 607877910 608051896 607423425 608335912 609636664 609288454 609129548 610818446 612136364
538.4 612136364 612092137 613108575 615312278 616164744 616295397 617780089 619050622 618549168 618466735
556.8 618466735 619958341 620693922 620317876 621405602 623567820 624142051 623966277 625233829 626470864
575.2 626470864 626034319 626075447 627640188 628291070 627855837 628815770 630456090 630447209 630166531 631516993
595.6 631516993 632512748 631728649 631380558 631940901 630851328 628657639 628433108 629414201 628974319
613.9 628974319 628292501 629462481 630776823 630737960 631442130 633445680 634200037 633877456 635113835
632.3 635113835 637152791 637664020 638039410 640003741 641463161 641152501 641359866 642604113 642532468
650.6 642532468 641420364 641615093 642217815 641193271 640261889 641103446 641289890 638707936 637227654
669 637227654 639268339 639968157 639215589 639643312 640532851 639760077 638793230 639227271 638965487 636785030
689.4 636785030 634850681 633535087 630451143 625602424 621025085 615946651 608288527 599088967
705.7 599088967 590258837 581491232 573075593 566851318 562986493 560479581 561167598 568167508 580562294
724 580562294 595073700 610565484 626472771 640100121 649773657 657258868 663664341 667665005
740.4 667665005 669643283 671936810 674286246 674981177 675178230 676513076 677599251 677335322 677440643
758.7 677440643 678556383 678877294 678323448 678733468 679635286 679261565 678513706 678928077 679380119 678907573
779.1 678907573 679002523 680074036 680319428 679657996 679813743 680302978 679539323 678536952 678780258 679106772
799.5 679106772 678433359 678188086 678926110 678957641 678041816 677643239 677451968 676205337 674756348 674203694
819.9 674203694 673395336 671535015 669967055 669029295 667177320 664286613 661653399 658853412 654670835
838.3 654670835 649659693 643937171 635067940 623257279 615073323 613640428 612417161 605729163
854.6 605729163 594273150 578891098 558419228 531328321 493864059 439486712 370709866
868.9 370709866 309740663 277420819 271234363 282064021 310174972 356060475 414021850 476728171
885.2 476728171 536882520 586294830 620605409 642714262 657773376 668147862 675049543 680378914
901.5 680378914 684838951 687748313 689546406 691393793 692938685 693532050 694010258 694901645 695183277
919.8 695183277 694586217 694201887 694016755 693003833 691550910 690731049 690080166 688868999 687862873
938.2 687862873 687521338 686775982 685342371 684268415 683499873 681946874 679818332 678020120 676064134
956.6 676064134 673227131 670228004 667612910 664543867 660794437 657329559 654107928 650089204
972.9 650089204 645443559 641029954 636390626 630793631 624926329 619498253 613927245 608008623
989.2 608008623 602604508 597808182 592823029 587791502 583390951 579156935 574350655 569398463
1005.5 569398463 564869046 560309291 555405617 550846457 546949685 543138146 539412737 536414385
1021.8 536414385 533994675 531583369 529523790 528347135 527598083 526822209 526380062 526346803 526016176
1040.2 526016176 525134027 524214685 523380280 522374630 521627784 521845222 522811711 523962200 525486529
1058.5 525486529 527548015 529358268 530328691 530745685 530505121 529018521 526564538 524013400 521484494
1076.9 521484494 518792033 516487598 515165627 514704108 515138328 517072678 520368278 523704529 526177824
1095.2 526177824 527878940 528799355 528889418 528829813 529318690 530119777 530872345 531916678 533401847
1113.6 533401847 534673929 535383821 535957694 536478698 536574304 536374986 536341429 536389232 536169648 535804927
1134 535804927 535417259 534611404 533333063 532178283 531327367 530451536 529619634 529156983 528820992 528203845
1154.4 528203845 527602792 527451038 527572036 527869999 528765440 530257940 531709373 532939732 534347475
1172.7 534347475 535912931 537285805 538541496 539810896 540675819 540780365 540411115 539772809 538624287
1191.1 538624287 536989033 535237789 533408999 531299949 529135585 527250886 525456309 523503721
1207.4 523503721 521581471 519734144 517596900 515058637 512448132 509891748 507138491 504198551
1223.7 504198551 501328290 498496175 495559186 492667705 489956558 487254322 484453917 481703490
1240.1 481703490 479050487 476294369 473462105 470753670 468064934 465174496 462195963 459311664
1256.4 459311664 456381887 453284681 450174630 447199583 444186240 441021085 437846482 434690386
1272.7 434690386 431408048 428011298 424612522 421136320 417499155 413765997 409994096 406057745
1289 406057745 401919067 397695154 393406957 388951480 384334743 379669338 374941081 370087415 365134358
1307.4 365134358 360217184 355330914 350412250 345529646 340682864 335746586 330765009 325808465
1323.7 325808465 320746154 315471530 310017288 304579407 299270004 293953419 288334966 282474488
1340 282474488 276787460 271284848 265727073 260043859 254259467 248427317 242584065 236764222 231080353
1358.3 231080353 225386024 219442785 213578373 208070740 202634588 197327971 192113519 186748654
1374.7 186748654 181606114 176770747 172014505 167453483 163207412 159027979 154899195 151065037
1391 151065037 147162810 142936990 138829648 134915352 131251276 127912134 124687769 121811122 119415909
1409.3 119415909 117428504 115880467 114767358 114035770 113827482 114187121 114996411 116195709 117640197
1427.7 117640197 119332202 121096425 122735560 124522738 126424432 127905056 129140630 130290046
1444 130290046 131390274 132493377 133433729 134172335 134837136 135785341 137091339 138199896 139239699
1462.4 139239699 140615985 142153293 143493712 144919351 146918729 149202764 151291981 153310865
1478.7 153310865 155430824 157734662 160107523 162719890 165924296 169507354 172722772 176012903
1495 176012903 180203289 184620649 188473418 191775292 195695207 201402947 206302121 210004449 213706046
1513.4 213706046 217640713 221826673 226053521 230721191 235218853 239125773 243132055 246814013
1529.7 246814013 250499964 254738808 258329004 261459291 266190439 271523833 275772750 279773653
1546 279773653 283801287 288280785 293049127 297874510 302675724 309485584 318009943 323431104 328029841
1564.3 328029841 333136648 338533968 344094664 348486781 352449507 357260227 361302227 364415526
1580.7 364415526 367531776 370577663 373419315 376060724 378432512 380572170 382635474 384576261
1597 384576261 386302978 387834996 389259458 390558928 391758025 392863274 393742293 394307733 394886762
1615.3 394886762 395701140 396210819 396545947 397066772 397609234 398125052 398644328 399068922 399864793 401555121
1635.7 401555121 403187066 404363245 405670166 407261729 409646004 412354618 414035827 416478038
1652 416478038 420809597 423578918 425482571 428001523 431419581 434984684 437883765 441202968 445311904
1670.4 445311904 448794127 452327192 456242234 459463477 462300539 465924144 471117973 475334764
1686.7 475334764 478399664 481624365 484647274 488349497 492657304 496806681 501612782 505249500
1703 505249500 508162796 511429787 514291346 516820312 519275546 522042632 525680006 528802872 530637801
1721.4 530637801 532471001 534665644 536740541 538639247 540591419 543578148 546413124 547918379
1737.7 547918379 549791753 552121401 554090321 555939853 558047473 560595572 562968850 564610302
1754 564610302 566280901 568112850 569784045 571718514 573360205 574507594 575707316 577099562 578836679
1772.4 578836679 580132186 580533624 580685556 580708146 580271959 579331219 577886879 575979173 574009359
1790.7 574009359 572262049 570460320 568675995 567493260 567263305 567711174 568559945 569989800 572231710
1809.1 572231710 575169861 578268051 581393898 584728003 587993383 590871572 593659222 596500695
1825.4 596500695 598914981 601251006 603515446 605152845 606598258 608110249 609320998 610366225
1841.7 610366225 612007558 613816321 614931345 615787983 616728008 617731154 618740559 619700968 620654583
1860.1 620654583 621571243 622315526 623055935 624235511 625484526 626183331 626741052 627509952 628339052
1878.4 628339052 629091322 629804075 630508780 631147385 631907642 632765114 633418381 634051442 634761751 635384321
1898.8 635384321 635953605 636498809 637036502 637634635 638316393 638965607 639423847 639788151 640384138 641095638
1919.2 641095638 641623259 642180979 642709374 643104136 643531740 643984497 644425631 644846737 645232618 645600975
1939.6 645600975 646127582 646743834 647150159 647408426 647683263 648022652 648408294 648755848 649026752 649268150
1960 649268150 649487793 649730921 650116324 650592566 650973976 651306093 651683807 652049005 652379870 652689040
1980.4 652689040 652981579 653244197 653502524 653751850 654035330 654396951 654678762 654859304 655063868 655306041
2000.8 655306041 655555069 655763447 655922115 656129241 656379700 656572700 656746447 656987488 657230139 657399833
2021.2 657399833 657536626 657696307 657900751 658091187 658255339 658432782 658601820 658749640 658924639 659142673
2041.6 659142673 659336746 659507215 659696102 659872174 660003483 660148442 660346508 660548925 660711169 660857618
2062 660857618 661044061 661222637 661335826 661458850 661659718 661883473 662061453 662183523 662272394 662373245
2082.4 662373245 662519932 662686467 662828207 662950933 663076580 663215816 663345039 663454592 663552463 663633704
2102.8 663633704 663722277 663833559 663930535 663970709 663982928 664032519 664117336 664170980 664207220 664272785 664335668
2125.2 664335668 664384544 664439380 664490104 664516866 664550602 664616287 664660811 664659321 664708495 664857984 665002823
2147.7 665002823 665091217 665186048 665300846 665386796 665485799 665683448 665926993 666102231 666226804 666378915
2168 666378915 666556954 666729808 666907132 667097390 667274952 667470634 667705774 667917550 668057084 668178082
2188.4 668178082 668356001 668550432 668695509 668823004 668990016 669132173 669208407 669310451 669459343 669579804
2208.8 669579804 669661701 669757307 669860423 669929743 670003772 670128107 670229435 670264184 670317054 670439482 670537889
2231.3 670537889 670553088 670589864 670718670 670861244 670940518 671023071 671134830 671175420 671158314 671186984 671237230
2253.7 671237230 671254337 671321094 671457767 671540856 671542525 671569169 671649575 671734571 671855390 672027886 672143459
2276.1 672143459 672164381 672216415 672303915 672272980 672105193 671932042 671766102 671502471 671178818 670899332
2296.5 670899332 670618057 670247793 669780016 669206858 668489635 667669415 666954219 666463494 665889025 664902925
2316.9 664902925 663719833 662753105 662079334 661432683 660678804 660134435 659968972 659796715 659412086
2335.3 659412086 659033418 658852935 659137726 660615563 663115859 663841009 661607444 658217430 655534744
2353.6 655534744 653886735 653190672 653441787 654281080 655690968 657686412 659920454 662235856 664577782
2372 664577782 666735530 668565989 670108616 671391547 672297835 672782421 672988653 673084497 673103273 673042595
2392.4 673042595 672942102 672854960 672791541 672724009 672653317 672562301 672450781 672359049 672275186 672128975 671941817
2414.8 671941817 671821415 671753526 671648681 671503723 671338618 671142936 670908928 670661747 670465469 670293987
2435.2 670293987 670066476 669790685 669501841 669170201 668784916 668404520 668016493 667557716 667058527 666563690
2455.6 666563690 665999770 665299296 664525151 663737655 662891626 661941648 660904944 659770012 658476233
2474 658476233 657023668 655498683 653912008 652201951 650368631 648429453 646402419 644370079 642401695
2492.3 642401695 640505254 638706386 637020350 635434270 633917987 632438004 630979657 629519045
2508.7 629519045 628080726 626747131 625545025 624420226 623346984 622414410 621764362 621414423 621288240
2527 621288240 621369064 621697366 622286975 623074591 624008596 625092685 626294196 627578080 628952086
2545.4 628952086 630336404 631587505 632692456 633715272 634618044 635367572 636032879 636617064 637091994
2563.7 637091994 637493610 637837768 638111293 638295531 638404012 638495326 638581336 638612807 638572097 638512254
2584.1 638512254 638474047 638418436 638327658 638225198 638111353 638010502 637963712 637968302 637969851 637958467 637997508
2606.6 637997508 638095021 638202846 638339341 638553798 638824105 639114082 639434397 639786422 640125334 640442252
2626.9 640442252 640805066 641220391 641589105 641869366 642139852 642440498 642730236 642987490 643213093 643389702
2647.3 643389702 643524110 643635631 643668294 643589199 643474936 643383980 643266916 643058360 642808437 642603695
2667.7 642603695 642382205 642068982 641762137 641527891 641279221 640969694 640661716 640380502 640067577 639722168
2688.1 639722168 639413476 639127433 638799131 638436735 638107419 637815833 637473702 637073159 636688769 636323988
2708.5 636323988 635941923 635569513 635249972 634922445 634526014 634103119 633675396 633231580 632847965 632566869
2728.9 632566869 632277191 631902874 631505072 631136894 630785465 630438983 630073488 629673302 629272163 628893018
2749.3 628893018 628537416 628189862 627774239 627293050 626866639 626484096 626037836 625568509 625159442 624736011
2769.7 624736011 624211371 623656094 623180509 622744024 622240424 621693611 621147692 620542586 619869649 619239867
2790.1 619239867 618659317 618011296 617283523 616576731 615921140 615231872 614491761 613716066 612846673 611931980
2810.5 611931980 611076415 610241354 609341979 608383119 607418954 606438756 605401039 604319870 603202164
2828.9 603202164 602012336 600713909 599291921 597735703 596053421 594242096 592206597 589834571
2845.2 589834571 587223351 584796667 582955241 581687331 580748379 579968512 579256058 578485012 577502131
2863.5 577502131 576311529 575071692 573802829 572483778 571304142 570392013 569615245 568817079 567972600
2881.9 567972600 567122698 566309929 565541446 564782381 564010978 563241780 562545002 561942220 561320961 560649157
2902.3 560649157 559991837 559284806 558375537 557221830 555871785 554397047 552974880 551796317 550926447
2920.6 550926447 550337732 549981117 549819827 549843311 550076306 550481975 550958991 551444650 551894426 552263260
2941 552263260 552570581 552850962 553083062 553173959 553070903 552872837 552630007 552349269 552109063 551951051
2961.4 551951051 551885784 551916599 551991582 552039385 552096188 552257895 552499235 552745044 553078532 553587019
2981.8 553587019 554125190 554550529 554869950 555064440 555170178 555297494 555411577 555448532 555431604 555417240
3002.2 555417240 555475771 555522382 555407226 555206478 555086493 555036068 554960251 554843783 554674566 554371715
3022.6 554371715 553956985 553515971 553021908 552453220 551843226 551241755 550608754 549856067 549090505 548393011
3043 548393011 547687411 546961963 546202838 545355201 544473588 543698072 543016315 542245507 541352332 540485442
3063.4 540485442 539695859 538908303 538107574 537332654 536549985 535704732 534839749 534039497 533270240 532466590
3083.8 532466590 531666040 530887961 530075729 529236794 528450727 527654171 526723921 525775135 524926484 524055183
3104.2 524055183 523106515 522181749 521275818 520295084 519257665 518243909 517257750 516300082 515349805
3122.6 515349805 514330864 513265014 512157321 511002481 509900510 508811414 507664561 506521046
3138.9 506521046 505362689 504141152 502901435 501682341 500458539 499216020 497959644 496686846
3155.2 496686846 495391071 494054139 492689282 491322637 489942670 488580078 487266362 485938370
3171.5 485938370 484526753 483078390 481699526 480324239 478847027 477365583 475951582 474537551
3187.8 474537551 473101050 471639335 470112145 468596458 467184901 465781122 464318216 462868869
3204.1 462868869 461443633 460013509 458571881 457120627 455694556 454297781 452932686 451588809
3220.5 451588809 450183064 448709249 447283238 445929766 444574207 443214804 441859514 440473437
3236.8 440473437 439082623 437748194 436483681 435253173 433974832 432600975 431202739 429899663
3253.1 429899663 428673208 427399009 426083416 424771458 423452973 422153443 420894712 419672281
3269.4 419672281 418441206 417184263 415942937 414737046 413586885 412484735 411353827 410152286
3285.7 410152286 408957213 407862782 406831890 405737072 404575378 403445661 402323663 401205093
3302 401205093 400143236 399042666 397836149 396580726 395309240 394023776 392703056 391342670 389982373
3320.4 389982373 388639987 387299508 385887653 384352237 382745236 381132722 379588157 378144592
3336.7 378144592 376689166 375129700 373554677 372043073 370584249 369183213 367792308 366346717
3353 366346717 364894897 363502204 362149388 360809475 359514087 358329087 357201159 355973810 354625136
3371.4 354625136 353286743 352049202 350906789 349828154 348767132 347762376 346868336 346021920 345219642
3389.7 345219642 344449282 343583435 342697203 341979504 341389120 340737969 339949012 339188755 338567317 337986737
3410.1 337986737 337435931 336954206 336468339 336053908 335828900 335603029 335283637 335091770 335086495 335106432
3430.5 335106432 335147321 335253537 335290253 335204333 335184395 335295558 335537910 336020261 336489648 336749017
3450.9 336749017 337043375 337507397 338098556 338742554 339401245 340105891 340897948 341766387 342541665 343170702
3471.3 343170702 343867958 344721466 345619231 346580625 347655565 348656029 349577487 350639671 351784617
3489.7 351784617 352835298 353896350 355125010 356301129 357342541 358686358 360202372 361340046
3506 361340046 362522125 364106357 365624756 366903216 368162721 369431376 370708317 372261345 374016613
3524.4 374016613 375712067 377499849 379240006 380678236 382220179 384076357 385756493 387138188
3540.7 387138188 388729721 390965462 393376976 395097673 396706939 398843974 400779992 402383268
3557 402383268 404193908 405926287 407164901 409380406 413803935 417420566 418626606 419709295 421755463
3575.3 421755463 424183011 426565200 428469449 429729223 432070404 436767399 440383464 441527098
3591.7 441527098 443290502 446192592 448760986 451347888 453876227 455284297 456852734 460348457
3608 460348457 464125782 466868341 468884766 470117509 473090947 477707535 479435474 478284091 478645056
3626.3 478645056 485529989 493219316 494860262 495564193 497367710 499251097 501062989 501771390 501235247
3644.7 501235247 502996385 510758281 517872334 517748952 517228961 520486951 522705019 522961199 523238301
3663 523238301 522620678 522158504 525548339 529001534 529250920 533845544 539008319 538341105 536425710
3681.4 536425710 534262240 532009840 533614695 539473116 542236030 540639758 538595200 537425697
3697.7 537425697 537891328 540576756 541962504 540237486 539086998 542081058 547821701 549341500
3714 549341500 546623945 544440627 544214547 544950366 545938671 546646953 545092165 542398691 542589307
3732.4 542589307 546921492 551543415 550518930 544572175 542433441 548129559 549704969 547738671
3748.7 547738671 552191615 556046724 553219855 550185144 550907493 551703811 550057054 549016654 549399436
3767.1 549399436 551096559 552899599 551813185 549245119 548561871 550425708 551402152 550714374 550701082
3785.4 550701082 550750136 550167501 549026906 547668338 547392666 546801865 547133088 550904095 551521242
3803.8 551521242 550628722 552502990 551207125 546606421 544679880 547063231 547825396 548958361 552612901
3822.1 552612901 551774383 549098909 547604263 546452880 545859337 545014679 545908451 549549043 551224232
3840.5 551224232 550664485 549673557 546566308 541018069 537546456 544791400 555338204 553459764
3856.8 553459764 547166765 543938339 544494867 545593381 544339061 544907212 547695637 548107326 546667576
3875.2 546667576 543973327 543092489 544197261 544049621 545277059 545479476 543685675 544809341 545351863
3893.5 545351863 542005301 539396763 540238500 542899132 545885324 547035038 545204818 542919397
3909.8 542919397 541420579 540193260 540290117 541710913 542091131 541290402 541196167 541172206 539999247
3928.2 539999247 539554656 540773392 541339934 540360570 539045870 538451970 539022744 539292157 538726747
3946.5 538726747 538810551 539159238 538854182 538354039 537994862 537712634 537689507 537787497 537550628 537175894
3966.9 537175894 536951780 536756277 536600113 536602855 536556721 536331475 536145806 536016643 535741568 535420716
3987.3 535420716 535316944 535306633 535165727 535012126 534915030
3997.5 534915030
##END=$$ End of the data block
