##TITLE=$$ Begin of the data block
##JCAMP-DX=5.00 $$ ACD/SpecManager v 10.08
##SPECTROMETER/DATA SYSTEM=Alpha
##DATE=13 Jun 2014 08:26:00
##DATA TYPE=INFRARED SPECTRUM
##DATA CLASS=XYDATA
##ORIGIN=
##OWNER=
##NPOINTS=1765
##FIRSTX=399.75695801
##LASTX=3997.56933594
##MAXX=3997.56933594
##MINX=399.75695801
##MAXY=0.68956709
##MINY=0.01463487
##XFACTOR=1.0000000000
##YFACTOR=1.000000000000000e-9
##FIRSTY=0.22230917
##DELTAX=2.03957629
##XUNITS=1/CM
##YUNITS=ARBITRARY UNITS
##XYDATA=(X++(Y..Y))
399.8B22309172J0098130R879172R795039R623826R278744Q802951Q341461Q137971
416.1B96266466R388954R495556O704688N601138O036997O300956N981177N290806
432.4C51066738N283267N806446N743086M982770M462778M510790M255057L388941
448.7C89499873K650797K511978K423645K051949J547992J049817P84993R57817J324534
467.1D04803395J525164K198785L624082M416406M261345M103869M413247M885376
483.4D34231669M528045L405124K756745L017694L297209K761662J776278J275152
499.7D57049578J705289K000988J217067L85046L71367O97523M60476l79205o43521
518.1D62864608L0368N01692J79977l60072k10702N62340R87708O80238N15253J227468
$$ plain form
399.8 222309172 232407302 242286474 252081513 261705339 270984083 279787034 288128495 296266466
416.1 296266466 305655420 315150976 321855664 327456802 333493799 339794755 345775932 351066738
432.4 351066738 356350005 362156451 367899537 372882307 377345085 381855875 386110932 389499873
448.7 389499873 392150670 394662648 397086293 399138242 400686234 401736051 402521044 403478861 404803395
467.1 404803395 406328559 408527344 412151426 416567832 420829177 424933046 429346293 434231669
483.4 434231669 438759714 442164838 444921583 447939277 451236486 453998148 455774426 457049578
499.7 457049578 458754867 460755855 461972922 462357968 462729335 463426858 463887334 463508129 462864608
518.1 462864608 462894976 463396668 463576645 463216573 463005871 463568211 464555919 465236157 465751410 466978878
538.4D66978878K110094K064764J322031J110584J555681J689404J126886K94417K3961
556.8D78276700O20782J154214R14038N49137P52598J124621R14782K47121j8120M82976
577.2D85018849J131744J247108R63956R51171J479655J814067J281411N04225M35323
595.6D94827509P87109M79698o26117j490235j372576p28965n05775n79983j20282
613.9D90670383Q27581J451164J242668Q08507J152247J893878J734078R04709Q27134
632.3E01512349J749277K560079K293229J376390R92954J311839J372933O29604k43485
650.6E13555169m10199j32799k18570q75056j370609r46879O9439N82755n06223j151442
671E08595586j18971P68840N53489k52068m17233r9480m51445j574338k614140l159643
$$ plain form
538.4 466978878 469088972 471153736 472475767 473586351 475142032 476831436 477958322 478252739 478276700
556.8 478276700 478897482 480051696 480965734 481514871 482267469 483392090 484306872 484553993 484535873 485018849
577.2 485018849 486150593 487397701 488361657 489312828 490792483 492606550 493887961 494392186 494827509
595.6 494827509 495614618 496094316 495468199 493977964 492605388 491876423 491370648 490790665 490670383
613.9 490670383 491497964 492949128 494191796 495000303 496152550 498046428 499780506 500685215 501512349
632.3 501512349 503261626 505821705 508114934 509491324 510484278 511796117 513169050 513798654 513555169
650.6 513555169 513144970 513012171 512793601 511918545 510547936 509601057 509670496 510253251 509747028 508595586
671 508595586 508476615 509245455 509798944 509546876 509129643 509030163 508578718 507004380 504390240 501230597
691.4E01230597l753274n155593p146240q261740q525669j0015279j2806267j4729291
707.7D30837244j4359117j1663764q131117n444139k621562K855957J0552466J7709553
724D19735521K2561997K4410904K3395806K0270080J5905320J1434436P892430N604327
740.4E51210821M095554K790570J648665J003623Q73148P76112L64363k7716j1563
758.7E62723577K07126K16305j2040l7849K46823M70579L31342j3590p4208K75016
779.1E64333081O74010P08699L68416P1645o0201l77714p84755r46403p67648k80261
799.5E62938869J42872J37329j75297m12524o00397r54688j389563j681149j758933
817.9E56246519j732409j833916k199947k550424k795755l183306l822386m612982
$$ plain form
691.4 501230597 497477323 492321730 485175490 476913750 468388081 458372802 445566535 430837244
707.7 430837244 416478127 404814363 396683246 391239107 388617545 391473502 402025968 419735521
724 419735521 442297518 466708422 490104228 510374308 526279628 537714064 545606494 551210821
740.4 551210821 555306375 558096945 559745610 560749233 561622381 562398493 562762856 562735140 562723577
758.7 562723577 562930703 563147008 563134968 563097119 563343942 563814521 564145863 564132273 564058065 564333081
779.1 564333081 565007091 565715790 566084206 566155851 566095650 565717936 564933181 563986778 563219130 562938869
799.5 562938869 563081741 563219070 563043773 562631249 562030852 561076164 559686601 558005452 556246519
817.9 556246519 554514110 552680194 550480247 547929823 545134068 541950762 538128376 533515394
834.2E33515394n396486o282091p740378j0277569j4542878j7789096j3355881m746318
850.5D53384697m268348j1766761j8354982k2463859k7184307l4270078m4613838n7302684
866.8B33159840o3459009n1037945k5793120n302139Q384206K3733251M1543454N7265564
883.1B18494102O8324611P1808100O4171195M8271686L2434046K1566748J4985979
897.4E40056467J0725200P687688N388200L716410K649664J941085J336158R12785
913.7E74413657P72000O02662O3121o46233j157522j359940j426697j505077j537025
932.1E68218946j396358j082301q70764q98242j002550j092315j283884j712918k345622
950.4E56533992k959013l419518l843784m410923n023658n399943n577445n868733
$$ plain form
834.2 533515394 528118908 521836817 514096439 503818870 489275992 471486896 458131015 453384697
850.5 453384697 449116349 437349588 418994606 396530747 369346440 335076362 290462524 233159840
866.8 233159840 169700831 118662886 92869766 87567627 95951833 119685084 161228538 218494102
883.1 218494102 286818713 358626813 422798008 471069694 503503740 525070488 540056467
897.4 540056467 550781667 558469355 563857555 567573965 570223629 572164714 573500872 574413657
913.7 574413657 575185657 575788319 575851440 575205207 574047685 572687745 571261048 569755971 568218946
932.1 568218946 566822588 565740287 564869523 563971281 562968731 561876416 560592532 558879614 556533992
950.4 556533992 553574979 550155461 546311677 541900754 536877096 531477153 525899708 520030975
966.8E20030975o404280o997288p534056q114934q891225r820551j0615975j1012256
983.1D50640410j0985523j0746658j0392696r811282q980960q160531p555723p166297
999.4C76840740o961405o918013p013261p131577p082462o786853o361395n861551
1015.7C22724223n248189m516214l705502k925157k238065j602858r25869j98901M10170
1034.1C01773638P00205O52373L95000P8320j85698l32445k80916J00910Q82864J851648
1054.5C05635899K734453L462374L941834L929377L220856J860291J51604j597315
1070.8C23339373l043592l794640l767997l273577k471417j071513O75231K153010
1087.1C08744878L451645M507035M607499L517449J952141P90238L54201M75496R26822
$$ plain form
966.8 520030975 513626695 506629407 499095351 490980417 482089192 472268641 461652666 450640410
983.1 450640410 439654887 428908229 418515533 408704251 399723291 391562760 384007037 376840740
999.4 376840740 369879335 362961322 355948061 348816484 341734022 334947169 328585774 322724223
1015.7 322724223 317476034 312959820 309254318 306329161 304091096 302488238 301562369 301363468 301773638
1034.1 301773638 302473843 303126216 303521216 303599536 303413838 303081393 302800477 302901387 303784251 305635899
1054.5 305635899 308370352 311832726 315774560 319703937 322924793 324785084 324936688 323339373
1070.8 323339373 320295781 316501141 312733144 309459567 306988150 305916637 306591868 308744878
1087.1 308744878 312196523 316703558 321311057 324828506 326780647 327570885 327925086 328400582 329327404
1105.4C29327404J570762K246886K726913K811104K526700K076298J627893J226902
1121.8C46140862Q62389N98610M80860L66420L4511n29945j136661j655817k064079
1140.1C43097150k341360k345412j986325j487196j091599p96527m51445N3554P09862
1158.5C33360702J442611K197742K933741L467530L554970L230512K848387K688736
1174.8C55724931K648741K402991J827210J087755L17216m58866j209796j894146k427131
1193.1C58018905k732247k858520k909302k864808k687484k468914k353400k439141
1209.5C36705089k715707l017098l250271l501534l730566l822893l812521l804416
1225.8C09050083l811180l781677l650665l459185l331215l276467l251403l229261
$$ plain form
1105.4 329327404 330898166 333145052 335871965 338683069 341209769 343286067 344913960 346140862
1121.8 346140862 347003251 347601861 348082721 348449141 348483652 347953707 346817046 345161229 343097150
1140.1 343097150 340755790 338410378 336424053 334936857 333845258 333048731 332597286 332650840 333360702
1158.5 333360702 334803313 337001055 339934796 343402326 346957296 350187808 353036195 355724931
1174.8 355724931 358373672 360776663 362603873 363691628 364008844 363549978 362340182 360446036 358018905
1193.1 358018905 355286658 352428138 349518836 346654028 343966544 341497630 339144230 336705089
1209.5 336705089 333989382 330972284 327722013 324220479 320489913 316667020 312854499 309050083
1225.8 309050083 305238903 301457226 297806561 294347376 291016161 287739694 284488291 281259030
1242.1B81259030l206223l175020l157854l162861l200263l252506l291905l341168
1258.4B55471230l368259l326774l266081l299236l370017l406629l426134l471554
1274.7B28536546l558770l649145l705040l715485l752649l852084l963977m010052
1291A98329344m059597m162789m267886m307673m283562m251003m227519m233256m160598
1309.4A60375461m039988l964841l893018l865466l890290l864393l876433l954694
1325.7A29026338l982901l978595l891126l721870l660657l860220m012011l779665
1342I8139293l520898l510013l566221l552772l490083l434412l358759l218412l191002
1360.4F7296721l306217l173124k876461k806686k700295k627976k686944k488654
$$ plain form
1242.1 281259030 278052807 274877787 271719933 268557072 265356809 262104303 258812398 255471230
1258.4 255471230 252102971 248776197 245510116 242210880 238840863 235434234 232008100 228536546
1274.7 228536546 224977776 221328631 217623591 213908106 210155457 206303373 202339396 198329344
1291 198329344 194269747 190106958 185839072 181531399 177247837 172996834 168769315 164536059 160375461
1309.4 160375461 156335473 152370632 148477614 144612148 140721858 136857465 132981032 129026338
1325.7 129026338 125043437 121064842 117173716 113451846 109791189 105930969 101918958 98139293
1342 98139293 94618395 91108382 87542161 83989389 80499306 77064894 73706135 70487723 67296721
1360.4 67296721 63990504 60817380 57940919 55134233 52433938 49805962 47119018 44630364
1376.7D4630364k270885k223391k130170j997538k008807j954037j729494j732879
1393B8583163j875411j773123j634149j468127j288217j233570j074322q94176p70977
1411.4A6571091o41712n18849m40050k99051l6558J67377K91374L44108M01675M53713
1431.8A6293118M48158M66788N32668M58442L66425L08521K57669K45601K46083K18824
1452.2A9842297J41887J37741L00029M10590L69856L81176M56441M53796M29191N54031
1472.6B3477035P51618P74644P71502Q17981R02688R42808J016302J216268J461999
1490.9C2132845J468718J503885J880601K119083K011437J768664J928813K787047
1507.2D7601093K762783K327967K297879K397004K521802K549082K877492K989442
$$ plain form
1376.7 44630364 42359479 40136088 38005918 36008380 33999573 32045536 30316042 28583163
1393 28583163 26707752 24934629 23300480 21832353 20544136 19310566 18236244 17342068 16571091
1411.4 16571091 15929379 15410530 14970480 14671429 14634871 14802248 15093622 15437730 15839405 16293118
1431.8 16293118 16741276 17208064 17740732 18199174 18565599 18874120 19131789 19377390 19623473 19842297
1452.2 19842297 19984184 20121925 20421954 20832544 21202400 21583576 22040017 22493813 22923004 23477035
1472.6 23477035 24228653 25003297 25774799 26592780 27495468 28438276 29454578 30670846 32132845
1490.9 32132845 33601563 35105448 36986049 39105132 41116569 42885233 44814046 47601093
1507.2 47601093 50363876 52691843 54989722 57386726 59908528 62457610 65335102 68324544
1523.6F8324544K742044K831027K688482K656945L008559K759457K420626L205761
1539.9I0637445L818028L482655L440209L435179L688671L921009M060820M059874
1556.2A20543890N321078O832167N022064M444107M729257M896804N108461M361406
1572.5A61259234L951177M516944M104957L474921L459051L383279L182844L034830
1588.8A90367237K893686K722159K563879K406552K309963K240614K152711J988157
1605.1B09644958J819298J695707J574368J359954J165226J156375J067206Q85442
1621.4B20368534P66963O83114O12453O47902O91533O51598O65322R36195J164481
1639.8B27188095J244516J253947J437396J816139J701072J857131K792374K721354
$$ plain form
1523.6 68324544 71066588 73897615 76586097 79243042 82251601 85011058 87431684 90637445
1539.9 90637445 94455473 97938128 101378337 104813516 108502187 112423196 116484016 120543890
1556.2 120543890 125864968 132697135 137719199 142163306 146892563 151789367 156897828 161259234
1572.5 161259234 165210411 169727355 173832312 177307233 180766284 184149563 187332407 190367237
1588.8 190367237 193260923 195983082 198546961 200953513 203263476 205504090 207656801 209644958
1605.1 209644958 211464256 213159963 214734331 216094285 217259511 218415886 219483092 220368534
1621.4 220368534 221135497 221818611 222431064 223078966 223770499 224422097 225087419 226023614 227188095
1639.8 227188095 228432611 229686558 231123954 232940093 234641165 236498296 239290670 242012024
1656.1B42012024K476096K715901L179982L430754L177017L440231M099786L884018
1672.4B68415809L969848M412502M146755L842860M153401N364418N195796M571229
1688.8C04072618M798621M575760M935592N526036N587041O322056N405069M700452
1705.1C45923245N015880M632264M121959L789097L739357M274190M270256L499835
1721.4C79266083L245443L339023L252148L121555K926439L320545L594786L030211
1737.7D05096233L081709L254145L109187L078938L120839L286452L333032K983302
1754D30343837K890884K943784K741158K726853K594352K326310K216369K047151J957268
1772.4D52787966J754075J192301N20170j88231q73894j587778k170921k525448l101617
$$ plain form
1656.1 242012024 244488120 247204021 250384003 253814757 256991774 260432005 264531791 268415809
1672.4 268415809 272385657 276798159 280944914 284787774 288941175 294305593 299501389 304072618
1688.8 304072618 308871239 313446999 318382591 323908627 329495668 335817724 341222793 345923245
1705.1 345923245 350939125 355571389 359693348 363482445 367221802 371495992 375766248 379266083
1721.4 379266083 382511526 385850549 389102697 392224252 395150691 398471236 402066022 405096233
1737.7 405096233 408177942 411432087 414541274 417620212 420741051 424027503 427360535 430343837
1754 430343837 433234721 436178505 438919663 441646516 444240868 446567178 448783547 450830698 452787966
1772.4 452787966 454542041 455734342 456254512 456066281 455192387 453604609 451433688 448908240 445806623
1790.7D45806623l423661k699644j904636j350701m40717P97450J901478K806693L695250
1809.1D45188135M639119N274296N516409N609274N466044N045116M707724M545957
1825.4D85992074M033178L675014L582060L197551K857983K678990K419472K165795
1841.7E10602117K302050K484143K262890K076686K017855J972199J919210J812935
1858E27450085J771748J799285J723170J552940J597166J822591J789033J666010J582384
1876.4E42754412J519859J509904J524985J512885J408756J360834J451015J478195
1892.7E54520845J427234J404047J348436J324713J324057J301051J253306J212180
1909E65115869J255512J272619J177549J123667J193524J180768J177668J186013J109004
$$ plain form
1790.7 445806623 442382962 439683318 437778682 436427981 435987264 436784714 438686192 441492885 445188135
1809.1 445188135 449827254 455101550 460617959 466227233 471693277 476738393 481446117 485992074
1825.4 485992074 490025252 493700266 497282326 500479877 503337860 506016850 508436322 510602117
1841.7 510602117 512904167 515388310 517651200 519727886 521745741 523717940 525637150 527450085
1858 527450085 529221833 531021118 532744288 534297228 535894394 537716985 539506018 541172028 542754412
1876.4 542754412 544274271 545784175 547309160 548822045 550230801 551591635 553042650 554520845
1892.7 554520845 555948079 557352126 558700562 560025275 561349332 562650383 563903689 565115869
1909 565115869 566371381 567644000 568821549 569945216 571138740 572319508 573497176 574683189 575792193
1927.4E75792193J078308J098812J096725J040936J002073R55999R62555J038969J044869
1945.7E85111439R95517R54688Q99076Q59976Q48353Q01563P86901P86185P67052Q13961
1966.1E93624711R64999J055479J000345R10521Q63134Q66354Q68320Q49545P94888
1984.5F01798296P68304P70032P77364P86901P48753P15196P41899P58052P01308O63102
2004.9F09229207O75798P01308O86943O31452N91934O09219O32107O17742O17803N97059
2025.3F15590572N81801O12617O21974N70357N44787N64813N84305N96523N94020N96523
2045.7F21458292N89013N77510N48601N30123N54264N92709N98669N55873N42163N63026
2066.1F27110243N65052N52058N43714N11348M88758N21123N72086N56350M73380M41372
$$ plain form
1927.4 575792193 576870501 577969313 579066038 580106974 581109047 582065046 583027601 584066570 585111439
1945.7 585111439 586106956 587061644 587960720 588820696 589669049 590470612 591257513 592043698 592810750 593624711
1966.1 593624711 594589710 595645189 596645534 597556055 598419189 599285543 600153863 601003408 601798296
1984.5 601798296 602566600 603336632 604113996 604900897 605649650 606364846 607106745 607864797 608566105 609229207
2004.9 609229207 609905005 610606313 611293256 611924708 612516642 613125861 613757968 614375710 614993513 615590572
2025.3 615590572 616172373 616784990 617406964 617977321 618522108 619086921 619671226 620267749 620861769 621458292
2045.7 621458292 622047305 622624815 623173416 623703539 624257803 624850512 625449181 626005054 626547217 627110243
2066.1 627110243 627675295 628227353 628771067 629282415 629771173 630292296 630864382 631420732 631894112 632335484
2086.5F32335484M86970N30362M81963M09305L97623M25518M55200M38094L69311L31402
2106.9F36661232L71158L86715L41534K91348K95758L40581L29018K70545K53379K99156
2127.3F39840424L46184L28243K56478K41936L17096L82066L56853L06130L25501L78727
2147.7F43079638M17293M25577M29809M74393N40257N42760M95076N02825N89191O39320
2168F48136139N72145N03242N14805N87464O40273N84602N09381N51045O27935O07193
2188.4F53834224N23984M87387N28157N54144N18442M56154M43280M89473N19931M91679
2208.8F58846855M05669L63231M14550M60089M27544L88324M11153M51267M28974L71576
2229.2F62969232L70919M13657M36842M33803M23193M03702M10139M21286M09782M06027
$$ plain form
2086.5 632335484 632822454 633352816 633834779 634244084 634641707 635067225 635522425 635960519 636329830 636661232
2106.9 636661232 637032390 637419105 637760639 638051987 638347745 638688326 639017344 639287889 639541268 639840424
2127.3 639840424 640186608 640514851 640771329 641013265 641330361 641712427 642069280 642375410 642700911 643079638
2147.7 643079638 643496931 643922508 644352317 644826710 645366967 645909727 646404803 646907628 647496819 648136139
2168 648136139 648708284 649211526 649726331 650313795 650954068 651538670 652048051 652599096 653227031 653834224
2188.4 653834224 654358208 654845595 655373752 655927896 656446338 656902492 657345772 657835245 658355176 658846855
2208.8 658846855 659252524 659615755 660030305 660490394 660917938 661306262 661717415 662168682 662597656 662969232
2229.2 662969232 663340151 663753808 664190650 664624453 665047646 665451348 665861487 666282773 666692555 667098582
2249.6F67098582M26292M55618M42028M23610M21048M18067M39822M41253M01676L98517
2270F71366513M27007M13776L58939L17931L29912L26455K92480L05354L53933L89277
2290.4F74881577L96550L58045L18289L74138M58062M24266L28243L33667M37736N35131
2310.8F78845704N23269M09961L92675N28335O56307O24001M56155L99470N16295N31614
2331.2F83883786M13418L91901M30882M14907L69132K84195q1122n34177l61144M01973
2351.6F85613751J047671J127422R26316N39362J96398R1433K4736j34587l28183m28975
2372F88675344l55423k76625l22520l62158k84434j27613J132O1810O8128P6414J23322
2394.4F87277377J40667J06334O2764M5300Q1539J01328M1544p451J073L9041M4287
$$ plain form
2249.6 667098582 667524874 667980492 668422520 668846130 669267178 669685245 670125067 670566320 670967996 671366513
2270 671366513 671793520 672207296 672566235 672884166 673214078 673540533 673833013 674138367 674492300 674881577
2290.4 674881577 675278127 675636172 675954461 676328599 676786661 677210927 677539170 677872837 678310573 678845704
2310.8 678845704 679368973 679778934 680171609 680699944 681356251 681980252 682436407 682835877 683352172 683883786
2331.2 683883786 684297204 684689105 685119987 685534894 685904026 686188221 686107099 685572922 685211778 685613751
2351.6 685613751 686661422 687788844 688715160 689254522 689450920 689542353 689567089 689432502 689104319 688675344
2372 688675344 688319921 688043296 687720776 687358618 687074184 686946571 686947703 687009513 687077641 687154055 687277377
2394.4 687277377 687418044 687524378 687587142 687632442 687713981 687815309 687856853 687849402 687850475 687889516 687933803
2416.9F87933803l7015j12057j17659j15693j20163j24097j65760k04682k12372k55048
2437.3F86469257l33846l92258m03285m09424m70877n90801o89030p40290q50737j016259
2457.7F80572450j125693j209259j343966j508593j704395j923978k114654k314448
2474F67327464k588272k873898l106117l309548l503323l675580l769517l746748l646314
2492.3F37108147l496587l265321k989233k772093k609908k472937k422691k455950
2508.7F14623427k459943k391934k276004k094149j792312j361608q73328l92079R6738
2527F01078808O18458J131654J602888K019227K337575K562940K749741K876103K907395
2545.4F19884789K872467K790391K652884K421439K095759J799047J621365J470030
$$ plain form
2416.9 687933803 687896788 687784731 687667072 687551379 687431216 687307119 687141359 686936677 686724305 686469257
2437.3 686469257 686135411 685743153 685339868 684930444 684459567 683868766 683179736 682439446 681588709 680572450
2457.7 680572450 679446757 678237498 676893532 675384939 673680544 671756566 669641912 667327464
2474 667327464 664739192 661865294 658759177 655449629 651946306 648270726 644501209 640754461 637108147
2492.3 637108147 633611560 630346239 627357006 624584913 621975005 619502068 617079377 614623427
2508.7 614623427 612163484 609771550 607495546 605401397 603609085 602247477 601374149 600982070 601078808
2527 601078808 601697266 602828920 604431808 606451035 608788610 611351550 614101291 616977394 619884789
2545.4 619884789 622757256 625547647 628200531 630621970 632717729 634516776 636138141 637608171
2561.7F37608171J263022J044869Q76785P72655O95228N90384M51088L61860L39746
2580F44003808L13640K63512J95504J58190J73688J68860J28806J36375K09570K60592
2600.4F46012545K53021K60234L38316M54009N63085O59287P18415P70092Q91626J004278
2620.8F51924908R98497R47952R64165J024842J034558R67741R13680R45151R80735
2639.2F60702229R40561Q59141P70807O90997O06954M63128K94745J90377J30892Q7202
2659.6F65737033K7656r1254j84357j64211j28925j91093k93433l33011l02613k56777
2680F63819015k39849k78473l32177l33666l12031l18348l55721l87430l71873l61383
2700.4F60528064m12345m57466m36067m18008m65154m91500m53234m27961m56572n22792
$$ plain form
2561.7 637608171 638871193 639916062 640792847 641565502 642260730 642851114 643302202 643664062 644003808
2580 644003808 644317448 644580960 644776464 644934654 645108342 645277202 645406008 645542383 645751953 646012545
2600.4 646012545 646265566 646525800 646864116 647318125 647881210 648540497 649258912 650029004 650920630 651924908
2620.8 651924908 652923405 653871357 654835522 655860364 656894922 657862663 658776343 659721494 660702229
2639.2 660702229 661642790 662501931 663272738 663963735 664570689 665033817 665328562 665518939 665649831 665737033
2659.6 665737033 665764689 665673435 665489078 665324867 665195942 665004849 664711416 664378405 664075792 663819015
2680 663819015 663579166 663300693 662968516 662634850 662322819 662004471 661648750 661261320 660889447 660528064
2700.4 660528064 660115719 659658253 659222186 658804178 658339024 657847524 657394290 656966329 656509757 655986965
2720.8F55986965n73695n32866m14669l71993m43160n08785n09859m66465m29214m32074
2741.2F51304185m56988m84705n14746n12242n00143n03004m92453n04792n55932o02901
2761.6F46176279n80609n19097n61655o77645p39932p57396p37071p01308p22647p80285
2782F39398634q14378q67128r69768r98676r56654r80675j059056j107573j108587
2800.3F30536139j139879j235008j317800j346766j367987j415372j478970j547038
2816.6F19687319j612842j684845j765549j819789j863242j980304k169073k330542
2832.9F04461133k448558k638638k902925l239513l785252m444540m778743m364371
2849.3E75858593l328204k268553j600742j344860j369119j581966j883328k157093
$$ plain form
2720.8 655986965 655413270 654880404 654465735 654093742 653650582 653141797 652631938 652165473 651736259 651304185
2741.2 651304185 650847197 650362492 649847746 649335504 648835361 648332357 647839904 647335112 646779180 646176279
2761.6 646176279 645595670 645076573 644514918 643837273 643097341 642339945 641602874 640901566 640178919 639398634
2782 639398634 638584256 637717128 636747360 635748684 634792030 633811355 632752299 631644726 630536139
2800.3 630536139 629396260 628161252 626843452 625496686 624128699 622713327 621234357 619687319
2816.6 619687319 618074477 616389632 614624083 612804294 610941052 608960748 606791675 604461133
2832.9 604461133 602012575 599373937 596471012 593231499 589446247 585001707 580222964 575858593
2849.3 575858593 572530389 570261836 568661094 567316234 565947115 564365149 562481821 560324728
2865.6E60324728k347409k481580k479255k170980j722932j456738j386702j350224
2881.9E44928908j267731j193642j196743j236498j229703j139820j004338r26376
2898.2E35734057r59456j014888j049161j199126j566350k080799k548217k750040
2914.5E22566020k594411k145707j529933q94308l57925K682K80797O52850J001716
2932.9E16981781J194775J317978J381278J347422J277983J198888J020134O97612
2949.2E26417851L55959J72019J04785L9876M8756K43664N79417Q53419R96530J131177
2969.6E30943453J290679J372099J320720J218915J200497J274705J251698J035392
2985.9E40908158Q14795O87003O26684O30200N52475M64201N00560M65929L75212L69131
$$ plain form
2865.6 560324728 557977319 555495739 553016484 550845504 549122572 547665834 546279132 544928908
2881.9 544928908 543661177 542467535 541270792 540034294 538804591 537664771 536660433 535734057
2898.2 535734057 534774601 533759713 532710552 531511426 529945076 527864277 525316060 522566020
2914.5 522566020 519971609 517825902 516295969 515401661 515043736 515046418 515327215 515980065 516981781
2932.9 516981781 518176556 519494534 520875812 522223234 523501217 524700105 525720239 526417851
2949.2 526417851 526773810 526945829 527050614 527090490 527139246 527382910 527962327 528815746 529812276 530943453
2969.6 530943453 532234132 533606231 534926951 536145866 537346363 538621068 539872766 540908158
2985.9 540908158 541722953 542409956 543036640 543666840 544219315 544683516 545184076 545650005 546025217 546394348
3006.3E46394348L09408J66714R1195J03772J14858O9976j5259j97053m63366o48678
3026.7E45925915p22885p57694q01444q52943r28700j044392j130462j142681j097440
3045.1E37447274j105011j216233j272201j233637j209736j177073j154482j210928
3061.4E27867973j283944j297831j200140j056075j040697j157343j251579j237213
3077.7E18343151j150251j097083j108587j106620j101493j103759j086474j094103
3094E09494781j143038j215875j256883j245856j259685j327038j344621j300394j379908
3112.4D98021483j534670j536787j434564j371682j392484j482129j562297j594246
3128.7D86112624j607060j642346j706809j784861j821816j773298j734734j760751
$$ plain form
3006.3 546394348 546703756 546870470 546961665 547065437 547180295 547250271 547235012 547037959 546574593 545925915
3026.7 545925915 545203030 544445336 543643892 542790949 541862249 540817857 539687395 538544714 537447274
3045.1 537447274 536342263 535126030 533853829 532620192 531410456 530233383 529078901 527867973
3061.4 527867973 526584029 525286198 524086058 523029983 521989286 520831943 519580364 518343151
3077.7 518343151 517192900 516095817 514987230 513880610 512779117 511675358 510588884 509494781
3094 509494781 508351743 507135868 505878985 504633129 503373444 502046406 500701785 499401391 498021483
3112.4 498021483 496486813 494950026 493515462 492143780 490751296 489269167 487706870 486112624
3128.7 486112624 484505564 482863218 481156409 479371548 477549732 475776434 474041700 472280949
3145D72280949j805991j890391j973182j944393j886934j911491j938849j940549j980185
3163.4D55008984k019495k005369k007722k037555k025575k013653k029926k039373
3179.7D38830316k054036k077549k073318k023757j996964k019405k010793j972437
3196D22602057j947283j936078j952142j969457j942277j908123j897216j893014j878231
3214.3D05278236j859635j869053j872659j873016j873136j845807j834631j834303
3230.7C90415996j800477j771659j790672j802862j787096j797021j817763j802384
3247C76046062j801491j835436j858562j858533j814752j790911j833827j867801j850485
3265.3C59534264j788110j728773j708061j700192j635641j508266j445383j442581
$$ plain form
3145 472280949 470474958 468584567 466611385 464666992 462780058 460868567 458929718 456989169 455008984
3163.4 455008984 452989489 450984120 448976398 446938843 444913268 442899615 440869689 438830316
3179.7 438830316 436776280 434698731 432625413 430601656 428604692 426585287 424574494 422602057
3196 422602057 420654774 418718696 416766554 414797097 412854820 410946697 409049481 407156467 405278236
3214.3 405278236 403418601 401549548 399676889 397803873 395930737 394084930 392250299 390415996
3230.7 390415996 388615519 386843860 385053188 383250326 381463230 379666209 377848446 376046062
3247 376046062 374244571 372409135 370550573 368692040 366877288 365086377 363252550 361384749 359534264
3265.3 359534264 357746154 356017381 354309320 352609128 350973487 349465221 348019838 346577257
3281.6C46577257j408726j388550j378655j312644j236200j239270j241356j130313
3298C36241543j030445j040876j080960j091301j067728j055211j102745j143813j123876
3316.3C26504588j131624j214534j299351j325548j327664j314342j282692j315534
3332.6C16293299j367479j352370j314879j270651j206637j159161j139909j132190
3348.9C06350023j051248q91864q42482q82417q71241q38667q38965q44807p80642
3367.3B98507690o96420p05540p09057o05852n11408m85420n26637n54144m75615l77596
3387.7B92860001l17305k88367l13431l11256k22206j45107j32114j52469j38670n7727
3408.1B90781349K9027P1139J23947J82331K08467K28167K53558L41713M44353M86076
$$ plain form
3281.6 346577257 345168531 343779981 342401326 341088682 339852482 338613212 337371856 336241543
3298 336241543 335211098 334170222 333089262 331997961 330930233 329875022 328772277 327628464 326504588
3316.3 326504588 325372964 324158430 322859079 321533531 320205867 318891525 317608833 316293299
3332.6 316293299 314925820 313573450 312258571 310987920 309781283 308622122 307482213 306350023
3348.9 306350023 305298775 304406911 303564429 302682012 301810771 300972104 300133139 299288332 298507690
3367.3 298507690 297811270 297105730 296396673 295790821 295279413 294793993 294267356 293713212 293237597 292860001
3387.7 292860001 292542696 292254329 291940898 291629642 291407436 291262329 291130215 290977746 290839076 290781349
3408.1 290781349 290810376 290881515 291005462 291187793 291396260 291624427 291877985 292219698 292664051 293150127
3428.5B93150127N19872O26325P05093O54340O17236O75172P47621Q29845R08703R18478
3448.9C00352812R48340J014918J069754J146615J232683J225293J192242J295686
3465.2C09478343J437306J438707J352638J366526J464039J575381J608759J559049
3481.5C21280748J571566J661807J712322J746059J827806J832425J816720J855344
3497.8C35304797J906454J979441J997351J918972J959085K109945K152682K112090
3514.2C51440817K080739K102285K136499K213597K276272K299726K418876K519786
3530.5C69488597K477407K492071K602547K619415K595068K610564K729833K845645
3546.8C90461147K807498K824783K976984L003925K963483L058464L093719K954632
$$ plain form
3428.5 293150127 293669999 294296324 295001417 295655757 296272993 296948165 297695786 298525631 299434334 300352812
3448.9 300352812 301301152 302316070 303385824 304532439 305765122 306990415 308182657 309478343
3465.2 309478343 310915649 312354356 313706994 315073520 316537559 318112940 319721699 321280748
3481.5 321280748 322852314 324514121 326226443 327972502 329800308 331632733 333449453 335304797
3497.8 335304797 337211251 339190692 341188043 343107015 345066100 347176045 349328727 351440817
3514.2 351440817 353521556 355623841 357760340 359973937 362250209 364549935 366968811 369488597
3530.5 369488597 371966004 374458075 377060622 379680037 382275105 384885669 387615502 390461147
3546.8 390461147 393268645 396093428 399070412 402074337 405037820 408096284 411190003 414144635
3563.1D14144635L106982L734648L811628L355145L255576L420681L539532L605455
3579.4D41974282L553480L342807L538341M227131M149467L514499L562957L851264
3595.7D71714228L887803L984689L938944L574907L545523M011899M000336L602177
3612.1E02260506L333569L009915L377080M179299M017472L458500L699243N391359
3628.4E32726943N853713M223287L820717M004062L935694L829062L422439K901078
3644.7E64716995L317296M923225M931450L030300K798736L777623L534615K946079
3661E93976319K791941K351046K152621L012419L076851K224446L196120L250122J740813
3679.4F17772698J283050R35376N72443J126408J726449Q17299p4983M2498N41687
$$ plain form
3563.1 414144635 417251617 420986265 424797893 428153038 431408614 434829295 438368827 441974282
3579.4 441974282 445527762 448870569 452408910 456636041 460785508 464300007 467862964 471714228
3595.7 471714228 475602031 479586720 483525664 487100571 490646094 494657993 498658329 502260506
3612.1 502260506 505594075 508603990 511981070 516160369 520177841 523636341 527335584 532726943
3628.4 532726943 538580656 542803943 546624660 550628722 554564416 558393478 561815917 564716995
3644.7 564716995 568034291 572957516 577888966 580919266 583718002 587495625 591030240 593976319
3661 593976319 596768260 599119306 601271927 604284346 607361197 609585643 612781763 616031885 617772698
3679.4 617772698 619055748 619991124 620563567 621689975 623416424 624233723 624158740 624201238 624742925
3697.7F24742925J305401K266825K286434J663208J715958K408385K751410J744867
3714F40885413Q14795P78198R61245R84013R63747R02653M07398L6716L67105J076877
3734.4F48178160J345158L12209q15868j16826J516760O89745k9028J306713J143694
3752.8F53530717k07305j46866O46055N59866Q94O2406K77758N95212O69062P6652
3773.2F56064451k13266J81556O20306L25143K146K23398K53498Q2374o5446j78277
3793.6F57295883n1678j04010J57178P99775J76430K6524O10471o5566p76112l20077
3814F57748818M46916J01030L12626R38237O8307l58701k43962k15947r2387j29283
3834.4F58575654K21372P88927M38928p093p8976m46200r95398p77065J271843K067805
$$ plain form
3697.7 624742925 626048326 628315151 630601585 632264793 633980751 636389136 639140546 640885413
3714 640885413 641700208 642478406 643439651 644423664 645387411 646290064 646697462 646734178 647101283 648178160
3734.4 648178160 649523318 649835527 649019659 648902833 650419593 651109338 651080310 652387023 653530717
3752.8 653530717 653323412 653176546 653822601 654382467 654383361 654445767 654723525 655318737 655987799 656064451
3773.2 656064451 655851185 656032741 656653047 656978190 656980336 657203734 657457232 657539606 657474160 657295883
3793.6 657295883 657244205 657140195 657297373 658097148 658273578 658300102 658910573 658845007 658068895 657748818
3814 657748818 658195734 658296764 658609390 659547627 659615934 659257233 659013271 658797324 658704937 658575654
3834.4 658575654 658797026 659585953 660024881 660017788 659938812 659492612 658497214 657720149 658991992 661059797
3854.8F61059797k79606j134514n63145J66476K60472k82943M172N16534K05457j23083
3875.2F59829617m77314k47360J40608j848K71380j3471m09543K57015K44737n88656
3895.5F59005165o69241j39356L21150O36340M35531j78993l65555k97547l08633j01149
3915.9F58337712J65940K3841j85728j2874K7716k45929j76132J16468Q8155j09255
3936.3F58029914k52366j95384N2869l4749k08855J7941J38700l8087j43648j28805
3956.7F57237530r8884l5882j0848p8917q0824m7326p9215m2378N7041M9114k1457
3979.2F56847954J7166N6624l6657r8109m7743k7359n8293k2531J0133
3997.5F56641185
$$ plain form
3854.8 661059797 660780191 659645677 659082532 659249008 659509480 659226537 659230709 659747243 659952700 659829617
3875.2 659829617 659352303 659104943 659245551 659243703 659515083 659501612 659092069 659349084 659593821 659005165
3895.5 659005165 658335924 658196568 658517718 659154058 659589589 659410596 659045041 658747494 658438861 658337712
3915.9 658337712 658503652 658527493 658341765 658328891 658356607 658110678 657934546 658051014 658139169 658029914
3936.3 658029914 657777548 657582164 657635033 657600284 657391429 657409370 657548070 657509983 657366335 657237530
3956.7 657237530 657138646 657102764 657091916 657012999 656932175 656884849 656805634 656763256 656820297 656869411 656847954
3979.2 656847954 656865120 656921744 656885087 656786978 656739235 656711876 656653583 656631052 656641185
3997.5 656641185
##END=$$ End of the data block
