##TITLE=$$ Begin of the data block
##JCAMP-DX=5.00 $$ ACD/SpecManager v 10.08
##SPECTROMETER/DATA SYSTEM=Alpha
##DATE=13 Jun 2014 08:26:00
##DATA TYPE=INFRARED SPECTRUM
##DATA CLASS=XYDATA
##ORIGIN=
##OWNER=
##NPOINTS=1765
##FIRSTX=399.75695801
##LASTX=3997.56933594
##MAXX=3997.56933594
##MINX=399.75695801
##MAXY=0.69038850
##MINY=0.01465218
##XFACTOR=1.0000000000
##YFACTOR=1.000000000000000e-9
##FIRSTY=0.22217415
##DELTAX=2.03957629
##XUNITS=1/CM
##YUNITS=ARBITRARY UNITS
##XYDATA=(X++(Y..Y))
399.8B22174153R947687R464622R641811R735733R373963Q985579Q277029P506877
$$ 222174153 232121840 241586462 251228273 260964006 270337969 279323548 287600577 295107454
416.1B95107454Q615077R249538P083028N939544N877971O168604O042898N216718
$$ 295107454 303722531 312972069 320055097 325994641 331872612 338041216 344084114 349300832
432.4C49300832N334377O276488O167919M849195L992170M256278M347951L435969
$$ 349300832 354635209 360911697 367079616 371928811 375920981 380177259 384525210 387961179
448.7C87961179K625674K537727K549649K471059J840085Q89719O19173Q64952J018405
$$ 387961179 390586853 393124580 395674229 398145288 399985373 400875092 401494265 402359217 403377622
467.1D03377622J327455K411306L905237M602015M287392L947288M332870M899025
$$ 403377622 404705077 407116383 411021620 415623635 419911027 423858315 428191185 433090210
483.4D33090210M494429L361761K725065L057808L298640K483368J520157J465022
$$ 433090210 437584639 440946400 443671465 446729273 450027913 452511281 454031438 455496460
499.7D55496460K065987K005130R42737J90079L87817Q62688P36505k9624n20199j38611
$$ 455496460 457562447 459567577 460510314 460700393 461088210 461950898 462687403 462657779 462137580 461998969
520.1D61998969L43860R2804m41074l35247M21673J002133Q19713N99951J225918K086640
$$ 461998969 462342829 462435633 461994559 461659312 462080985 463083118 463902831 464502782 465728700 467815340
540.5D67815340K101689J415789J106411J482964J713842J140714K48015o9648M17441
$$ 467815340 469917029 471332818 472439229 473922193 475636035 476776749 477024764 476955116 477372557
558.8D77372557R87559Q72195N88477R32127J367748J035124K40803q5742M45903J161903
$$ 477372557 478360116 479232311 479820788 480752915 482120663 483155787 483396590 483310848 483756751 484918654
579.2D84918654J313478R85145Q09610J292050J722544J244903M81516M48704Q31395
$$ 484918654 486232132 487217277 488026887 489318937 491041481 492286384 492767900 493216604 494047999
597.6D94047999N57304n38975j440913j323074p10845n39362o70612k32488Q47071
$$ 494047999 494605303 494066328 492625415 491302341 490591496 490052134 489381522 489149034 489996105
616D89996105J524091J242250Q59946J183421J772523J741439J120537R42707J712323
$$ 489996105 491520196 492762446 493622392 494805813 496578336 498319775 499440312 500383019 502095342
634.3E02095342K535283K288759J327336R50336J376033J557052P24852l92973n97537
$$ 502095342 504630625 506919384 508246720 509197056 510573089 512130141 512854993 512462020 511864483
652.7E11864483j96337k57433r21428j330078q39710J21296N26368n61416j046300
$$ 511864483 511668146 511410713 510489285 509159207 508319497 508440793 508967161 508405745 507359445
671E07359445M0948Q42333M96269l21985m61697k04742n45264j550972k516627l106177
$$ 507359445 507400393 508242726 508738995 508417010 507955313 507750571 507205307 505654335 503137708 500031531
691.4E00031531l816813n207092p072061q146644q438825r959996j2824834j4803946
$$ 500031531 496214718 491007626 483935565 475788921 467350096 457390100 444565266 429761320
707.7D29761320j4352589j1515916p953435n389541k691538K788127J0520995J7664253
$$ 429761320 415408731 403892815 395939380 390549839 387858301 390646428 401167423 418831676
724D18831676K2488445K4350047K3401767K0325691J5936434J1373818P781625N538225
$$ 418831676 441320121 465670168 489071935 509397626 525334060 536707878 544489503 550027728
740.4E50027728M063547K786159J687646J058877Q86023P26759L68953P7128N7817
$$ 550027728 554091275 556877434 558565080 559623957 560509980 561236739 561605692 561682820 561740637
758.7E61740637J59323J62184J8776J6689K81632M66943L00705O497l0458K94626O90699
$$ 561740637 561899960 562062144 562080920 562097609 562379241 562846184 563146889 563153386 563122928 563417554 564108253
781.2E64108253O79135L03626L1948j8835k17795o51360r06408p26402l04281j2994
$$ 564108253 564787388 565091014 565122962 565104127 564886332 564234972 563328564 562602162 562297881 562284887
801.6E62284887J7881j59383l73244n70476r38475j412213j677334j755119j800477
$$ 562284887 562302768 562143385 561770141 561199665 560261190 558848977 557171643 555416524 553616047
819.9E53616047j882613k165079k527773k800823l151893l767014m568040n427837
$$ 553616047 551733434 549568355 547040582 544239759 541087866 537320852 532752812 527324975
836.2E27324975o362498p740796j0224342j4504284j7761767j3339340m756183m321188
$$ 527324975 520962477 513221681 502997339 488493055 470731288 457391948 452635765 448314577
852.5D48314577j1805981j8329769k2366316k7057588l4224629m4601113n7186022
$$ 448314577 436508596 418178827 395812511 368754923 334530294 289929181 232743159
866.8B32743159o3314080n0960824k5720597n256228Q345344K3717403M1617706N7329968
$$ 232743159 169429079 118468255 92747658 87491430 95836774 119554177 161171883 218501851
883.1B18501851O8319723P1757346O4091236M8205077L2395751K1520853J4920890
$$ 218501851 286821574 358578920 422670156 470875233 503270984 524791837 539712727
897.4E39712727J0676861P686615N399644L698290K613067J944542J413942R88960
$$ 539712727 550389588 558076203 563475847 567174137 569787204 571731746 573145688 574134648
913.7E74134648P41601N27501N6684o22034j152158j369059j451313j537264j560569
$$ 574134648 574876249 575403750 575460434 574838400 573686242 572317183 570865870 569328606 567768037
932.1E67768037j394868j052260q13663q73744j064539j150430j278460j695990k365232
$$ 567768037 566373169 565320909 564507246 563633502 562568963 561418533 560140073 558444083 556078851
950.4E56078851l033280l504276l881574m358411m914701n347133n602479n927324
$$ 556078851 553045571 549541295 545659721 541301310 536386609 531039476 525436997 519509673
966.8E19509673o460249p011175p491321q056521q861214r819716j0605216j0961533
$$ 519509673 513049424 506038249 498546928 490490407 481629193 471809477 461204261 450242728
983.1D50242728j0944873j0748386j0388762r787232q970231q155077p555426p203549
$$ 450242728 439297855 428549469 418160707 408373475 399403244 391248167 383692741 376489192
999.4C76489192o994009o865620o900907p062495p077366o803632o385415n897671
$$ 376489192 369495183 362629563 355728656 348666161 341588795 334785163 328399748 322502077
1015.7C22502077n253107m473924l695250k931178k234607j639188r59575j84000M24982
$$ 322502077 317248970 312775046 309079796 306148618 303914011 302274823 301315248 301131248 301556230
1034.1C01556230O79850O18011L78013R2655j76698l65585l17633J12772R30905J922637
$$ 301556230 302236080 302854091 303232104 303324759 303148061 302782476 302464843 302577615 303508520 305431157
1054.5C05431157K800465L470391L912836L878743L155738J840532J76519j568586
$$ 305431157 308231622 311702013 315614849 319493592 322649330 324489862 324666381 323097795
1070.8C23097795l001660l766626l794909l312528k490192j093447O25491K099245
$$ 323097795 320096135 316329509 312534600 309222072 306731880 305638433 306263924 308363169
1087.1C08363169L441930M515559M597872L540099K013326Q12679L23683M57019R65327
$$ 308363169 311805099 316320658 320918530 324458629 326471955 327284634 327608317 328065336 329030663
1105.4C29030663J625448K260626K709090K800733K534032K103925J651644J222879
$$ 329030663 330656111 332916737 335625827 338426560 340960592 343064517 344716161 345939040
1121.8C45939040Q76963O16372M47959L25709J5795n59628j142412j591623k005428
$$ 345939040 346816003 347432375 347880334 348206043 348221838 347662210 346519798 344928175 342922747
1140.1C42922747k345949k374947j994253j464873j083613q34375m98533M1186P43121
$$ 342922747 340576798 338201851 336207598 334742725 333659112 332824737 332326204 332367390 333110511
1158.5C33110511J497001K224207K929151L460526L544450L200173K801121K656698
$$ 333110511 334607512 336831719 339760870 343221396 346765846 349966019 352767140 355423838
1174.8C55423838K646536K412468J829862J061321K78741m44979j165241j882106k435326
$$ 355423838 358070374 360482842 362312704 363374025 363652766 363207787 362042546 360160440 357725114
1193.1C57725114k750427k884358k925992k871871k679885k438068k317905k437711
$$ 357725114 354974687 352090329 349164337 346292466 343612581 341174513 338856608 336418897
1209.5C36418897k741426l025502l236980l491610l720999l790557l778279l793418
$$ 336418897 333677471 330651969 327414989 323923379 320202380 316411823 312633544 308840126
1225.8C08840126l800452l763735l646881l478855l358155l306419l299832l270596
$$ 308840126 305039674 301275939 297629058 294150203 290792048 287485629 284185797 280915201
1242.1B80915201l196597l113509l109663l177554l221214l241747l289670l338218
$$ 280915201 277718604 274605095 271495432 268317878 265096664 261854917 258565247 255227029
1258.4B55227029l340214l335342l336489l340587l349796l389761l416076l437445
$$ 255227029 251886815 248551473 245214984 241874397 238524601 235134840 231718764 228281319
1274.7B28281319l527135l642037l710166l713801l740624l844589l964290m023731
$$ 228281319 224754184 221112147 217401981 213688180 209947556 206102967 202138677 198114946
1291A98114946m081651m158855m238188m294082m303322m279583m224047m188270m137709
$$ 198114946 194033295 189874440 185636252 181342170 177038848 172759265 168535218 164346948 160209239
1309.4A60209239m074887l996864l894150l860116l874898l836677l846064l933847
$$ 160209239 156134352 152137488 148243338 144383222 140508324 136671647 132825583 128891736
1325.7A28891736l990791l995158l885232l706992l652915l868245m024483l768586
$$ 128891736 124900945 120905787 117020555 113313563 109660648 105792403 101767920 97999334
1342I7999334l511466l519386l564052l540486l496133l463156l387258l221028l184258
$$ 97999334 94487868 90968482 87404430 83863944 80367811 76904655 73517397 70296369 67112111
1360.4F7112111l311649l167756k848126k777212k686307k609472k665591k499729
$$ 67112111 63800462 60632706 57784580 55007368 52321061 49711589 47045998 44546269
1376.7D4546269k298217k225507k108098j997303k030980j946713j697203j704563
$$ 44546269 42248052 40022545 37914447 35917144 33886164 31939451 30242248 28537685
1393B8537685j852196j758119j647476j504216j305498j226565j072536q85956p45698
$$ 28537685 26685489 24927370 23279894 21775678 20470180 19243615 18171079 17285123 16539425
1411.4A6539425o21593n01212m27728l04990l1723J84019K82584L14685M01325M80853
$$ 16539425 15917832 15416620 14988892 14683902 14652179 14836198 15118782 15433467 15834792 16315645
1431.8A6315645M46684M43729N43002M66520L35323K85023K70362K81637K78637K27732
$$ 16315645 16762329 17206058 17749060 18215580 18550903 18835926 19106288 19387925 19666562 19894294
1452.2A9894294J41707J33119K82064L95608L66002L77282M55419M59805M11054N19071
$$ 19894294 20036001 20169120 20451184 20846792 21212794 21590076 22045495 22505300 22916354 23435425
1472.6B3435425P43737P75487P71058Q28194R10465R27658J004357J251638J500644
$$ 23435425 24179162 24954649 25725707 26553901 27464366 28392024 29396381 30648019 32148663
1490.9C2148663J458939J483526J871929K101071J990251J760148J917708K786193
$$ 32148663 33607602 35091128 36963057 39064128 41054379 42814527 44732235 47518428
1507.2D7518428K798550K361510K320249K414409K524029K521400K847433L011487
$$ 47518428 50316978 52678488 54998737 57413146 59937175 62458575 65306008 68317495
1523.6F8317495K779469K836988K680867K633341K965406K744518K427049L212988
$$ 68317495 71096964 73933952 76614819 79248160 82213566 84958084 87385133 90598121
1539.9I0598121L849939L513075L435225L416746L687971L928125M067570M058428
$$ 90598121 94448060 97961135 101396360 104813106 108501077 112429202 116496772 120555200
1556.2A20555200N278833O818011N056814M454657M704222M864842N112082M378691
$$ 120555200 125834033 132652044 137708858 142163515 146867737 151732579 156844661 161223352
1572.5A61223352L956228M536361M148439L506332L457949L374472L165752L001034
$$ 161223352 165179580 169715941 173864380 177370712 180828661 184203133 187368885 190369919
1588.8A90369919K871007K691552K527326K395049K292603K217412K156749J991257
$$ 190369919 193240926 195932478 198459804 200854853 203147456 205364868 207521617 209512874
1605.1B09512874J805231J681865J534730J298204J110718J104876J036570Q56921
$$ 209512874 211318105 212999970 214534700 215832904 216943622 218048498 219085068 219941989
1621.4B19941989P22363O66559O21214O49140O79150O35520O90341R76249J148701
$$ 219941989 220664352 221330911 221952125 222601265 223280415 223915935 224606276 225582525 226731226
1639.8B26731226J217738J264587J457005J814917J723275J909405K857223K779737
$$ 226731226 227948964 229213551 230670556 232485473 234208748 236118153 238975376 241755113
1656.1B41755113K508536K714559L162250L442824L215075L466457M128307L931612
$$ 241755113 244263649 246978208 250140458 253583282 256798357 260264814 264393121 268324733
1672.4B68324733L999054M412979M146159L839999M174471N440891N234033M559487
$$ 268324733 272323787 276736766 280882925 284722924 288897395 294338286 299572319 304131806
1688.8C04131806M796445M590899M943043N500972N547852O326317N451888M747093
$$ 304131806 308928251 313519150 318462193 323963165 329511017 335837334 341289222 346036315
1705.1C46036315N060315M680902M163325L795057L708005M257560M299879L561080
$$ 346036315 351096630 355777532 359940857 363735914 367443919 371701479 376001358 379562438
1721.4C79562438L317296L357738L204286L075540K904237L297806L596663L063649
$$ 379562438 382879734 386237472 389441758 392517298 395421535 398719341 402316004 405379653
1737.7D05379653L108889L272354L140629L111630L123522L272057L352105K999336
$$ 405379653 408488542 411760896 414901525 418013155 421136677 424408734 427760839 430760175
1754D30760175K859682K920210K754808K751231K617925K338469K209723K015233J927585
$$ 430760175 433619857 436540067 439294875 442046106 444664031 447002500 449212223 451227456 453155041
1772.4D53155041J768589J221567N25206j98096q59588j564860k180010k550066l106236
$$ 453155041 454923630 456145197 456670403 456472307 455612719 454047859 451867849 449317783 446211547
1790.7D46211547l405810k696335j922190j364589m35770Q23170J925022K818584L703475
$$ 446211547 442805737 440109402 438187212 436822623 436386853 437210023 439135045 441953629 445657104
1809.1D45657104M646004N279153N516231N620569N505145N074143M681051M505187
$$ 445657104 450303108 455582261 461098492 466719061 472224206 477298349 481979400 486484587
1825.4D86484587M018456L669739L608197L253698K905369K684414K381802K131820
$$ 486484587 490503043 494172782 497780979 501034677 503940046 506624460 509006262 511138082
1841.7E11138082K321720K546429K290249K051056J987040J958370J907885J818240
$$ 511138082 513459802 516006231 518296480 520347536 522334576 524292946 526200831 528019071
1858E28019071J778781J779258J710236J538396J556456J819253J840413J718640J613796
$$ 528019071 529797852 531577110 533287346 534825742 536382198 538201451 540041864 541760504 543374300
1876.4E43374300J519084J486361J514733J527905J427293J360119J434922J472831
$$ 543374300 544893384 546379745 547894478 549422383 550849676 552209795 553644717 555117548
1892.7E55117548J431405J397610J349687J354814J366258J313567J228094J206159
$$ 555117548 556548953 557946563 559296250 560651064 562017322 563330889 564558983 565765142
1909E65765142J263380J241744J148701J130700J196086J186788J224995J244009J117467
$$ 565765142 567028522 568270266 569418967 570549667 571745753 572932541 574157536 575401545 576519012
1927.4E76519012J031757J051605J088917J051068R90272R24945R59575J073301J064181
$$ 576519012 577550769 578602374 579691291 580742359 581732631 582657576 583617151 584690452 585754633
1945.7E85754633R85026R60946R36628Q56161P83145P59721P99656Q12769P76887Q09371
$$ 585754633 586739659 587700605 588637233 589493394 590276539 591036260 591835916 592648685 593425572 594234943
1966.1E94234943R44436J019299R96113R49502Q80062Q44837Q53657Q57890Q16405
$$ 594234943 595179379 596198678 597194791 598144293 599024355 599869192 600722849 601580739 602397144
1984.5F02397144P81357P66933P74145P98226P70390P31766P34389P38144P02202O64413
$$ 602397144 603178501 603945434 604719579 605517805 606288195 607019961 607754350 608492494 609194696 609859109
2004.9F09859109O57380O68644O64473O47724O15060O10650O32107O19292O03616N92232
$$ 609859109 610516489 611185133 611849606 612497330 613112390 613723040 614355147 614974439 615578055 616170287
2025.3F16170287N94497O01768O11365N94676N69582N74290N83351N82755N71310N70715
$$ 616170287 616764784 617366552 617977917 618572593 619142175 619716465 620299816 620882571 621453881 622024596
2045.7F22024596N81681N95868N82934N57959N48362N73814O06656N83649N37813N22494
$$ 622024596 622606277 623202145 623785079 624343038 624891400 625465214 626071870 626655519 627193332 627715826
2066.1F27715826N28336N37634N68866N80311N56767N23150N16176N17667M74393M47988
$$ 627715826 628244162 628781796 629350662 629930973 630487740 631010890 631527066 632044733 632519126 632967114
2086.5F32967114M83811N13256M70340M25399M15384M40479M83095M40479L40402L29971
$$ 632967114 633450925 633964181 634434521 634859920 635275304 635715783 636198878 636639357 636979759 637309730
2106.9F37309730M03285M08888L32594K61426K69174L25799L33131L09884L05057L10898
$$ 637309730 637713015 638121903 638454497 638715923 638985097 639310896 639644027 639953911 640258968 640569866
2127.3F40569866L21567L23415K84671K78533L30329L50833L21865L05533L31164L64482
$$ 640569866 640891433 641214848 641499519 641778052 642108381 642459214 642781079 643086612 643417776 643782258
2147.7F43782258L93689M12941M18603M56929N55933N97060N35368M99845N57005O19472
$$ 643782258 644175947 644588888 645007491 645464420 646020353 646617413 647152781 647652626 648209631 648829103
2168F48829103N92172N35071N34772N95093O13690N51223N19991N70774O33836O30677
$$ 648829103 649421275 649956346 650491118 651086211 651699901 652251124 652771115 653341889 653975725 654606402
2188.4F54606402N46455M78149N12361N49257N19872M65095M46021M77195M93705M65811
$$ 654606402 655152857 655631006 656143367 656692624 657212496 657677591 658123612 658600807 659094512 659560323
2208.8F59560323M18722M18723M60744M63247M13478L75628L94046M48943M43637L70026
$$ 659560323 659979045 660397768 660858512 661321759 661735237 662110865 662504911 662953854 663397491 663767517
2229.2F63767517L53813M24146M65572M14372L75211M06325M55558M50433L93152L83496
$$ 663767517 664121330 664545476 665011048 665425420 665800631 666206956 666662514 667112947 667506099 667889595
2249.6F67889595M42028M81188M40181L93271L94642M11571M36008M32372L93688M03941
$$ 667889595 668331623 668812811 669252992 669646263 670040905 670452476 670888484 671320856 671714544 672118485
2270F72118485M41730M24683L56913K95520L12209L57449L53217L42488L63410L83973
$$ 672118485 672560215 672984898 673341811 673637331 673949540 674306989 674660206 675002694 675366104 675750077
2290.4F75750077L66509L23653L27051M08291M59969L94106L07560L36945M41611M93467
$$ 675750077 676116586 676440239 676767290 677175581 677635550 678029656 678337216 678674161 679115772 679609239
2310.8F79609239M48823L98517M53829N60165N94497N60999N06937N06997O03438N60939
$$ 679609239 680058062 680456579 680910408 681470573 682065070 682626069 683133006 683640003 684243441 684804380
2331.2F84804380L48270L04341M15385M40836L60489K66611m9710n17726m07457L33726
$$ 684804380 685152650 685456991 685872376 686313212 686673701 686940312 686890602 686372876 685965419 686299145
2351.6F86299145J001299J108527R47177O25909K84850J09494J2100j36316l11792
$$ 686299145 687300444 688408971 689356148 689982057 690266907 690376401 690388501 690252185 689940393
2370F89940393m01974l53336k93911l23176l56734l00526j42575L7194J13964P8439
$$ 689940393 689538419 689185083 688891172 688567996 688211262 687910736 687768161 687805355 687919319 687997758
2390.4F87997758O9857J21832J36852R7573O1750M9949N5730O4075L6777J1324K5630
$$ 687997758 688067615 688189447 688326299 688423872 688485622 688535571 688591301 688655376 688692153 688703477 688729107
2412.8F88729107L5286J4961l5942r4473j13129j00255j08004j38342j68741j75178
$$ 688729107 688764393 688779354 688743412 688648939 688535810 688435555 688327551 688189209 688020468 687845290
2433.2F87845290j74463k44200l62099m18424m09126m24505n07593o11305o74963p32541
$$ 687845290 687670827 687426627 687064528 686646104 686236978 685812473 685304880 684693575 684018612 683286071
2453.6F83286071q37267r79304j137972j279175j376689j487255j692176j930892k112806
$$ 683286071 682448804 681469500 680331528 679052353 677675664 676188409 674496233 672565341 670452535
2471.9F70452535k305984k573550k861023l119469l333509l514409l680408l784597
$$ 670452535 668146551 665573001 662711978 659592509 656259000 652744591 649064183 645279586
2488.3F45279586l786385l671348l468096l238857k996564k770841k597451k474129
$$ 645279586 641493201 637821853 634353757 631114900 628118336 625347495 622750044 620275915
2504.6F20275915k431155k456605k448082k373695k275408k108931j806319j371741
$$ 620275915 617844760 615388155 612940073 610566378 608290970 606182039 604375720 603003979
2520.9F03003979q59082l77357Q3506O16431J148582J608312K026319K363563K579391
$$ 603003979 602144897 601767540 601851046 602467477 603616059 605224371 607250690 609614253 612193644
2539.2F12193644K739430K854943K879679K851307K797008K664328K436041K116442
$$ 612193644 614933074 617788017 620667696 623519003 626316011 628980339 631416380 633532822
2555.6F33532822J784802J590907J465857J268268J047909Q96335Q11398P26461N88000
$$ 633532822 635317624 636908531 638374388 639642656 640690565 641586900 642398298 643124759 643712759
2573.9F43712759M22835L32535L39627L42190K77341K05516J73986J55986J48654J49786
$$ 643712759 644135594 644468129 644807756 645149946 645427287 645632803 645806789 645962775 646111429 646261215
2594.3F46261215J34826J67966K74777L23117L06487L43263M33207N42342O49035P02322
$$ 646261215 646396041 646564007 646838784 647161901 647468388 647811651 648244858 648787200 649436235 650138557
2614.7F50138557P77066R30190J002908R51111R05156R55939J059354J065254R67145
$$ 650138557 650915623 651845813 652848721 653799832 654704988 655660927 656720281 657785535 658752680
2633.1F58752680R15110R48131R72390R32515Q38995P50959O96480O16193M50551K64764
$$ 658752680 659667790 660615921 661588311 662520826 663359821 664110780 664807260 665423453 665874004 666138768
2653.5F66138768J82092J64152J24573K9803r3580j52170j36614j53065k46584l06070
$$ 666138768 666320860 666485012 666609585 666639388 666545808 666393638 666257024 666103959 665857375 665551305
2673.9F65551305k84434k68161k88308k96473k97427l20316l47197l43501l12984l39627
$$ 665551305 665266871 664998710 664710402 664413929 664116502 663796186 663448989 663105488 662792504 662452877
2694.3F62452877m10617l84450l40760m09901m51624m18186m10855m28438m54009m80711
$$ 662452877 662042260 661657810 661317050 660907149 660455525 660037339 659626484 659198046 658744037 658263326
2714.6F58263326m74811m50194n05328o14285n78642m12047l50118m20570m87924n09083
$$ 658263326 657788515 657338321 656832993 656218708 655640066 655228019 654877901 654457331 653969407 653460324
2735F53460324m94600m59790m49598m78029n08785n16534m95791m75765m77016m86970
$$ 653460324 652965724 652505934 652056336 651578307 651069522 650552988 650057197 649581432 649104416 648617446
2755.4F48617446n14566n53847n77926n72265n63800n94974o65366p36475p67708p16567
$$ 648617446 648102880 647549033 646971107 646398842 645835042 645240068 644574702 643838227 643070519 642353952
2775.8F42353952o60598o94037p66814q40306r08255r73821j005411r90033j015425
$$ 642353952 641693354 640999317 640232503 639392197 638483942 637510121 636504710 635514677 634499252
2794.2F34499252j091600j116275j086176j104951j197278j317621j396954j402497
$$ 634499252 633407652 632291377 631205201 630100250 628902972 627585351 626188397 624785900
2810.5F24785900j405239j478612j570106j598537j639664j761675j864552j922966
$$ 624785900 623380661 621902049 620331943 618733406 617093742 615332067 613467515 611544549
2826.8F11544549k033233k184808k307415k442360k651453k886057l205061l769636
$$ 611544549 609511316 607326508 605019093 602576733 599925280 597039223 593834162 590064526
2843.1E90064526m446149m775882m357517l328562k277195j612127j373768j425802
$$ 590064526 585618377 580842495 576484978 573156416 570879221 569267094 567893326 566467524
2859.5E66467524j610399j878679k165615k361298k484917k474428k183377j740158
$$ 566467524 564857125 562978446 560812831 558451533 555966616 553492188 551308811 549568653
2875.8E49568653j443922j370132j347304j282751j222670j209677j228153j203478
$$ 549568653 548124731 546754599 545407295 544124544 542901874 541692197 540464044 539260566
2892.1E39260566j119077j023948r54747r51350r93312j051127j202524j543224k038062
$$ 539260566 538141489 537117541 536162794 535211444 534218132 533167005 531964481 530421257 528383195
2910.4E28383195k511382k772748k660394k143025j468361q87334l98815j3947K91466
$$ 528383195 525871813 523099065 520438671 518295646 516827285 515939951 515541136 515527189 515818655
2928.8E15818655O48976R80437J179933J309812J380623J367807J313746J204491R96649
$$ 515818655 516467631 517448068 518628001 519937813 521318436 522686243 523999989 525204480 526201129
2947.2E26201129O93262L65614J69695Q8632K0504L3557K34187N78702Q72433J023948
$$ 526201129 526894391 527260005 527429700 527518332 527538836 527572393 527806580 528385282 529257715 530281663
2967.6E30281663J135766J272262J367509J329780J197099J186252J315057J310766
$$ 530281663 531417429 532689691 534057200 535386980 536584079 537770331 539085388 540396154
2983.9E40396154J077294P94709O08742N66840O04928N44965M62055M74692M62532
$$ 540396154 541473448 542268157 542876899 543443739 544048667 544593632 545055687 545530379 545992911
3002.2E45992911M20213L67999K56359J68860J64151J61946J18137M6372n8353k33829
$$ 545992911 546413124 546781123 547037482 547206342 547370493 547532439 547650576 547696948 547638595 547404766
3022.6E47404766m50730o27458p36654p83622q14557q56400r22143j024843j116276
$$ 547404766 546954036 546326578 545589924 544806302 543991745 543135345 542213202 541188359 540072083
3041E40072083j150846j136184j125335j177431j238823j248478j246989j217485j193285
$$ 540072083 538921237 537785053 536659718 535482287 534243464 532994986 531747997 530530512 529337227
3059.3E29337227j252174j312435j301408j211166j095354j071334j137019j211226
$$ 529337227 528085053 526772618 525471210 524260044 523164690 522093356 520956337 519745111
3075.6E19745111j217961j143813j095831j116991j129151j123428j105428j088381
$$ 519745111 518527150 517383337 516287506 515170515 514041364 512917936 511812508 510724127
3092E10724127j120805j177133j251459j289725j248777j243472j305997j349628j336009
$$ 510724127 509603322 508426189 507174730 505885005 504636228 503392756 502086759 500737131 499401122
3110.3D99401122j377403j500547j549870j490533j405746j395524j483023j583576
$$ 499401122 498023719 496523172 494973302 493482769 492077023 490681499 489198476 487614900
3126.6D87614900j633674j633376j646787j701534j767486j782298j728803j740843
$$ 487614900 485981226 484347850 482701063 480999529 479232043 477449745 475720942 473980099
3143D73980099j829892j878590j912802j948238j929998j894087j907110j942605j961201
$$ 473980099 472150207 470271617 468358815 466410577 464480579 462586492 460679382 458736777 456775576
3161.3D56775576j986027k005488k021849k068519k094031k087086k076268k025187
$$ 456775576 454789549 452784061 450762212 448693693 446599662 444512576 442436308 440411121
3177.6D40411121j984418k025366k088755k113342k098888k050758j996696j974761
$$ 440411121 438426703 436401337 434312582 432199240 430100352 428049594 426052898 424078137
3193.9D24078137j976759k001345k014428j967758j934648j941323j931339j904160
$$ 424078137 422101378 420100033 418085605 416117847 414183199 412241876 410310537 408406377
3210.3D08406377j916945j965434j937150j855165j831889j845926j842171j835794
$$ 408406377 406489432 404523998 402586848 400731683 398899794 397053868 395211697 393375903
3226.6C93375903j843541j866937j866341j823336j799345j797586j790762j797945
$$ 393375903 391532362 389665425 387799084 385975748 384176403 382378817 380588055 378790110
3242.9C78790110j832217j832634j784921j792967j851886j870841j839548j825631
$$ 378790110 376957893 375125259 373340338 371547371 369695485 367824644 365985096 364159465
3259.2C64159465j852572j852960j816004j787633j775622j765072j720846j608879
$$ 364159465 362306893 360453933 358637929 356850296 355074674 353309602 351588756 349979877
3275.5C49979877j471459j411200j421690j429468j430571j409024j329482j248688
$$ 349979877 348508418 347097218 345675528 344246060 342815489 341406465 340076983 338828295
3291.8C38828295j228928j205087j136958j113415j138985j126021j094848j083643
$$ 338828295 337599367 336394280 335257322 334143907 333004922 331878901 330784053 329700410
3308.2C29700410j078099j099318j136541j145363j167417j224905j264840j290530
$$ 329700410 328622311 327522993 326386452 325241089 324073672 322848767 321583927 320293397
3324.5C20293397j330197j360923j362741j379639j404643j392216j357317j318156
$$ 320293397 318963200 317602277 316239536 314859897 313455254 312063038 310705721 309387565
3340.8C09387565j276702j233012j162350j066535j005531r89347r92626r46701q52495
$$ 309387565 308110863 306877851 305715501 304648966 303643435 302654088 301661462 300714761 299862266
3359.1B99862266q43972q88855q65847p95602p43985p52569p49588o51061n46009n25146
$$ 299862266 299018294 298129439 297263592 296467990 295724005 294971436 294221848 293570787 293024778 292499632
3379.5B92499632n67735n62816m91292m04536l36826l46452l65287l26574k71887k00093
$$ 292499632 291931897 291369081 290877789 290473253 290136427 289789975 289424688 289098114 288826227 288626134
3399.9B88626134j57624j94371j94609j01775J4782R6262J24424J22667J57952K28286
$$ 288626134 288468510 288274139 288079530 287977755 287992537 288088799 288213223 288335890 288493842 288722128
3420.3B88722128K60472L26902M35650M75317M76986N64605O73473O78122O40840O71506
$$ 288722128 288982600 289309502 289745152 290220469 290697455 291262060 291935533 292613655 293254495 293926001
3440.7B93926001P54356Q28803Q66919Q56459R47714J120538J181960J162112J166075
$$ 293926001 294680357 295509160 296376079 297232538 298180252 299300790 300482750 301644862 302810937
3459.1C02810937J180530J200199J289427J403690J411765J369685J424164J505762
$$ 302810937 303991467 305191666 306481093 307884783 309296548 310666233 312090397 313596159
3475.4C13596159J570791J619965J618058J607686J638025J690179J761705J803815
$$ 313596159 315166950 316786915 318404973 320012659 321650684 323340863 325102568 326906383
3491.7C26906383J773655J803607J885086J938761J982093K002746J986652K015144
$$ 326906383 328680038 330483645 332368731 334307492 336289585 338292331 340278983 342294127
3508C42294127K073169K121120K160639K165466K179683K166777K185464K260954K340823
$$ 342294127 344367296 346488416 348649055 350814521 352994204 355160981 357346445 359607399 361948222
3526.4C61948222K441496K511382K515405K553523K595007K577871K613634K662301
$$ 361948222 364389718 366901100 369416505 371970028 374565035 377142906 379756540 382418841
3542.7C82418841K777040K912313K869606K857476L011018L059924L029347L086566
$$ 382418841 385195881 388108194 390977800 393835276 396846294 399906218 402935565 406022131
3559D06022131L063858K924085L121674L801137L911734L432393L318399L518909L648430
$$ 406022131 409085989 412010074 415131748 418932885 422844619 426277012 429595411 433114320 436762750
3577.4D36762750L699720L638566L417998L577352M235893M198402L551782L575712
$$ 436762750 440462470 444101036 447519034 451096386 455332279 459530681 463082463 466658175
3593.7D66658175L932416L997952M059076M001201L623098L584444M078895M114866
$$ 466658175 470590591 474588543 478647619 482648820 486271918 489856362 493935257 498050123
3610D98050123L736347L439486L115654L519059M264593L979206L390133L717065N519867
$$ 498050123 501786470 505225956 508341610 511860669 516125262 520104468 523494601 527211666 532731533
3628.4E32731533N985260M335046L981054M159391M008233L857315L433406K864242
$$ 532731533 538716793 543051839 547032893 551192284 555200517 559057832 562491238 565355480
3644.7E65355480L265559M959464N063713L150940K917945L907025L601194K958238
$$ 565355480 568621039 573580503 578644216 581795156 584713101 588620126 592221320 595179558
3661E95179558K811909K391994K184927L017604L063858K203524L197730L320932J839101
$$ 595179558 597991467 600383461 602568388 605585992 608649850 610853374 614051104 617372036 619211137
3679.4F19211137J363159J019477O50168J119017J656950Q24869j1564P7367N65231
$$ 619211137 620574296 621593773 622243941 623362958 625019908 625844777 625833213 625910580 626475811
3697.7F26475811J357675K272248K219736J608551J706600K509833K918303J782238
$$ 626475811 627833486 630105734 632325470 633934021 635640621 638150454 641068757 642850995
3714F42850995P64132P38382R11057R57906R70483Q73804L80755L0040L53933J079678
$$ 642850995 643615127 644353509 645264566 646222472 647192955 648066759 648447514 648477554 648831487 649911165
3734.4F49911165J397729L48210q62538j88649J533210Q07405L8445J258909J138509
$$ 649911165 651308894 651657104 650794566 650605917 652139127 652946532 652984977 654243886 655382395
3752.8F55382395j20521j02222O44088N62906J729P4506K71678N55217O66618J27852
$$ 655382395 655261874 655159652 655803740 656366646 656368375 656442881 656714559 657269776 657936394 658064246
3773.2F58064246j88052J31666N46396K95281L4631K81751K66313N8711r0420j84119
$$ 658064246 657876194 658007860 658554256 658849537 658884168 659165919 659432232 659490943 659400523 659216404
3793.6F59216404j013q8454P0334P69257K89202J55032O70075n5432p95305l64005
$$ 659216404 659215391 659126937 659197271 659966528 660255730 660410762 661080837 661025405 660230100 659866095
3814F59866095M04000L2544K33114Q89599M6313l11434j79410k12431j06275j53125
$$ 659866095 660270095 660302639 660535753 661425352 661471665 661160231 660980821 660768390 660662115 660508990
3834.4F60508990J77861P60555M84884J19388j2994n29647j087248p57218J303852
$$ 660508990 660686851 661447406 661932290 662051678 662038684 661509037 660421789 659664571 660968423
3852.7F60968423K023578k67685j078665n53191J38104K15471l51012j5795N73695
$$ 660968423 662992001 662724316 661645651 661092460 661230564 661446035 661095023 661079228 661652923
3871.1F61652923K73764n5194m44174k85923O4671r2984K27988N8591l09228K88546
$$ 661652923 661926687 661871493 661427319 661141396 661206067 661113083 661341071 661399662 661090434 661378980
3891.5F61378980K05278o29187o66260j55151K72393O93381N62906j39415l87073k83658
$$ 661378980 661584258 660955071 660288811 660133660 660406053 661099434 661662340 661522925 661135852 660852194
3911.9F60852194k90930j12176J76906M8161k00689q5116l2663k52187j64807J40190
$$ 660852194 660561264 660449088 660625994 660674155 660473466 660388350 660355687 660103500 659938693 660078883
3932.3F60078883J02461j20938k73347k38240L0041J8298j47998M1962J36137n0187
$$ 660078883 660181344 660060406 659787059 659548819 659578860 659597158 659449160 659491122 659627259 659577072
3952.7F59577072j52767j61469j01388K3664N424j12892q7738k4199m6075m3571J9193
$$ 659577072 659424305 659262836 659161448 659185112 659190536 659077644 658989906 658965707 658919632 658876061 658895254
3975.1F58895254M1545n067m232M0889p510j07527p1824K3008n007m7564l2664
$$ 658895254 658936799 658931732 658927500 658968389 658960879 658853352 658781528 658804536 658799529 658751965 658719301
3997.5F58719301
$$ 658719301
##END=$$ End of the data block
