##TITLE=$$ Begin of the data block
##JCAMP-DX=5.00 $$ ACD/SpecManager v 10.08
##SPECTROMETER/DATA SYSTEM=Alpha
##DATE=13 Jun 2014 08:26:00
##DATA TYPE=INFRARED SPECTRUM
##DATA CLASS=XYDATA
##ORIGIN=
##OWNER=
##NPOINTS=1765
##FIRSTX=399.75695801
##LASTX=3997.56933594
##MAXX=3997.56933594
##MINX=399.75695801
##MAXY=0.69156128
##MINY=0.01467301
##XFACTOR=1.0000000000
##YFACTOR=1.000000000000000e-9
##FIRSTY=0.22325602
##DELTAX=2.03957629
##XUNITS=1/CM
##YUNITS=ARBITRARY UNITS
##XYDATA=(X++(Y..Y))
399.8 223256022 233009607 241802424 250814348 260323197 270042419 279274225 287543446 295193881
416.1 295193881 303862810 312698632 319123656 324755579 331029862 337712288 343870193 348979503
432.4 348979503 354063153 359890759 365703076 370739639 375156760 379389286 383639663 387214899
448.7 387214899 389700711 392057151 394812912 397360444 398894012 399536073 400165766 401116341 402144730
467.1 402144730 403430998 405808568 409703285 414214134 418407023 422389001 426786333 431655645
483.4 431655645 436014533 439259559 441961527 444900900 448038071 450647622 452413946 453897774
499.7 453897774 455786288 457701057 458738357 459028095 459474802 460373491 460991889 460724831 460109681
518.1 460109681 460044712 460536927 460766226 460244060 459809691 460405052 461562365 462315291 462776423 463847160
538.4 463847160 465818495 467956692 469482362 470596552 472017050 473698199 474838167 475129873 475193858
556.8 475193858 475710750 476656467 477535903 478065521 478662431 479824662 481053919 481544048 481542408 481991857
577.2 481991857 483136445 484362632 485270798 486202389 487588018 489217758 490447223 491010249 491481572
595.6 491481572 492347032 493033469 492598534 491145134 489725947 488914341 488371640 487836778 487762272 488582641
616 488582641 489970624 491215885 492155939 493354648 495157063 496935159 497979134 498843968 500613093
634.3 500613093 503241360 505585790 506917238 507809997 509145439 510708153 511515260 511272609 510756552
652.7 510756552 510563552 510324061 509435415 508088946 507197261 507337749 507998586 507513821 506381512
671 506381512 506347060 507155657 507641196 507310629 506815016 506619871 506180763 504705846 502164543 499084800
691.4 499084800 495377004 490193307 483054936 474891365 466468453 456477642 443657190 428965449
707.7 428965449 414759159 403339744 395413607 390044540 387358963 390071213 400530607 418214232
724 418214232 440734655 465052933 488346547 508586347 524508357 535904884 543736339 549363256
740.4 549363256 553517938 556315362 557943821 558966339 559874296 560635149 560998380 561018348 561058104
758.7 561058104 561311305 561540127 561470270 561365247 561645985 562185645 562496722 562447727 562401950 562741160
779.1 562741160 563506246 564264357 564590991 564592898 564508617 564213336 563533902 562616289 561854482 561556458
799.5 561556458 561642647 561759531 561624169 561261177 560659885 559646726 558203399 556538582 554860711
817.9 554860711 553131998 551210523 549018323 546557605 543825626 540684402 536854923 532167792
834.2 532167792 526659429 520291924 512558758 502316117 487765849 469953537 456558555 451748312
850.5 451748312 447444856 435724199 417465687 395131648 368109763 333990663 289537698 232440948
866.8 232440948 169214055 118401945 92763610 87504543 95901608 119715236 161334276 218568102
883.1 218568102 286803961 358519226 422575116 470742792 503111959 524612784 539538860
897.4 539538860 550249040 557942808 563304126 566951275 569541574 571458757 572777748 573677421
913.7 573677421 574419975 574965775 575000226 574343562 573159516 571790993 570393443 568922222 567418218
932.1 567418218 566083908 565044701 564154387 563185811 562076390 560908198 559613109 557894170 555486381
950.4 555486381 552438796 548976600 545120358 540706098 535695612 530293226 524697065 518831909
966.8 518831909 512441576 505440831 497908324 489809573 480925918 471107602 460533559 449611276
983.1 449611276 438704282 428002328 417658180 407916844 398990870 390856504 383309007 376129419
999.4 376129419 369186968 362353593 355436295 348383427 341383636 334687322 328415453 322610438
1015.7 322610438 317345321 312783480 309068829 306157440 303900987 302255660 301312029 301099271 301461816
1034.1 301461816 302094549 302698761 303061783 303085864 302830547 302470595 302241176 302444190 303405136 305293232
1054.5 305293232 308048815 311480373 315364897 319254011 322421938 324251026 324412555 322841972
1070.8 322841972 319842756 316058725 312218696 308848321 306298643 305143207 305735946 307827830
1087.1 307827830 311261714 315797597 320439875 324002981 326029748 326873064 327226490 327708691 328707695
1105.4 328707695 330374509 332659781 335359037 338154346 340698063 342766881 344343126 345528811
1121.8 345528811 346416891 347039193 347493887 347854525 347908229 347382456 346259087 344653815 342639387
1140.1 342639387 340313017 337971270 335997403 334528148 333458036 332681477 332239360 332307756 333042681
1158.5 333042681 334478021 336612940 339472055 342889249 346400201 349587023 352403909 355058759
1174.8 355058759 357660055 360033214 361855835 362919629 363197565 362738937 361564666 359691620 357270509
1193.1 357270509 354546607 351671547 348724067 345838010 343160838 340726674 338390529 335948020
1209.5 335948020 333236545 330212742 326958984 323498577 319832951 316044360 312231034 308428407
1225.8 308428407 304644585 300912589 297274768 293774396 290426403 287164509 283912718 280672789
1242.1 280672789 277464867 274295270 271125704 267953217 264783978 261563301 258271188 254935622
1258.4 254935622 251594067 248281643 244988948 241650909 238271579 234854415 231391385 227903932
1274.7 227903932 224372819 220764786 217094019 213403493 209676787 205837086 201845765 197794124
1291 197794124 193717375 189564824 185313359 181033388 176792309 172558993 168325230 164100930 159945413
1309.4 159945413 155884311 151904061 148018733 144172341 140291139 136430174 132578835 128647953
1325.7 128647953 124663293 120682679 116800785 113093093 109433964 105557762 101563595 97821616
1342 97821616 94295703 90772487 87235555 83716437 80220446 76765455 73392995 70177838 67001939
1360.4 67001939 63692831 60518667 57660904 54859761 52150026 49525093 46846945 44361733
1376.7 44361733 42093936 39888438 37790045 35798293 33775166 31833436 30145366 28456561
1393 28456561 26596855 24817791 23188543 21725902 20438449 19211216 18134903 17238267 16492872
1411.4 16492872 15896210 15398645 14952217 14673014 14675886 14850531 15119631 15437112 15811855 16250212
1431.8 16250212 16712479 17192125 17712714 18161392 18518748 18818760 19084068 19356962 19634971 19880259
1452.2 19880259 20044370 20178014 20447828 20847876 21230083 21628620 22089053 22545977 22962298 23455767
1472.6 23455767 24145646 24898937 25680501 26528278 27452173 28402584 29431477 30656064 32110021
1490.9 32110021 33574030 35088304 36975760 39083440 41082069 42831633 44713218 47468491
1507.2 47468491 50272148 52645124 54968920 57403129 59995059 62602714 65464489 68374820
1523.6 68374820 71071923 73931329 76646268 79285398 82273446 85026212 87414287 90592310
1539.9 90592310 94477177 98026179 101467267 104876883 108557738 112493165 116563722 120576806
1556.2 120576806 125791028 132649437 137773827 142263427 146996886 151876748 156971306 161317796
1572.5 161317796 165245637 169754580 173859373 177313060 180738911 184097201 187242851 190209433
1588.8 190209433 193042234 195741564 198299155 200665221 202886030 205035761 207120970 209041625
1605.1 209041625 210785568 212420553 213932812 215190768 216211662 217228279 218233541 219088122
1621.4 219088122 219799027 220440850 221061975 221733332 222418159 223031431 223690599 224686235 225905910
1639.8 225905910 227198243 228501961 229984432 231872752 233659133 235609353 238570943 241445094
1656.1 241445094 244006097 246778250 250021189 253539771 256800205 260301292 264465600 268427491
1672.4 268427491 272453547 276887119 281030476 284842342 288980901 294449687 299765885 304378122
1688.8 304378122 309203655 313790202 318711787 324223489 329766095 336062908 341536045 346338719
1705.1 346338719 351457208 356180876 360373199 364195138 367916733 372177094 376513451 380103052
1721.4 380103052 383405983 386764914 390009999 393107414 396013349 399361789 403041363 406123251
1737.7 406123251 409193754 412436783 415560395 418639481 421742558 425035655 428423107 431451410
1754 431451410 434354722 437289298 440004140 442745060 445397109 447752893 449961662 451979131 453921944
1772.4 453921944 455697328 456902295 457423329 457240373 456395000 454862356 452709079 450113505 446923584
1790.7 446923584 443500072 440846860 438943416 437557280 437110305 437953323 439895898 442729771 446456492
1809.1 446456492 451115400 456397116 461923569 467551261 473037481 478095561 482805252 487335593
1825.4 487335593 491344094 495029092 498670697 501926780 504820943 507518291 509937644 512083173
1841.7 512083173 514365196 516869962 519156635 521228313 523246229 525233269 527173758 529016197
1858 529016197 530796766 532557368 534218848 535712600 537274778 539131463 540990829 542695820 544294238
1876.4 544294238 545823753 547339559 548879921 550403953 551803708 553139091 554557860 556016982
1892.7 556016982 557449996 558868051 560235262 561588764 562931418 564222753 565448642 566666067
1909 566666067 567960620 569233656 570368767 571470559 572669566 573853612 575047076 576262414 577381670
1927.4 577381670 578449368 579545677 580640674 581654549 582623541 583551109 584493637 585559964 586662292
1945.7 586662292 587679148 588626206 589532852 590386510 591186464 591937363 592707098 593515873 594321072
1964.1 594321072 595150828 596098602 597125888 598133743 599085629 599969447 600831747 601671040 602466643
1982.5 602466643 603242159 604026496 604794800 605571330 606398046 607187450 607897043 608609736 609348655 610057235
2002.8 610057235 610735416 611402452 612087250 612769246 613390505 613967001 614580631 615236282 615871608 616490483
2023.2 616490483 617085993 617663741 618255138 618877828 619487822 620047152 620594203 621182740 621809721 622415245
2043.6 622415245 622983813 623536408 624098718 624658525 625212967 625788569 626383781 626964331 627509892 628040791
2064 628040791 628575623 629130960 629694343 630254805 630819917 631394029 631956279 632500947 633029938 633496761
2084.4 633496761 633910418 634367645 634908080 635434031 635872066 636270046 636710346 637191057 637620151 637952149
2104.8 637952149 638275087 638674974 639088750 639449000 639756382 640057743 640390337 640713215 641001403 641290188
2125.2 641290188 641613543 641959369 642277658 642548084 642834187 643177688 643550634 643901229 644205630 644509733
2145.6 644509733 644869030 645284772 645711899 646144032 646624982 647189140 647779346 648313046 648827732 649411857
2166 649411857 650030255 650584936 651104271 651651084 652248561 652875423 653455257 653985500 654560089 655196249
2186.4 655196249 655801177 656316996 656789422 657305956 657863081 658395886 658875465 659337401 659823895 660319328
2206.8 660319328 660779119 661197424 661621571 662070096 662518620 662930727 663316548 663725317 664173007 664612889
2227.2 664612889 665004253 665389955 665831804 666312814 666740358 667101204 667480946 667928278 668382823 668791533
2247.6 668791533 669194341 669629991 670087397 670519352 670926094 671344995 671786189 672247410 672686934 673068941
2268 673068941 673462093 673904002 674319029 674659729 674965143 675296962 675650954 675988615 676315308 676668644
2288.4 676668644 677049339 677424550 677772939 678108633 678480804 678883851 679265201 679637790 680067539 680526733
2308.8 680526733 680957973 681363642 681748748 682179868 682734251 683366358 683928430 684363425 684816480 685384154
2329.2 685384154 685901225 686277211 686681390 687151790 687574804 687903464 688157320 688139081 687660217 687268317
2349.6 687268317 687616229 688639343 689738929 690577865 691061080 691300690 691460967 691561282 691488683
2367.9 691488683 691220820 690862298 690494657 690133929 689777851 689457715 689230025 689135849 689162374 689247429
2388.3 689247429 689339101 689437330 689559221 689690650 689786136 689842224 689888060 689946532 690030813 690097630 690114617
2410.8 690114617 690122545 690163076 690187335 690141439 690057576 689957678 689837039 689712703 689581037 689407289 689214110
2433.2 689214110 689031303 688797295 688455045 688052654 687656939 687237799 686724305 686103046 685419738 684686959
2453.6 684686959 683853805 682878733 681760788 680510879 679135144 677615881 675901949 673963964 671816647
2471.9 671816647 669469178 666888773 664047658 660953403 657631695 654108346 650397003 646572411
2488.3 646572411 642776608 639116287 635647714 632412195 629408419 626607955 623996317 621532679
2504.6 621532679 619098485 616617322 614162207 611806035 609553397 607453883 605637610 604271472
2520.9 604271472 603434086 603054643 603127956 603735089 604875088 606501758 608533561 610871911 613455176
2539.2 613455176 616224527 619091630 621984005 624852121 627633989 630282819 632726252 634857595
2555.6 634857595 636681020 638301671 639750481 641004145 642069757 642978013 643762112 644450128 645037234
2573.9 645037234 645498753 645876050 646227062 646538377 646785975 646983325 647147000 647300303 647463322 647624016
2594.3 647624016 647776663 647953868 648197830 648492813 648805261 649147809 649559379 650097728 650771618 651507258
2614.7 651507258 652301371 653222203 654224575 655188739 656108975 657108545 658212543 659283459 660233259
2633.1 660233259 661131978 662077308 663046956 663962543 664796054 665559590 666261792 666877985 667336881 667610705
2653.5 667610705 667789519 667955875 668085635 668095350 667974949 667806506 667660952 667520642 667308867 667015314
2673.9 667015314 666690171 666375339 666096091 665851712 665599465 665288389 664928615 664568961 664220393 663859427
2694.3 663859427 663477242 663087666 662700474 662307322 661882043 661440492 661032915 660619140 660162151 659694552
2714.6 659694552 659223437 658744931 658215702 657623351 657077372 656656981 656298995 655885100 655389667 654872000
2735 654872000 654359818 653875113 653435707 653004527 652540803 652027130 651503086 651015759 650539279 650045156
2755.4 650045156 649519920 648951828 648368716 647806883 647246301 646621644 645933688 645222306 644476712 643752337
2775.8 643752337 643073559 642360151 641595542 640783966 639892161 638904095 637881577 636888087 635891020
2794.2 635891020 634830832 633714616 632602453 631475866 630259812 628918946 627496719 626087070
2810.5 626087070 624692440 623230815 621670961 620047748 618370533 616603136 614762902 612872541
2826.8 612872541 610863924 608672976 606329679 603865027 601209819 598300159 595048368 591237724
2843.1 591237724 586786568 582031369 577665448 574301839 572009683 570386171 568981767 567539990
2859.5 567539990 565953076 564127862 562009394 559648395 557121813 554594934 552380681 550638020
2875.8 550638020 549199760 547835112 546477318 545188069 543999493 542816222 541572452 540351808
2892.1 540351808 539232075 538219035 537280142 536335051 535352945 534327269 533124983 531556785 529498339
2910.4 529498339 526952565 524168134 521563292 519448698 517943621 517031848 516621470 516589880 516873837
2928.8 516873837 517522156 518503129 519703805 521062136 522468030 523801684 525079429 526311755 527354777
2947.2 527354777 528044045 528374195 528528988 528633058 528661072 528687835 528939068 529565215 530469060 531501532
2967.6 531501532 532676637 533975601 535284996 536570311 537811220 539026320 540309072 541572630
2983.9 541572630 542614281 543436468 544140697 544783115 545412540 545957565 546417773 546915829 547385752
3002.2 547385752 547750533 548076987 548359036 548543990 548683226 548846126 549003184 549068272 548990011 548707664
3022.6 548707664 548195779 547554910 546873629 546157479 545355678 544476807 543544233 542497694 541355371
3041 541355371 540193200 539057434 537938952 536765814 535542130 534290016 533005655 531762540 530570865
3059.3 530570865 529351950 528083146 526809812 525622368 524514139 523386002 522214592 521004915
3075.6 521004915 519771636 518597543 517480612 516341507 515227914 514150143 513026178 511861980
3092 511861980 510672629 509470642 508257866 507001400 505747378 504517138 503229618 501884103 500534892
3110.3 500534892 499112874 497550577 495952696 494461924 493092120 491721839 490230531 488639921
3126.6 488639921 487029552 485415667 483762771 482019305 480193973 478377700 476606935 474834085
3143 474834085 473028511 471182972 469279587 467312038 465350926 463444889 461529702 459561259 457563341
3161.3 457563341 455554515 453532904 451500744 449444056 447342128 445219815 443123817 441074699
3177.6 441074699 439039320 436973512 434887767 432824731 430786312 428707480 426580399 424493939
3193.9 424493939 422503322 420545846 418518513 416481048 414526463 412612021 410674602 408701271
3210.3 408701271 406733781 404784411 402849019 400946051 399057478 397166163 395272285 393386364
3226.6 393386364 391525596 389678180 387837052 386004329 384179622 382345706 380466670 378589928
3242.9 378589928 376766801 374959111 373149097 371314764 369416982 367504567 365651727 363844246
3259.2 363844246 362036973 360206515 358347207 356509209 354715049 352926642 351186037 349568248
3275.5 349568248 348052233 346588284 345129222 343647540 342200637 340815336 339492679 338230193
3291.8 338230193 336959034 335706919 334555537 333445281 332291633 331110090 329927832 328777939
3308.2 328777939 327657938 326496273 325313151 324142903 322927058 321637839 320288569 318890393
3324.5 318890393 317455143 315997750 314553708 313126475 311697751 310274065 308847100 307432652
3340.8 307432652 306102306 304854810 303613037 302405208 301302433 300233692 299128264 298064739
3357.1 298064739 297089428 296146780 295201629 294244111 293302447 292434752 291600615 290769875 290020525 289380908
3377.5 289380908 288807392 288218617 287579894 286950469 286415875 285985589 285591513 285216987 284895450 284623086
3397.9 284623086 284361422 284100085 283845574 283643186 283526301 283474356 283468395 283505529 283605397 283779711
3418.3 283779711 283981055 284169048 284429193 284821928 285273463 285742074 286312789 286985159 287619412 288187623
3438.7 288187623 288822472 289576232 290387034 291226745 292087764 293064386 294188231 295363575 296569616
3457 296569616 297797441 299001187 300224364 301569700 303018779 304445982 305825830 307267398 308807194
3475.4 308807194 310423076 312054694 313635528 315191388 316825479 318574399 320392460 322256446
3491.7 322256446 324088305 325916529 327855289 329883009 331914544 333926708 335925072 337958485
3508 337958485 340088964 342285514 344477862 346634835 348790348 351016760 353360325 355718523 358061045
3526.4 358061045 360522896 363120586 365720302 368295550 370915622 373577476 376289874 379065365
3542.7 379065365 381944448 384866923 387738079 390700758 393849820 396996111 400069863 403178155
3559 403178155 406297445 409338266 412574470 416464061 420462936 424019635 427503347 431157529 434908807
3577.4 434908807 438750714 442546308 446047217 449684858 454085231 458479375 462186128 465913475
3593.7 465913475 469978213 474086910 478265375 482452542 486311436 490062743 494225323 498411089
3610 498411089 502231538 505773306 509008944 512682319 517143309 521298945 524804235 528619468 534323752
3628.4 534323752 540517986 544940889 548965216 553218782 557374537 561356425 564853847 567791998
3644.7 567791998 571188271 576310754 581490874 584672153 587604225 591529667 595124304 598119318
3661 598119318 601021349 603436708 605585396 608648121 611807168 614035428 617242932 620585263 622441947
3679.4 622441947 623824120 624842167 625474989 626617134 628375709 629298031 629313886 629377067 629891396
3697.7 629891396 631175935 633445024 635725021 637388825 639151037 641685545 644617796 646440029
3714 646440029 647225082 647976637 648924768 649889708 650846660 651744902 652097821 652054846 652418137 653611481
3734.4 653611481 655121088 655487597 654571474 654335320 655826867 656510055 656471014 657833040 659091473
3752.8 659091473 658994138 658894658 659550011 660104632 660058737 660075486 660342813 660974443 661731482 661871970
3773.2 661871970 661635637 661734819 662293613 662606835 662629902 662900865 663201511 663313687 663229465 662979722
3793.6 662979722 662862957 662699938 662825823 663692653 663944960 664008200 664682090 664657295 663868427 663544238
3814 663544238 663999379 664031863 664258122 665191948 665278256 664946854 664713204 664480865 664407730 664268374
3834.4 664268374 664398193 665102303 665565729 665707469 665746808 665231109 664070904 663214028 664591551
3852.7 664591551 666828990 666570485 665334582 664631069 664766133 665109575 664842904 664818823 665362239
3871.1 665362239 665614486 665530324 665077746 664815068 664893746 664885044 665262401 665316224 664901733 665156662
3891.5 665156662 665338755 664633870 663916826 663836896 664220273 664886355 665381730 665239155 664837897 664496958
3911.9 664496958 664163291 664040625 664201617 664253891 664145708 664176464 664170027 663905799 663761497 663938463
3932.3 663938463 664030492 663817286 663492680 663322568 663414240 663425863 663254201 663247764 663310766 663250625 663185358
3954.7 663185358 663105309 663013935 663025379 663044453 662962914 662867010 662788630 662705481 662659049 662696481 662760139
3977.1 662760139 662767529 662782967 662820280 662764192 662624478 662554204 662586272 662596345 662557304 662521303
3997.5 662521303
##END=$$ End of the data block
