##TITLE=$$ Begin of the data block
##JCAMP-DX=5.00 $$ ACD/SpecManager v 10.08
##SPECTROMETER/DATA SYSTEM=Alpha
##DATE=13 Jun 2014 08:26:00
##DATA TYPE=INFRARED SPECTRUM
##DATA CLASS=XYDATA
##ORIGIN=
##OWNER=
##NPOINTS=1765
##FIRSTX=399.75695801
##LASTX=3997.56933594
##MAXX=3997.56933594
##MINX=399.75695801
##MAXY=0.69368798
##MINY=0.01462969
##XFACTOR=1.0000000000
##YFACTOR=1.000000000000000e-9
##FIRSTY=0.21907218
##DELTAX=2.03957629
##XUNITS=1/CM
##YUNITS=ARBITRARY UNITS
##XYDATA=(X++(Y..Y))
399.8B19072178R831339R478495R563714R531319R296149Q797377P908583P241547
416.1B90720701Q423418Q804858O636202O126493O352276O026030N716830N390555
432.4C44197363N456745N993098N793989M615724L995717M400849M666716L744781
448.7C82864982K496928K419352K758801K435804J451790O03825N38439R10043J261741
467.1C97741705J567722K304643L707796M577279M281760L931403M329979M883707
483.4D27325994M469692L289670K600521K923995L263593K626419J698554J524508
499.7D49722946K007633J917869Q66055P2986L66956J061142Q97884n8055n40048j00761
520.1D56214607L15338L0041l84271o9529N83798P83801N66512O16014J367331K138584
$$ plain form
399.8 219072178 228903517 238382012 247945726 257477045 266773194 275570571 283479154 290720701
416.1 290720701 299144119 307948977 314585179 320711672 327063948 333089978 338806808 344197363
432.4 344197363 349654108 355647206 361441195 366056919 370052636 374453485 379120201 382864982
448.7 382864982 385361910 387781262 390540063 392975867 394427657 395031482 395569921 396479964 397741705
467.1 397741705 399309427 401614070 405321866 409899145 414180905 418112308 422442287 427325994
483.4 427325994 431795686 435085356 437685877 440609872 443873465 446499884 448198438 449722946
499.7 449722946 451730579 453648448 454514503 454587489 454954445 456015587 456913471 456855416 456315368 456214607
520.1 456214607 456529945 456559986 456175715 456106186 456689984 457473785 458040297 458656311 460023642 462162226
540.5D62162226K033115J331627J042158J377523J608461J168430L33398O3062N97834
558.8D71717834J044304Q52167N04703P60138J342475J198262L73125o5744M18544
577.2D78145808J170546J292467R11206Q40247J404106J790971J297891N14477M28111
595.6D87795830Q73536O92516l92020j307189j257002p16985m74006m53502q255R76175
616D85729098J637489J373380R46910J245588J846134J756370J099676R94712J869858
634.3D98499215K759277K548874J536965R48966J236677J469016P92325j92345m45962
652.7E09153008j21057j73211p87258j178264p70152J25050N47767m58121r34363J53780
673.1E05557179R86457O11782k35259l84510j75655n37872j504540k464712l049582
$$ plain form
540.5 462162226 464195341 465526968 466569126 467946649 469555110 470723540 471056938 471120000 471717834
558.8 471717834 472762138 473614305 474119008 474879146 476221621 477419883 477793008 477727264 478145808
577.2 478145808 479316354 480608821 481520027 482360274 483764380 485555351 486853242 487367719 487795830
595.6 487795830 488669366 489361882 488969862 487662673 486405671 485688686 485214680 484761178 484752923 485729098
616 485729098 487366587 488739967 489686877 490932465 492778599 494534969 495634645 496629357 498499215
634.3 498499215 501258492 503807366 505344331 506293297 507529974 508998990 509791315 509598970 509153008
652.7 509153008 509031951 508858740 508071482 506893218 506123066 506248116 506795883 506337762 505403399 505557179
673.1 505557179 506543636 507155418 506920159 506535649 506359994 505822122 504317582 501852870 498803288
691.4D98803288l734052n152822p033050q122027q529752j0102243j2802332j4602214
707.7D28724796j4151276j1430561p970840n407780k657920K796501J0502755J7696798
724D18102473K2528738K4325967K3381531K0378947J6006470J1452973P861078N543530
740.4E49581707M021227K777994J723527J101852R45926Q26776M16338j1444j6868
758.7E61367035K66254K98917k5987p5579L12507N35727L28362m3810j23441K54869
779.1E63094854O59585O46472L30508R2566l040k84552p03752q99315p54774l26872
799.5E61851680O8546R6202j56343l81411o09397r73464j398980j660168j718462j785219
819.9E53332984j947820k230346k528012k808988l209054l830910m647791n537630
$$ plain form
691.4 498803288 495069236 489916414 482883364 474761337 466231585 456129342 443327010 428724796
707.7 428724796 414573520 403142959 395172119 389764339 387106419 389902920 400405675 418102473
724 418102473 440631211 464957178 488338709 508717656 524724126 536177099 544038177 549581707
740.4 549581707 553602934 556380928 558104455 559206307 560152233 560979009 561395347 561383903 561367035
758.7 561367035 561633289 561932206 561906219 561830640 562143147 562678874 563007236 562963426 562839985 563094854
779.1 563094854 563754439 564400911 564731419 564823985 564820945 564536393 563832641 562933326 562178552 561851680
799.5 561851680 561920226 562016428 561860085 561478674 560869277 559895813 558496833 556836665 555118203 553332984
819.9 553332984 551385164 549154818 546626806 543817818 540608764 536777854 532130063 526592433
836.2E26592433o494879p865548j0305703j4558494j7818183j3427228m867941m415482
852.5D46838975j1887461j8402547k2380769k7052194l4234613m4508755n6945101
866.8B31427535o2916353n0485574k5450363n202257Q437284K3849025M1673951N7355076
883.1B18688324O8324760P1711003O4024061M8126430L2309741K1461427J4928281
897.4E39574027J0707259P636428N302787L663361K622366J903772J279354Q29399
913.7E73518753O95467N70834K1875p27535j198113j351058j407921j476288j524151
932.1E67121863j402616j067698q26657r04977j124382j254559j408934j833261k505600
950.4E54793179l117382l518403l914237m449606m982352n359769n635619n957306
$$ plain form
836.2 526592433 520097554 512232006 501926303 487367809 469549626 456122398 451254457 446838975
852.5 446838975 434951514 416548967 394168198 367116004 332881391 288372636 231427535
866.8 231427535 168511182 118025608 92575245 87372988 95810272 119659297 161333248 218688324
883.1 218688324 287013084 358724087 422748148 470874578 503184319 524645746 539574027
897.4 539574027 550281286 557917714 563220501 566883862 569506228 571410000 572689354 573518753
913.7 573518753 574214220 574785054 574806929 574079394 572881281 571530223 570122302 568646014 567121863
932.1 567121863 565719247 564651549 563824892 562919915 561795533 560540974 559132040 557298779 554793179
950.4 554793179 551675797 548157394 544243157 539793551 534811199 529451430 523815811 517858505
966.8E17858505o450176p033110p547527q099944q875846r787947j0538638j0887146
983.1D48638171j0885865j0686606j0289430r667009q840204q026451p464856p132172
999.4C75645578o895602o770044o831795o956995o914258o628573o189436n674630
1015.7C22784245n106568m436314l670335k939582k316773j725107j050234l12686
1032C01226646L04311N99921N27948K43813l2306k43932l83943l22461J23620R68694
1052.4C03012311J941473K785980L424705L807663L769041L129571J867444K19970
1068.7C23958158j467943k894371l763408l892124l435611k606899j219243N06282
1085C05184841K017856L394872M506618M629761L584176K080172R35614M60983N72919
$$ plain form
966.8 517858505 511408329 504375219 496827692 488727748 479851902 470063955 459525317 448638171
983.1 448638171 437752306 427065700 416776270 407109261 398269057 390242606 382777750 375645578
999.4 375645578 368749976 361979932 355148137 348191142 341276884 334648311 328458875 322784245
1015.7 322784245 317677677 313241363 309571028 306631446 304314673 302589566 301539332 301226646
1032 301226646 301530957 302130878 302658826 302902639 302870333 302626401 302242458 301919997 302043617 303012311
1052.4 303012311 304953784 307739764 311164469 314972132 318741173 321870744 323738188 323958158
1068.7 323958158 322490215 319595844 315832436 311940312 308504701 305897802 304678559 305184841
1085 305184841 307202697 310597569 315104187 319733948 323318124 325398296 326333910 326794893 327367812
1103.4C27367812J059324J671702K274960K737135K839386K535045K026379J557857
1119.7C44069600J194298Q59142N76764M24564L01212J2189n08368j083523j559257
1138.1C44286621j959980k232134k240747j932919j447201j028151p51674m40836N0336
1156.4C32303315O88851J399666K120585K808958L318429L405362L086299K741933
1172.7C51873398K647787K616942K348214J796663J079142L08931m53382j203269j897514
1191.1C59116912k425224k726227k851099k895683k849817k664625k447904k362013
1207.4C37894320k473741k753377l027529l207952l405928l620893l756851l772884
1223.7C11875165l738463l744156l751397l646463l442258l287822l253936l269375
$$ plain form
1103.4 327367812 328427136 330098838 332373798 335110933 337950319 340485364 342511743 344069600
1119.7 344069600 345263898 346123040 346699804 347124368 347425580 347437769 346929401 345845878 344286621
1138.1 344286621 342326641 340094507 337853760 335920841 334473640 333445489 332693815 332252979 332303315
1156.4 332303315 332992166 334391832 336512417 339321375 342639804 346045166 349131465 351873398
1172.7 351873398 354521185 357138127 359486341 361283004 362362146 362671077 362217695 361014426 359116912
1191.1 359116912 356691688 353965461 351114362 348218679 345368862 342704237 340256333 337894320
1207.4 337894320 335420579 332667202 329639673 326431721 323025793 319404900 315648049 311875165
1223.7 311875165 308136702 304392546 300641149 296994686 293552428 290264606 287010670 283741295
1240.1B83741295l256589l214747l146261l131240l195316l230452l221184l270477
1256.4B58075029l354758l379912l354385l311306l315196l343224l380701l430516
1272.7B31205031l482461l561362l645540l673523l688067l783003l896221l969208
1289B01505646l990143m045681m158139m249871m285007m266844m231393m205853m196509
1307.4A63876206m134417m061893l992348l877774l817052l846914l843784l870934
1323.7A32431090l973305m018225l978565l853024l696538l665164l892437m027873
1340A01325959l752001l507480l521748l564298l518149l446735l425792l366456l205068
1358.3G0018232l175303l305786l162347k842556k773341k701763k648570k675831
$$ plain form
1240.1 283741295 280484706 277269959 274123698 270992458 267797142 264566690 261345506 258075029
1256.4 258075029 254720271 251340359 247985974 244674668 241359472 238016248 234635547 231205031
1272.7 231205031 227722570 224161208 220515668 216842145 213154078 209371075 205474854 201505646
1289 201505646 197515503 193469822 189311683 185061812 180776805 176509961 172278568 168072715 163876206
1307.4 163876206 159741789 155679896 151687548 147809774 143992722 140145808 136302024 132431090
1323.7 132431090 128457785 124439560 120460995 116607971 112911433 109246269 105353832 101325959
1340 101325959 97573958 94066478 90544730 86980432 83462283 80015548 76589756 73223300 70018232
1358.3 70018232 66842929 63537143 60374796 57532240 54758899 52057136 49408566 46732735
1374.7D6732735k467174k264913k187066k072960j989212k038144j954201j697170
1391C0061895j702569j863642j752386j585785j440285j293505j231907j063000q91874
1409.3A7236942p77179o35428m90218m05935k71609k6879J65089K97804L54450L95315
1429.7A5842352M38113M41538M62210N31299M59479L61610L22812K87354K54224K42638
1450.1A9643629K28329J60036J50467L17305M31193L82299L89888M59200M44472M04159
1470.5B3010977N27624P37287P63826P72120Q35695R20729R39381J003463J225486
1488.9C0736588J482174J480236J520832J896634K132554K032429J765579J874249
1505.2D4921275K744183K819516K397563K322085K392970K538059K591651K898611
$$ plain form
1374.7 46732735 44265561 42000648 39813582 37740622 35751410 33713266 31759065 30061895
1391 30061895 28359326 26495684 24743298 23157513 21717228 20423723 19191816 18128816 17236942
1409.3 17236942 16459763 15824335 15334117 14928182 14656573 14629694 14794783 15092587 15447037 15842352
1429.7 15842352 16280465 16722003 17184213 17715512 18174991 18536601 18859413 19146767 19400991 19643629
1450.1 19643629 19871958 20031994 20182461 20499766 20930959 21313258 21703146 22162346 22606818 23010977
1470.5 23010977 23538601 24275888 25039714 25811834 26647529 27568258 28507639 29511102 30736588
1488.9 30736588 32218762 33698998 35219830 37116464 39249018 41281447 43047026 44921275
1505.2 44921275 47665458 50484974 52882537 55204622 57597592 60135651 62727302 65625913
1521.5F5625913K968491K724796K858624K725318K645180K981119K765141K440505
1537.8H7735087L239527L851734L503099L454663L438309L693163L937438M053794
1554.1A16906814L983744N222395O873414N097627M438624M680842M840047N065187
1570.5A57108694M336387L900379M457370M107087L494412L429458L306150L089383
1586.8A87229320K923280K756983K587438K455190K285689K136305K055481J997799
1603.1B06427485J844331J660571J506135J364544J164078R37850R00447R47148Q34986
1621.4B17587575O77541O06373N75826O47694P14153O71103P54759J116663J332730
1639.8B24684417J407996J434624J643613K054110J933501K118662L108382K947897
$$ plain form
1521.5 65625913 68594404 71319200 74177824 76903142 79548322 82529441 85294582 87735087
1537.8 87735087 90974614 94826348 98329447 101784110 105222419 108915582 112853020 116906814
1554.1 116906814 120890558 126112953 132986367 138083994 142522618 147203460 152043507 157108694
1570.5 157108694 161445081 165345460 169802830 173909917 177404329 180833787 184139937 187229320
1586.8 187229320 190152600 192909583 195497021 197952211 200237900 202374205 204429686 206427485
1603.1 206427485 208271816 209932387 211438522 212803066 213967144 214904994 215805441 216752589 217587575
1621.4 217587575 218265116 218871489 219447315 220095009 220809162 221480265 222235024 223351687 224684417
1639.8 224684417 226092413 227527037 229170650 231224760 233158261 235276923 238385305 241333202
1656.1B41333202K653017K892524L353775L605276L325313L556073M222781M013568
1672.4B68955529M059136M461825M182964L862560M194587N464703N248755M566789
1688.8C04996848M799962M578650M929006N523056N567938O339342N523353M853160
1705.1C47111315N150407M744053M222035L862530L794313M347175M358888L576368
1721.4C81167084L306478L387779L298223L156007K910822L290922L647953L108293
1737.7D07273561L125131L279805L130794L070414L058791L262341L444403L099144
1754D32744384K926200K944857K713055K700776K618551K354175K208858K007455J930505
1772.4D55148816J782745J232982N33432j84268q47638j552850k168536k575606l161818
$$ plain form
1656.1 241333202 243986219 246878743 250232518 253837794 257163107 260719180 264941961 268955529
1672.4 268955529 273014665 277476490 281659454 285522014 289716601 295181304 300430059 304996848
1688.8 304996848 309796810 314375460 319304466 324827522 330395460 336734802 342258155 347111315
1705.1 347111315 352261722 357005775 361227810 365090340 368884653 373231828 377590716 381167084
1721.4 381167084 384473562 387861341 391159564 394315571 397226393 400517315 404165268 407273561
1737.7 407273561 410398692 413678497 416809291 419879705 422938496 426200837 429645240 432744384
1754 432744384 435670584 438615441 441328496 444029272 446647823 449001998 451210856 453218311 455148816
1772.4 455148816 456931561 458164543 458697975 458513707 457666069 456113219 453944683 451369077 448207259
1790.7D48207259l423184k661496j891971j352251m29928Q15988J912653K819657L711552
1809.1D47708279M636079N266368N534470N673171N554914N093306M705340M529864
1825.4D88701791M010140L663302L620058L242553K885878K724826K445817K121866
1841.7E13416231K253413K520561K329469K108455K025783J965761J903176J823485
1858E30346334J803458J804709J692295J493693J559317J867830J854420J673043J558006
1876.4E45653105J512110J509190J512527J500547J414955J381933J476288J497746
1892.7E57458401J433432J408636J358569J325071J316726J292288J242161J228571
1909E68063855J287759J253545J119196J082719J167714J171828J215636J223564J090944
$$ plain form
1790.7 448207259 444784075 442122579 440230608 438878357 438448429 439264417 441177070 443996727 447708279
1809.1 447708279 452344358 457610726 463145196 468818367 474373281 479466587 484171927 488701791
1825.4 488701791 492711931 496375233 499995291 503237844 506123722 508848548 511294365 513416231
1841.7 513416231 515669644 518190205 520519674 522628129 524653912 526619673 528522849 530346334
1858 530346334 532149792 533954501 535646796 537140489 538699806 540567636 542422056 544095099 545653105
1876.4 545653105 547165215 548674405 550186932 551687479 553102434 554484367 555960655 557458401
1892.7 557458401 558891833 560300469 561659038 562984109 564300835 565593123 566835284 568063855
1909 568063855 569351614 570605159 571724355 572807074 573974788 575146616 576362252 577585816 578676760
1927.4E78676760J051605J090944J078546J023888J006365R63032R51231J022995J032710
1945.7E87898076R76383R45926R09686Q53956Q18193P83801P85827P88332P67588P94590
1966.1E96322358R19938J026273J028239R52363Q62718Q54790Q69989Q51453P84278
1984.5F04472399P31766P47383P96020Q16583P57277O93083P19011P57694P22885O88196
2004.9F11902297O69240O57738O51002O28054N95033O20425O69062O45876O08325N91755
2025.3F18238807N97775N94079N95689N94735N62906N61774O04809O19649N88477N65827
2045.7F24124527N62668N92708O06955N82337N78165O07431O13034N63442N16594N20110
2066.1F29867971N57959N88000N93960N57065N34535N55574N64397N41448N01812M81963
$$ plain form
1927.4 578676760 579728365 580819309 581897855 582921743 583928108 584891140 585842371 586865366 587898076
1945.7 587898076 588874459 589820385 590730071 591584027 592402220 593186021 593971848 594760180 595527768 596322358
1966.1 596322358 597242296 598268569 599296808 600249171 601111889 601966679 602836668 603688121 604472399
1984.5 604472399 605204165 605951548 606747568 607564151 608321428 609014511 609733522 610491216 611214101 611902297
2004.9 611902297 612571537 613229275 613880277 614508331 615103364 615723789 616392851 617038727 617647052 618238807
2025.3 618238807 618836582 619430661 620026350 620621085 621183991 621745765 622350574 622970223 623558700 624124527
2045.7 624124527 624687195 625279903 625886858 626469195 627047360 627654791 628267825 628831267 629347861 629867971
2066.1 629867971 630425930 631013930 631607890 632164955 632699490 633255064 633819461 634360909 634862721 635344684
2086.5F35344684M94659N18560N00441M41790M24802M78327M93884M30882L66509L59893
2106.9F39854431L94702L82960L42429L15368L13818L43144L48687L17455L08394L47614
2127.3F43269002L67344L29375K80619K76983L21447L77119L65078L08693L28243L97741
2147.7F46621644M30167M28915M31717M71592N66959N99921N21183M76420N51343O53267
2168F51753128O33239N32627N10157N89311O34074N81622N47469O10768O65367O12497
2188.4F57670259N12958M77135N35488N80311N42045M81486M77851N00917M85897M46141
2208.8F62710488M13954M25220M61995M62055M11988L88562M21703M43876M24564L98219
2229.2F66962624M00245M36604M68015M42207L98159M02034M45068M36127L83436L95835
$$ plain form
2086.5 635344684 635839343 636357903 636858344 637300134 637724936 638203263 638697147 639128029 639494538 639854431
2106.9 639854431 640249133 640632093 640974522 641289890 641603708 641946852 642295539 642612994 642921388 643269002
2127.3 643269002 643636346 643965721 644246340 644523323 644844770 645221889 645586967 645895660 646223903 646621644
2147.7 646621644 647051811 647480726 647912443 648384035 648950994 649550915 650072098 650548518 651099861 651753128
2168 651753128 652386367 652918994 653429151 654018462 654652536 655234158 655781627 656392395 657057762 657670259
2188.4 657670259 658183217 658660352 659195840 659776151 660318196 660799682 661277533 661778450 662264347 662710488
2208.8 662710488 663124442 663549662 664011657 664473712 664885700 665274262 665695965 666139841 666564405 666962624
2229.2 666962624 667362869 667799473 668267488 668709695 669107854 669509888 669954956 670391083 670774519 671170354
2249.6F71170354M65631M86553M18663L79264M18306M60982M71175M29451L64960L90708
2270F75456047M70161M41909L38674L11911L60847L55541L17574L33607L57270L47376
2290.4F79090917L33727L39031L70621M22061M42266L87669L12924L42250M59671N27561
2310.8F83028698M66227L62516M05967N68867O45876N48243L99948M17113N76734N80490
2331.2F88000679M27783L72529L63946L42845L29018K78413j192m35710l39090L48210
2351.6F89687431R91523J155436R80973N61476K04921J00434N781j86562l16143l56853
2372F92828417l00586k33829k79606l22282k43425j09673q94O3240Q9050J17600J22130
2394.4F91730142R1076P8439Q3447R0122R6738Q1301K4319N483M8340O2465J6094o4850
$$ plain form
2249.6 671170354 671635985 672122538 672541201 672920465 673338771 673799753 674270928 674700379 675065339 675456047
2270 675456047 675926208 676368117 676706791 677018702 677379549 677735090 678052664 678386271 678743541 679090917
2290.4 679090917 679424644 679763675 680134296 680556357 680998623 681386292 681699216 682041466 682501137 683028698
2310.8 683028698 683494925 683857441 684263408 684832275 685478151 686026394 686426342 686843455 687420189 688000679
2331.2 688000679 688428462 688800991 689164937 689507782 689836800 690115213 690114021 689678311 689339221 689687431
2351.6 689687431 690678954 691834390 692815363 693376839 693581760 693682194 693687975 693501413 693185270 692828417
2372 692828417 692527831 692294002 692014396 691692114 691448689 691339016 691338122 691401362 691490412 691608012 691730142
2394.4 691730142 691821218 691899657 691983104 692073226 692169964 692251265 692275584 692281067 692329407 692391872 692407966 692343116
2418.9F92343116j16706j08361j00732j25587j51754j68383j62780j72257k63095l70622
2439.3F90602839l92199l74376m09127m89711n91398o73055p35939q59022j001000
2457.7F85077012j116515j260757j407385j535416j710951j925647k126515k340198
2474F71653628k591967k851963l102124l317058l506661l695666l825665l832757l689111
2492.3F41240656l459155l241718l032207k795995k577722k460956k466321k503157
2508.7F18703425k474725k400220k303004k122641j790762j331269q44598l85523Q0228
2527F05130911N97536J139522J635432K037704K351105K599180K781391K879084K896130
2545.4F24047995K862274K791584K657831K443254K151310J858950J648187J451373
$$ plain form
2418.9 692343116 692226410 692118049 692017317 691891730 691739976 691571593 691408813 691236556 690973461 690602839
2439.3 690602839 690210640 689836264 689427137 688937426 688346028 687672973 686937034 686078012 685077012
2457.7 685077012 683960497 682699740 681292355 679756939 678045988 676120341 673993826 671653628
2474 671653628 669061661 666209698 663107574 659790516 656283855 652588189 648762524 644929767 641240656
2492.3 641240656 637781501 634539783 631507576 628711581 626133859 623672903 621206582 618703425
2508.7 618703425 616228700 613828480 611525476 609402835 607612073 606280804 605436206 605050683 605130911
2527 605130911 605728447 606867969 608503401 610541105 612892210 615491390 618272781 621151865 624047995
2545.4 624047995 626910269 629701853 632359684 634802938 636954248 638813198 640461385 641912758
2561.7F41912758J243532J073539R14038P84874P11083N83649M14431L59654L83675
2580F48381233L57032K79486K07484J51396J25766J42335J57476J47998J87218K81692
2600.4F50419116L01838K72930L19123M55201N98907O59108O80030P85827R56893J029611
2620.8F56478584R83774R47655R85205J058400J067876R84133R19878R41932R69112
2639.2F65336549R30608Q42452P61509P12990O39677M68791K80201K00272J70708J08659
2659.6F70452416M888j16349j55270j08600j30295k27869k88844l25978l64363l42607
2680F68397129k61963k34067k84314l15726l07024l21805l76702m12345l78310l53992
2700.4F65150881l90649m29153m36604m28916m49895m83096m78685m38809m38750n10335
$$ plain form
2561.7 641912758 643156290 644229829 645143867 645928741 646639824 647223473 647637904 647997558 648381233
2580 648381233 648738265 649017751 649225235 649376631 649502397 649644732 649802208 649950206 650137424 650419116
2600.4 650419116 650720954 650993884 651313007 651768208 652367115 653026223 653706253 654492080 655448973 656478584
2620.8 656478584 657462358 658410013 659395218 660453618 661521494 662505627 663425505 664367437 665336549
2639.2 665336549 666267157 667109609 667871118 668584108 669223785 669692576 669972777 670173049 670343757 670452416
2659.6 670452416 670457304 670340955 670185685 670077085 669946790 669718921 669430077 669104099 668739736 668397129
2680 668397129 668135166 667901099 667616785 667301059 666994035 666672230 666295528 665883183 665504873 665150881
2700.4 665150881 664760232 664331079 663894475 663465559 663015664 662532568 662053883 661615074 661176324 660665989
2720.8F60665989n60105n22137m14967l62694m22955n04196n33521m96030m40895m30346
2741.2F55978143m58002m87566n15163n15282m93228m80116m70757m97103n63383n85556
2761.6F50911987n54741n61952o29425p00653p44700p49469o90281o50526p02261p80583
2782F44147396q44002r09507r76741r89080r63747j002550j091004j125634j109719
2800.3F35135412j138031j211405j290143j370489j417816j443684j507044j573443
2816.6F24183357j605630j659990j751840j831472j927495k061724k178967k282620
2832.9F08883619k446770k696216k952219l270924l797888m413069m719078m339993
2849.3E80247462l374458k350449j689792j456559j473486j606703j869321k178371
$$ plain form
2720.8 660665989 660105884 659583747 659168780 658806086 658383131 657878935 657345414 656849384 656408489 655978143
2741.2 655978143 655520141 655032575 654517412 654002130 653508902 653028786 652558029 652060926 651497543 650911987
2761.6 650911987 650357246 649795294 649165869 648465216 647720516 646971047 646280766 645630240 644927979 644147396
2782 644147396 643303394 642393887 641417146 640428066 639464319 638461769 637370765 636245131 635135412
2800.3 635135412 633997381 632785976 631495833 630125344 628707528 627263844 625756800 624183357
2816.6 624183357 622577727 620917737 619165897 617334425 615406930 613345206 611166239 608883619
2832.9 608883619 606436849 603740633 600788414 597517490 593719602 589306533 584587455 580247462
2849.3 580247462 576873004 574522555 572832763 571376204 569902718 568296015 566426694 564248323
2865.6E64248323k400219k537906k514899k188981j706242j404286j355886j363814
2881.9E48776090j305818j236320j224220j242399j218617j111090r63867q97705r66132
2900.2E38609922j041830j062274j183569j523793k017140k475918k686202k582431
2916.6E24036765k199471j568854r11414m17292n7340K79367O91056J055598J256705
2934.9E22165120J364588J397074J359224J320064J227081J017213P39336M38094K06947
2953.3E31234741Q3268K4199O2645K80857O12557Q64327J030743J195669J322866J367569
2973.7E38079441J330316J257956J265943J343310J309454J092970Q47280O99163O53326
2992E47879159O48916N47588M67479N25773N02646L83675L17275K68758K10643J95801
$$ plain form
2865.6 564248323 561848104 559310198 556795299 554606318 552900076 551495790 550139904 548776090
2881.9 548776090 547470272 546233952 545009732 543767333 542548716 541437626 540473759 539576054 538609922
2900.2 538609922 537568092 536505818 535322249 533798456 531781316 529305398 526619196 524036765
2916.6 524036765 521837294 520268440 519357026 518939734 518882394 519161761 519852817 520908415 522165120
2934.9 522165120 523529708 524926782 526286006 527606070 528833151 529850364 530589700 531027794 531234741
2953.3 531234741 531318009 531342208 531404853 531685710 532298267 533162594 534193337 535389006 536711872 538079441
2973.7 538079441 539409757 540667713 541933656 543276966 544586420 545679390 546526670 547225833 547879159
2992 547879159 548528075 549075663 549543142 550068915 550571561 550955236 551272511 551541269 551751912 551947713
3012.4E51947713K25246K13086J00255n5611k50518m78744o19591o57916p03156q14080
3032.8E48906684q78513q95083r95099j092673j116812j115918j126170j175583j202404
3051.2E39308429j215816j264870j245379j189471j216292j261115j282156j214444
3067.5E29418886j072467j062333j168490j251578j252294j156330j087665j102507
3083.8E20265222j100123j088798j107693j122534j149536j186430j226008j248777
3100.1E11035323j238525j261472j326085j357376j342595j410842j537502j542687
3116.4E00018239j469821j392930j354993j449585j599669j658291j637280j637459
3132.8D87818211j697659j799137j846373j771658j720578j779407j850635j932353
$$ plain form
3012.4 551947713 552172959 552386045 552486300 552430689 552180171 551701427 551081836 550423920 549720764 548906684
3032.8 548906684 548028171 547133088 546137989 545045316 543928504 542812586 541686416 540510833 539308429
3051.2 539308429 538092613 536827743 535582364 534392893 533176601 531915486 530633330 529418886
3067.5 529418886 528346419 527284086 526115596 524864018 523611724 522455394 521367729 520265222
3083.8 520265222 519165099 518076301 516968608 515846074 514696538 513510108 512284100 511035323
3100.1 511035323 509796798 508535326 507209241 505851865 504509270 503098428 501560926 500018239
3116.4 500018239 498548418 497155488 495800495 494350910 492751241 491092950 489455670 487818211
3132.8 487818211 486120552 484321415 482475042 480703384 478982806 477203399 475352764 473420411
3149.1D73420411k024799j994163j894355j895815j962870k017200k043367k044052
3165.4D57543790k060800k086193k067357k053440k090484k107411k081067k059221
3181.7D40937817k073109k124190k160877k140552k090126k048910k007485j997351
3198D24295217k051324k077103k042084k006382k014607k028376j981914j955629j992136
3216.4D06145662k008825j970053j910687j877844j891285j931250j959175j914084
3232.7C90682459j833290j836628j887977j899987j891047j893044j886248j861423
3249C75692815j865715j908541j921803j891046j882196j905858j924485j900971j835078
3267.4C58657122j778573j750380j735151j681506j582832j540243j552254j536369
$$ plain form
3149.1 473420411 471395612 469401449 467507094 465611279 463648409 461631209 459587842 457543790
3165.4 457543790 455482990 453396797 451329440 449276000 447185516 445078105 442997038 440937817
3181.7 440937817 438864708 436740518 434579641 432439089 430348963 428300053 426292568 424295217
3198 424295217 422243893 420166790 418124706 416118324 414103717 412075341 410093427 408137798 406145662
3216.4 406145662 404136837 402166784 400256097 398378253 396486968 394555718 392596543 390682459
3232.7 390682459 388849169 387012541 385124564 383224577 381333530 379440486 377554238 375692815
3249 375692815 373827100 371918559 369996756 368105710 366223514 364317656 362393171 360492200 358657122
3267.4 358657122 356878549 355128169 353393018 351711512 350128680 348588437 347036183 345499814
3283.7C45499814j476318j412273j382321j370132j345873j299858j260131j223058
3300C34729850j207620j251667j275123j257538j257718j274794j284451j282990j315921
3318.4C23322028j420975j524418j536221j508683j512378j562446j638949j660496
3334.7C10957462j631350j603007j569986j512528j433551j383484j372993j349210
3351B99101353j302243j281082j241982j163304j148433j192897j189560j117110j055032
3369.3B88409710j051188j021027r03547q04275p85887p82967p62433p34001o46085
3387.7B80918300n32448n01365n35220n52535m77433l39329l02225l72470l71486k68101
3408.1B76665688j41174n5194j4454j669J2726O6965J35214K41935L58939L95358L96758
$$ plain form
3283.7 345499814 344023496 342611223 341228902 339858770 338512897 337213039 335952908 334729850
3300 334729850 333522230 332270563 330995440 329737902 328480184 327205390 325920939 324637949 323322028
3318.4 323322028 321901053 320376635 318840414 317331731 315819353 314256907 312617958 310957462
3334.7 310957462 309326112 307723105 306153119 304640591 303207040 301823556 300450563 299101353
3351 299101353 297799110 296518028 295276046 294112742 292964309 291771412 290581852 289464742 288409710
3369.3 288409710 287358522 286337495 285433948 284629673 283843786 283060819 282298386 281564385 280918300
3387.7 280918300 280385852 279884487 279349267 278796732 278319299 277979970 277677745 277305275 276933789 276665688
3408.1 276665688 276524514 276469320 276454866 276453197 276465923 276532888 276668102 276910037 277268976 277664334 278061092
3430.5B78061092N10454O30647O12855N90146O60002P38203P88629Q84742R71168J018912
3450.9B85466850J079738J175761J261056J260042J218527J284987J432538J482368
3467.2B95661867J444935J434446J488477J556933J675188J774699J755327J714319
3483.6C08506191J720756J749098J827002J944929J970172J951635J965582K014548
3499.9C23649913K091497K128989K130031K196998K255708K233922K246648K304197
3516.2C41237903K337753K329380K357512K389223K468973K641887K715587K657891
3532.5C61136109K683013K803177K826482K795607K835423K980411L087282L073335
3548.8C84220839L124415L277511L289163L215462L279328L339827L237993L363669
$$ plain form
3430.5 278061092 278571546 279202193 279815048 280405194 281065196 281803399 282592028 283476770 284447938 285466850
3450.9 285466850 286546588 287722349 288983405 290243447 291461974 292746961 294179499 295661867
3467.2 295661867 297106802 298541248 300029725 301586658 303261846 305036545 306791872 308506191
3483.6 308506191 310226947 311976045 313803047 315747976 317718148 319669783 321635365 323649913
3499.9 323649913 325741410 327870399 330000430 332197428 334453136 336687058 338933706 341237903
3516.2 341237903 343575656 345905036 348262548 350651771 353120744 355762631 358478218 361136109
3532.5 361136109 363819122 366622299 369448781 372244388 375079811 378060222 381147504 384220839
3548.8 384220839 387345254 390622765 393911928 397127390 400406718 403746545 406984538 410348207
3565.1D10348207M021942M232169L798633L657073L834784L954381M007757L977418
3581.5D41832364L774047L955632M698545M653871L968417M040927M332811M271447
3597.8D75528061M381299M439235M060716L989189M512877M514724M057765L800809
3614.1E09284675L502131L884196M686475M404366L718495L973723N874991O411612
3630.4E45740664M604697M149020M319668M219353M086435L557861K861857L270745
3646.7E76810300N176247N402088L324568L000796M019022L689527L026128K879560
3663F07328236K379298K116502L067791L174365K205133L264070L451883J841605J304805
3681.4F30133688R40502N46396J121104J838088R75787K0624R4771N76019J306892
$$ plain form
3565.1 410348207 414370149 418602318 422400951 426058024 429892808 433847189 437854946 441832364
3581.5 441832364 445606411 449562043 454260588 458914459 462882876 466923803 471256614 475528061
3597.8 475528061 479909360 484348595 488409311 492398500 496911377 501426101 505483866 509284675
3614.1 509284675 512786806 516671002 521357477 525761843 529480338 533454061 539329052 545740664
3630.4 545740664 550345361 554494381 558814049 563033402 567119837 570677698 573539555 576810300
3646.7 576810300 581986547 587388635 590713203 593713999 597733021 601422548 604448676 607328236
3663 607328236 609707534 611824036 614891827 618066192 620271325 623535395 626987278 628828883 630133688
3681.4 630133688 631074190 631620586 632741690 634579778 635555565 635576189 635670960 636246979 637553871
3699.8F37553871K247214K289176J663446J688183K489507K995253J883089P98285
3716.1F53608024P35760R22501J000524J051247R73701L85702q6546K55287J140773
3734.4F59986973J520872L63111r23812k50637J481950P18176N305J375437J236021
3752.8F65513396j16408j00374O54519N40197n6684M5478L03864O47545P79748J32501
3773.2F68343782l02970J9252N30720L20435R000K58326L01242J42217k4021k20477
3793.6F69377506j04606j65046Q1003Q26001K30670N9843O80566j8835p81536l64184
3814F69821382L79562K0862K85804R72211P5519l15487j93119k16365q8692j89781
3834.4F70551896P9274P17104N16414J63913p75n76675j175165q51214J346410K265095
$$ plain form
3699.8 637553871 639801085 642090261 643753707 645441890 647931397 650926650 652809739 653608024
3716.1 653608024 654343784 655266285 656266809 657318056 658291757 658677459 658590913 658846200 659986973
3734.4 659986973 661507845 661870956 660947144 660696507 662178457 662896633 662901938 664277375 665513396
3752.8 665513396 665396988 665296614 665951133 666491330 666434646 666480124 666783988 667431533 668211281 668343782
3773.2 668343782 668040812 668060064 668590784 668911219 668920219 669178545 669479787 669622004 669597983 669377506
3793.6 669377506 669272900 669107854 669188857 670014858 670245528 670305371 670985937 670967102 670185566 669821382
3814 669821382 670200944 670221806 670507610 671479821 671555340 671239853 671046734 670830369 670741677 670551896
3834.4 670551896 670631170 671348274 671864688 672028601 672027826 671451151 670275986 669424772 670771182 673036277
3854.8F73036277j60873j176238o96540Q1122K44856l37899m2617N66065L12806l398
3875.2F71823561m23491k75731R1195k9862L07143N4598l56078K96831K25782p08401
3895.5F71005547q05795j82927L46720P23005N67436j21057l89338l22520l30568j26481
3915.9F70364022J73390N9903j31130K7716R358l07441k13206J56641J49369j04785
3936.3F70183837k71678k09510N186o2347j75714J7583J40190M9293p5400j27315r3639
3958.8F69380486k4796N842l7015o2167p1407p4863j3828N1677L4570j6331J1742N5075
3983.2F69238985k0445j29342r6559K9206O9260j728o7115
3997.5F69022262
$$ plain form
3854.8 673036277 672875404 671699166 671002626 671083748 671328604 670990705 670948088 671514153 671826959 671823561
3875.2 671823561 671400070 671124339 671215534 671185672 671492815 671547413 671191335 671488166 671713948 671005547
3895.5 671005547 670199752 670016825 670363545 671086550 671653986 671532929 671143591 670821071 670490503 670364022
3915.9 670364022 670537412 670597315 670466185 670493901 670503259 670195818 669982612 670139253 670288622 670183837
3936.3 670183837 669912159 669702649 669707835 669645488 669469774 669487357 669627547 669676840 669601440 669474125 669380486
3958.8 669380486 669355690 669361532 669324517 669262350 669190943 669116080 669102252 669153929 669188499 669172168 669183910 669238985
3983.2 669238985 669218540 669089198 668992639 669021845 669091105 669089377 669022262
3997.5 669022262
##END=$$ End of the data block
