##TITLE=$$ Begin of the data block
##JCAMP-DX=5.00 $$ ACD/SpecManager v 10.08
##SPECTROMETER/DATA SYSTEM=Alpha
##DATE=13 Jun 2014 08:26:00
##DATA TYPE=INFRARED SPECTRUM
##DATA CLASS=XYDATA
##ORIGIN=
##OWNER=
##NPOINTS=1765
##FIRSTX=399.75695801
##LASTX=3997.56933594
##MAXX=3997.56933594
##MINX=399.75695801
##MAXY=0.69588733
##MINY=0.01471112
##XFACTOR=1.0000000000
##YFACTOR=1.000000000000000e-9
##FIRSTY=0.21951905
##DELTAX=2.03957629
##XUNITS=1/CM
##YUNITS=ARBITRARY UNITS
##XYDATA=(X++(Y..Y))
399.8B19519049R762198R191930R079367R142458R119928Q697212Q102149P868409
416.1B90482700Q954942Q925468O461829N424469N522639N827367N922705N225569
432.4C42747688N013466N837828N785644M583180M009098M450828M690647L755271
448.7C80873650K418369K038777K461016K613277J722037O42330O06954J190484J393854
467.1C95960748J331002K039253L581405M487664M228353L967911M436553M928350
483.4D24961239M437834L385455K844542L057748L172189K480268J556754J278908
499.7D47174937J806736J990795J156807L54409L64184P88033N89401k92450o15627
518.1D53317225L5375N30333J95413l74555l04997M08918R52065Q15421O46383J163393
$$ plain form
399.8 219519049 229281247 238473177 247552544 256695002 265814930 274512142 282614291 290482700
416.1 290482700 299437642 308363110 314824939 320249408 325772047 331599414 337522119 342747688
432.4 342747688 347761154 353598982 359384626 363967806 367976904 372427732 377118379 380873650
448.7 380873650 383292019 385330796 387791812 390405089 392127126 392769456 393376410 394566894 395960748
467.1 395960748 397291750 399331003 402912408 407400072 411628425 415596336 420032889 424961239
483.4 424961239 429399073 432784528 435629070 438686818 441859007 444339275 445896029 447174937
499.7 447174937 448981673 450972468 452129275 452483684 452847868 453635901 454225302 453932852 453317225
518.1 453317225 453352600 453882933 454078346 453703791 453398794 453807712 454759777 455575198 456221581 457384974
538.4D57384974J888454J927525J334905J146734J655817J877397J218289K54244j22845
556.8D68565494L67939J031041R62764N04315O76334J231939J114607M04894L0965
575.2D74890292M88937J213967J278252Q59856Q87305J524180J864404J399815O18547
593.5D85025555M01258Q44866P79540l00050j260936j191587n81473l63230n04583
611.9D82849360q6219R91494J730829J568705J178146J435399J998663J856833J138509
630.2D94661719J055300J935929K765536K584517J681745J166880J421214J592099
646.5E08864939Q36790k43485m02272Q2970J9133o53863j071990p15196J37925N65768
666.9E07420719m12524q38161K43843R78053N68926k10285l10779o4492m28915j432479
$$ plain form
538.4 457384974 459273428 461200953 462535858 463682592 465338409 467215806 468434095 468688339 468565494
556.8 468565494 468933433 469964474 470927238 471431553 472107887 473339826 474454433 474859327 474890292
575.2 474890292 475379229 476593196 477871448 478731304 479618609 481142789 483007193 484407008 485025555
593.5 485025555 485426813 486271679 487051219 486751169 485490233 484298646 483717173 483353943 482849360
611.9 482849360 482763141 483754635 485485464 487054169 488232315 489667714 491666377 493523210 494661719
630.2 494661719 495717019 497652948 500418484 503003001 504684746 505851626 507272840 508864939
646.5 508864939 509701729 509458244 509055972 509138942 509158075 508504212 507432222 506717026 506854951 507420719
666.9 507420719 507008195 506170034 506413877 507391930 507960856 507750571 507439792 507375300 506946385 505513906
687.3E05513906k387344l012896l772885n203038p073671q102655q393139r992093
703.7D57576185j2910574j4809102j4263958j1447608p932723n376011k650022K840489
720C91026676J0589570J7748534K2561044K4424582K3487568K0446450J6052067J1436284
736.3E37772775P853746N664408M194022K848088J673401J034438R17018P93397L79920
754.6E63131213J3948M9948K55227J99914j4245R6500L82721L87192J43588j12772
775E64533234j04726K88904P06375O82532K89083r596n7817k48670o74904r34064p87139
797.5E63683212l21746R4354J23739j57177l92735o34611j069069j517772j719952
815.8E58088243j702845j760662j990616k307773k589523k847791l279090l945530
$$ plain form
687.3 505513906 503126562 500113666 496340781 491137743 484064072 475961417 467568278 457576185
703.7 457576185 444665611 429856509 415592551 404144943 396212220 390836209 388186187 391026676
720 391026676 401616246 419364780 441925824 466350406 489837974 510284424 526336491 537772775
736.3 537772775 545626521 551290929 555484951 558333039 560006440 561040878 561957896 562751293 563131213
754.6 563131213 563145161 563195109 563450336 563650250 563636005 563732505 564115226 564502418 564646006 564533234
775 564533234 564428508 564717412 565423787 566106319 566395402 566385806 566327989 566079319 565404415 564470351 563683212
797.5 563683212 563361466 563455820 563579559 563422382 563029647 562395036 561325967 559808195 558088243
815.8 558088243 556385398 554624736 552634120 550326347 547736824 544889033 541609943 537664413
832.1E37664413m734039n584478o539405p915318j0346412j4650613j7952204j3449818
848.5D56492126m794657m432887j2047678j8579513k2507697k7132959l4264654m4576227
864.8B88155854n7080180o2951341n0306506k5167138m945449Q644893K4007813M1769117
881.1A62127063N7363420O8293646P1720958O4041644M8116029L2325148K1487236
895.4E25475144J4903903J0646403P575095N282104L673971K569377J776397J192510
911.7E73094904Q23617O72758M96089j6331p17879j215815j395047j435041j508355
930E68798900j547814j367092j052499q75413r37164j148462j298726j448035j900435
948.4E57223260k593755l164411l565311l993810m518806n034149n396784n647659
$$ plain form
832.1 537664413 532930374 527345896 520806491 512891173 502544761 487894148 469941944 456492126
848.5 456492126 451697469 447264582 435216904 416637391 394129694 366996735 332732081 288155854
864.8 288155854 231075674 168124333 117817827 92650689 87705240 96350133 120357946 162127063
881.1 162127063 219490483 287784129 359505087 423546731 471662760 503987908 525475144
895.4 525475144 540379047 551025450 558600545 563882649 567556620 570125997 571902394 573094904
911.7 573094904 573918521 574591279 575087368 575071037 574353158 573137343 571742296 570307255 568798900
930 568798900 567251086 565883994 564831495 563956082 563018918 561870456 560571730 559123695 557223260
948.4 557223260 554629505 551465094 547899783 543905973 539387167 534353018 528956234 523308575
964.7E23308575n977452o483316p042646p583529q180291q920371r786785j0539114
981D58795071j0905385j0872096j0601729j0171175r564042q786679q015990p414579
997.3C82463396o996692o773084o729186o808072o888211o804019o507456o077826
1013.7C28878850n591989n053997m390150l643453k957374k363742j787096j122027
1030C01969022l87729K05934M95375M81307K11567j16080k90275l34322k36661J78397
1050.4C02176535R39042J846849K680391L335804L761471L744572L086537J847476
1066.7C23418677K64615j419187k896279l779054l886521l451764k700150j382798
1083C04167539L47584J954943L405333M518002M674226L696591K213865J060218N75453
$$ plain form
964.7 523308575 517331123 510847807 503805161 496221632 488041341 479120970 469334185 458795071
981 458795071 447889686 437017590 426415861 416244686 406680644 397893965 389877975 382463396
997.3 382463396 375466704 368693620 361964434 355156362 348268151 341464132 334956676 328878850
1013.7 328878850 323286861 318232864 313842714 310199261 307241887 304878145 303091049 301969022
1030 301969022 301581293 301787227 302282602 302763909 302975476 302859396 302569121 302234799 301998138 302176535
1050.4 302176535 303115577 304962426 307642817 310978621 314740092 318484664 321571201 323418677
1066.7 323418677 323683292 322264105 319367826 315588772 311702251 308250487 305550337 304167539
1083 304167539 304515123 306470066 309875399 314393401 319067627 322764218 324978083 326038301 326613754
1101.4C26613754O22898J042962J703889K366334K772212K796620K504110K041698
1117.7C42464477J547634J122326Q01295N47171L84837K94209J3619n52714j133620
1136C45489234j560718j894981k149582k169788j848042j353859r42827o86288m19199
1154.4C32463950L6150O53863J310349J984208K683104L210484L325791L068506K743602
1172.7C51480007K615601K603680K366960J766413J014144K87950m37707j205027j910687
1191.1C58581334k415478k701759k823800k871096k836347k649247k419651k350837
1207.4C37513119k482176k721399k974212l210604l433794l614426l733456l754943
1223.7C11588109l712386l688634l675252l587514l428430l301680l253191l257752
$$ plain form
1101.4 326613754 327236652 328279614 329983503 332349837 335122049 337918669 340422779 342464477
1117.7 342464477 344012111 345134437 345935732 346482903 346867740 347161949 347175568 346622854 345489234
1136 345489234 343928516 342033535 339883953 337714165 335866123 334512264 333569437 332883149 332463950
1154.4 332463950 332500100 333153963 334464312 336448520 339131624 342342108 345667899 348736405 351480007
1172.7 351480007 354095608 356699288 359066248 360832661 361846805 362134755 361697048 360492021 358581334
1191.1 358581334 356165856 353464097 350640297 347769201 344932854 342283607 339863956 337513119
1207.4 337513119 335030943 332309544 329335332 326124728 322690934 319076508 315343052 311588109
1223.7 311588109 307875723 304187089 300511837 296924323 293495893 290194213 286941022 283683270
1240.1B83683270l262609l231823l167123l154725l189266l205955l233164l293425
1256.4B57945180l345311l349870l320664l308580l346577l377393l412664l439560
1272.7B31044561l469676l544450l629610l691688l712580l767028l885388l983498
1289B01360643l993690m033610m149214m250839m282132m272655m253625m214004m189700
1307.4A63721174m120961m041314l985375l901288l860623l873557l834813l844679
1323.7A32258564l938064l984652l975883l872499l702693l651082l869839m026935
1340A01236917l764853l502361l525675l575861l513247l437534l415696l358320l211885
1358.3F9931485l194727l305651l140066k830554k763286k677784k631470k699547
$$ plain form
1240.1 283683270 280420661 277188838 274021715 270866990 267677724 264471769 261238605 257945180
1256.4 257945180 254599869 251249999 247929335 244620755 241274178 237896785 234484121 231044561
1272.7 231044561 227574885 224030435 220400825 216709137 212996557 209229529 205344141 201360643
1289 201360643 197366953 193333343 189184129 184933290 180651158 176378503 172124878 167910874 163721174
1307.4 163721174 159600213 155558899 151573524 147672236 143811613 139938056 136103243 132258564
1323.7 132258564 128320500 124335848 120359965 116487466 112784773 109133691 105263852 101236917
1340 101236917 97472064 93969703 90444028 86868167 83354920 79917386 76501690 73143370 69931485
1358.3 69931485 66736758 63431107 60291041 57460487 54697201 52019417 49387947 46688400
1374.7D6688400k505652k267197k165884k052341j971840k032884j957726j711018
1391C0023858j720049j834245j698989j591601j474421j301719j239751j078564q87989
1409.3A7196530p47423n97505m72673m02225k56664q924J62019K73029L54775M23245
1429.7A5924184M40417M23204M51956N31865M61841L60306L11522K82936K74509K57537
1450.1A9720277K39473J94525J82927K99271M00619L67582L80852M62280M60189M32080
1470.5B3140075N54369P38912P68790P73174Q17461R19154R73726J056502J249224
1488.9C0991387J466110J482461J535769J893930K115149K018139J775313J908627
1505.2D5186885K763215K816610K416358K354066K410748K549238K601236K890416
$$ plain form
1374.7 46688400 44182748 41915551 39749667 37697326 35725486 33692602 31734876 30023858
1391 30023858 28303809 26469564 24770575 23178974 21704553 20402834 19163083 18084519 17196530
1409.3 17196530 16449107 15851602 15378929 14976704 14720040 14711116 14873135 15146164 15500939 15924184
1429.7 15924184 16364601 16787805 17239761 17771626 18233467 18593773 18905295 19188231 19462740 19720277
1450.1 19720277 19959750 20154275 20337202 20636473 21037092 21404674 21785526 22247806 22707995 23140075
1470.5 23140075 23694444 24433356 25202146 25975320 26792781 27711935 28685661 29742163 30991387
1488.9 30991387 32457497 33939958 35475727 37369657 39484806 41502945 43278258 45186885
1505.2 45186885 47950100 50766710 53183068 55537134 57947882 60497120 63098356 65988772
1521.5F5988772K976581K743363K840817K701819K662711L021814K795868K463147
1537.8H8194892L240011L832184L495381L454245L449656L711686L943525M055724
1554.1A17377304M002347N225845O817028N067155M446461M675299M811928N048007
1570.5A57471374M331514L877416M389376M037201L456429L394469L261790L033116
1586.8A87252685K851502K692490K517879K346039K166599K036855J948610J862272
1603.1B05674931J693085J517907J399905J275882J066312Q47682Q30770Q97750P86722
1621.4B15990946O32584N99474N90592O47813P22185P23064Q71718J254395J444309
1639.8B23477080J520440J566530J823768K270937K105817K312720L369912L128290
$$ plain form
1521.5 65988772 68965353 71708716 74549533 77251352 79914063 82935877 85731745 88194892
1537.8 88194892 91434903 95267087 98762468 102216713 105666369 109378055 113321580 117377304
1554.1 117377304 121379651 126605496 133422524 138489679 142936140 147611439 152423367 157471374
1570.5 157471374 161802888 165680304 170069680 174106881 177563310 180957779 184219569 187252685
1586.8 187252685 190104187 192796677 195314556 197660595 199827194 201864049 203812659 205674931
1603.1 205674931 207368016 208885923 210285828 211561710 212628022 213475704 214306474 215204224 215990946
1621.4 215990946 216623530 217223004 217813596 218461409 219183594 219906658 220778376 222032771 223477080
1639.8 223477080 224997520 226564050 228387818 230658755 232764572 235077292 238447204 241575494
1656.1B41575494K798260L037646L474414L683061L361136L586292M274577M058659
1672.4B69849539M097372M517347M223674L859014M147470N428016N271286M588335
1688.8C05982053M784316M535586M878968N493253N596161O407112N561918M874706
1705.1C48114073N189538M784256M237026L857285L792078M394024M450858L646821
1721.4C82465959L340095L392756L293484L156543K913088L285616L664494L134012
1737.7D08646047L117442L261417L126473L091633L114283L270716L364473L041744
1754D34034228K926201K965152K745450K732336K631575K349138K181471J978129J949072
1772.4D56492752J842290J269132N25385k14726q63224j546353k163291k588540l195137
$$ plain form
1656.1 241575494 244373754 247411400 250885814 254568875 257930011 261516303 265790880 269849539
1672.4 269849539 273946911 278464258 282687932 286546946 290694416 296122432 301393718 305982053
1688.8 305982053 310766369 315301955 320180923 325674176 331270337 337677449 343239367 348114073
1705.1 348114073 353303611 358087867 362324893 366182178 369974256 374368280 378819138 382465959
1721.4 382465959 385806054 389198810 392492294 395648837 398561925 401847541 405512035 408646047
1737.7 408646047 411763489 415024906 418151379 421243012 424357295 427628011 430992484 434034228
1754 434034228 436960429 439925581 442671031 445403367 448034942 450384080 452565551 454543680 456492752
1772.4 456492752 458335042 459604174 460129559 459914833 459051609 457505256 455341965 452753425 449558288
1790.7D49558288l445953k652586j897484j376539m17114Q49188J917302K813936L706276
1809.1D49055314M628003N270511N541592N659819N540460N097896M711360M545927
1825.4D90050882M043996L687114L629565L261388K910196K711594K423585K145290
1841.7E14863610K278865K516269K309263K080619K025783J996160J921833J816153
1858E31808555J791895J799523J695872J513302J576960J859784J841963J681685J567721
1876.4E47137260J495302J482904J517058J531362J429856J368880J437545J450241
1892.7E58850408J414477J415134J366377J335680J330614J301349J223504J177669
1909E69415212J266598J290799J158058J090765J184941J196444J197338J191854J090765
$$ plain form
1790.7 449558288 446112335 443459749 441562265 440185726 439768612 440617800 442535102 445349038 449055314
1809.1 449055314 453683317 458953828 464495420 470155239 475695699 480793595 485504955 490050882
1825.4 490050882 494094878 497781992 501411557 504672945 507583141 510294735 512718320 514863610
1841.7 514863610 517142475 519658744 521968007 524048626 526074409 528070569 529992402 531808555
1858 531808555 533600450 535399973 537095845 538609147 540186107 542045891 543887854 545569539 547137260
1876.4 547137260 548632562 550115466 551632524 553163886 554593742 555962622 557400167 558850408
1892.7 558850408 560264885 561680019 563046396 564382076 565712690 567014039 568237543 569415212
1909 569415212 570681810 571972609 573130667 574221432 575406373 576602817 577800155 578992009 580082774
1927.4E80082774J053631J080811J085759J042723R92954R09090R04739J018524J059771
1945.7E89230776R96470R35853R04381Q62062Q06034P46786P63059Q09908P92324P90298
1966.1E97637951R00507R95934J006604R63151Q78871Q46803Q43107Q19803P77781
1984.5F05670512P62820P56919P61330P95842P63595P02739P12454P18951O86407O84560
2004.9F13016129O91533P12514O95467O12914N63443O02066O54042O49452O38962O12795
2025.3F19449317N88179N84960N90205N86570N70774N61714N81205O28054O34491N96881
2045.7F25372350N85795O12318N87881N45919N72562O35564O48737N79715N18203N39660
2066.1F31198704N97477O12974N89550N57899N47231N50031N73039N81920N32270N00560
$$ plain form
1927.4 580082774 581136405 582217216 583302975 584345698 585338652 586247742 587152481 588171005 589230776
1945.7 589230776 590227246 591163099 592067480 592929542 593735576 594482362 595245421 596055329 596847653 597637951
1966.1 597637951 598538458 599534392 600540996 601504147 602383018 603229821 604072928 604892731 605670512
1984.5 605670512 606433332 607190251 607951581 608747423 609511018 610213757 610926211 611645162 612331569 613016129
2004.9 613016129 613707662 614420176 615115643 615728557 616292000 616894066 617548108 618197560 618836522 619449317
2025.3 619449317 620037496 620622456 621212661 621799231 622370005 622931719 623512924 624140978 624775469 625372350
2045.7 625372350 625958145 626570463 627158344 627704263 628276825 628912389 629561126 630140841 630659044 631198704
2066.1 631198704 631796181 632409155 632998705 633556604 634103835 634653866 635226905 635808825 636341095 636841655
2086.5F36841655N28157N60522N14268M28379M12524M86076N34534M69864L66687L45826
2106.9F41488492M08173M12285L52145L19659L38972L65674L47436L20911L21567L39747
2127.3F45015061L56614L46065K91407K72215L38316L97682L60489L06308L45409M29392
2147.7F48458958M64797M34577M30644M95255N68330N89192N69403N59032N94676O29246
2168F53794110N67794N02944N49495O49273O62208N81920N44965O03259O50406N98311
2188.4F59704685N28991N17786N41031N49972N08309M57227M86076N41031N40138M97877
2208.8F64873123M26531M04596M54426M76837M36962L98219M04179M38928M29154L85999
2229.2F69128954L96610M50730M71711M22895M02928M43756M67658M41253L99411M03226
$$ plain form
2086.5 636841655 637369812 637930334 638444602 638872981 639285505 639771581 640306115 640775979 641142666 641488492
2106.9 641488492 641896665 642308950 642661095 642980754 643319726 643685400 644032836 644353747 644675314 645015061
2127.3 645015061 645371675 645717740 646009147 646281362 646619678 647017360 647377849 647684157 648029566 648458958
2147.7 648458958 648923755 649358332 649788976 650284231 650852561 651441753 652011156 652570188 653164864 653794110
2168 653794110 654361904 654864848 655414343 656063616 656725824 657307744 657852709 658455968 659106374 659704685
2188.4 659704685 660233676 660751462 661292493 661842465 662350774 662808001 663294077 663835108 664375246 664873123
2208.8 664873123 665299654 665704250 666158676 666635513 667072475 667470694 667874873 668313801 668742955 669128954
2229.2 669128954 669525564 669976294 670448005 670870900 671273828 671717584 672185242 672626495 673025906 673429132
2249.6F73429132M41789M61161M38690M20154M17053M28319M54545M32670L89398M26471
2270F77739382M78148M24385L29435L07441L51012L63648L38375L33548L50654L68416
2290.4F81384444L74854L59773L54708L98755M32730L84867L13341L56973M61518M80891
2310.8F85302854M30405L96549M54426N59569O03079N59807M71592M51863N30362M92394
2331.2F90252900L38316L47555M45068M24146L30985K84433L9280m09246l50415K98380
2351.6F92001402R22501J068533Q60810M87626K73824K03371O9260j17838k94090l57985
2372F95117414k65658j98364k62618k93136j97053r4712l4988K9147Q0168J14918J25110
2394.4F94120228J23561J25348Q4520L5226O0141R6142M6194O676L3140L3915K086
$$ plain form
2249.6 673429132 673870921 674332082 674770772 675190926 675607979 676036298 676490843 676923513 677312911 677739382
2270 677739382 678217530 678641915 678971350 679278791 679629803 679993451 680331826 680665374 681016028 681384444
2290.4 681384444 681759298 682119071 682473779 682872534 683305264 683690131 684003472 684360445 684821963 685302854
2310.8 685302854 685733259 686129808 686584234 687143803 687746882 688306689 688778281 689230144 689760506 690252900
2331.2 690252900 690591216 690938771 691383839 691807985 692138970 692423403 692462683 692053437 691703022 692001402
2351.6 692001402 692923903 693992436 694853246 695340872 695614696 695818067 695887327 695769489 695475399 695117414
2372 695117414 694851756 694653392 694390774 694097638 693900585 693805873 693770885 693800032 693880200 693995118 694120228
2394.4 694120228 694243789 694369137 694453657 694488883 694549024 694645166 694691360 694698036 694731176 694765091 694767177
2416.9F94767177k6345o0737r3341j05024j03473j29879j92880k05458j83463k45154
2437.3F93421423l54409l92794l81887m20571n11467o04809o72042p43508q58486r89020
2457.7F87492430j117170j262843j398385j516640j695216j917720k120614k347350
2474F74116492k625823k884149l093958l317177l544689l700793l778219l798425l720522
2492.3F43652737l525972l274381l026963k796471k610743k499461k466261k473236
2508.7F20979249k437591k364218k279759k125382j831353j375496q57175m02033O3360
2527F07369602O11245J154721J644969K049387K333521K561510K772689K890289K913415
2545.4F26301348K890468K809524K663792K438664K156019J890004J667976J456619
$$ plain form
2416.9 694767177 694740832 694680095 694586754 694481730 694378257 694248378 694055498 693850040 693666577 693421423
2437.3 693421423 693067014 692674220 692292333 691871762 691360295 690755486 690083444 689339936 688481450 687492430
2457.7 687492430 686375260 685112417 683714032 682197392 680502176 678584456 676463842 674116492
2474 674116492 671490669 668606520 665512562 662195385 658650696 654949903 651171684 647373259 643652737
2492.3 643652737 640126765 636852384 633825421 631028950 628418207 625918746 623452485 620979249
2508.7 620979249 618541658 616177440 613897681 611772299 609940946 608565450 607708275 607306242 607369602
2527 607369602 607980847 609135568 610780537 612829924 615163445 617724955 620497644 623387933 626301348
2545.4 626301348 629191816 632001340 634665132 637103796 639259815 641149819 642817795 644274414
2561.7F44274414J251578J082182R30190P92444P09951O05046M52280L71814L42608
2580F50812507L08811K79487K32160J92821J85787J73152J41084J30177J87575K71440
2600.4F52915001K83122K71440L34739M61102O02424O77943O90460P74443R35734J022100
2620.8F58968508R83596R36747J005113J106322J088023R80854R32991R70066R78053
2639.2F67950273R30011Q54671P75099P13110O30140M77254K98143K10464J92582J20342
2659.6F73152089k1100j36435j58489j23501j31845k16007k92063k97725k72095k69235
2680F71233594k67207k74897l06248l13998l19242l45469l67403l80635l69966l57509
2700.4F67931020l97145m34697m02212l82781m42744m88221m63844m32610m35293n05328
$$ plain form
2561.7 644274414 645525992 646608174 647538364 648330808 649040759 649645805 650098085 650469899 650812507
2580 650812507 651121318 651400805 651632965 651825786 652011573 652184725 652325809 652455986 652643561 652915001
2600.4 652915001 653198123 653469563 653804302 654265404 654867828 655545771 656236231 657010674 657946408 658968508
2620.8 658968508 659952104 660888851 661893964 663000286 664088309 665069163 666002154 666972220 667950273
2639.2 667950273 668880284 669734955 670510054 671223164 671853304 672330558 672628701 672839165 673031747 673152089
2659.6 673152089 673130989 672994554 672836065 672712564 672580719 672364712 672072649 671774924 671502829 671233594
2680 671233594 670966387 670691490 670385242 670071244 669752002 669406533 669039130 668658495 668288529 667931020
2700.4 667931020 667533875 667099178 666696966 666314185 665871441 665383220 664919376 664486766 664051473 663546145
2720.8F63546145n85318n19395l78131l74020m63783n01633m79400m40955m28319m54486
2741.2F58920705m80234m93408n07473m99130m76658m56393m51565n06639n93484o19769
2761.6F53835952n74171n42999n82873o60301p15732p44581p18832o65844p00235p74861
2782F47155523q18252q87692r70960r88066r82225j012445j048386j075744j108349
2800.3F38263404j170814j237392j291633j361370j414835j441956j490354j555205
2816.6F27299845j612723j688659j774907j824617j890600k036214k195060k319873
2832.9F11957192k471745k707123k963186l280937l825188m430532m698575m341185
2849.3E83238721l422678k397179j710236j479149j499832j626491j891196k197564
$$ plain form
2720.8 663546145 662960827 662441432 662063301 661689281 661225498 660723865 660244465 659803510 659375191 658920705
2741.2 658920705 658440471 657947063 657439590 656940460 656463802 656007409 655555844 655049205 654455721 653835952
2761.6 653835952 653261781 652718782 652135909 651475608 650759876 650015295 649296463 648630619 647930384 647155523
2782 647155523 646337271 645449579 644478619 643490553 642508328 641495883 640447497 639371753 638263404
2800.3 638263404 637092590 635855198 634563565 633202195 631787360 630345404 628855050 627299845
2816.6 627299845 625687122 623998463 622223556 620398939 618508339 616472125 614277065 611957192
2832.9 611957192 609485447 606778324 603815138 600534201 596709013 592278481 587579906 583238721
2849.3 583238721 579816043 577418864 575708628 574229479 572729647 571103156 569211960 567014396
2865.6E67014396k408027k544344k535045k198160j706004j448572j411438j338183
2881.9E51424623j227081j181901j219749j277209j226365j083136r65595r25720r70959
2900.2E41346908j003504j004815j172245j548886k000272k438188k685428k579808
2916.6E26913762k156496j539528r13442m04775m6730K52545O53982J056433J292110
2934.9E25107861J402258J462639J433193J334548J242757J065910P49290M14670K18451
2953.3E34431577J37627P2241J08421L44932O73472Q92997J010835J185716J385212
2971.6E40243030J457870J387834J267195J258135J366019J334906J110911R13262
2987.9E50339162P79450O74188O40750N79596N17130N44846N41150M76718L99948K97308
$$ plain form
2865.6 567014396 564606369 562062025 559526980 557328820 555622816 554174244 552762806 551424623
2881.9 551424623 550197542 549015641 547795892 546518683 545292318 544209182 543243587 542317867 541346908
2900.2 541346908 540343404 539338589 538166344 536617458 534617186 532178998 529493570 526913762
2916.6 526913762 524757266 523217738 522304296 521899521 521852791 522105336 522759318 523815751 525107861
2934.9 525107861 526510119 527972758 529405951 530740499 531983256 533049166 533798456 534213126 534431577
2953.3 534431577 534569204 534641445 534749866 535094798 535768270 536661267 537672102 538857818 540243030
2971.6 540243030 541700900 543088734 544355929 545614064 546980083 548314989 549425900 550339162
2987.9 550339162 551118612 551792800 552433550 553013146 553530276 554075122 554616272 555092990 555492938 555790246
3008.3E55790246K15113K08616K28405J95801J02878j4603j93477m16219n50568o15061
3028.7E54951131p18176q33809q60930q49187r19223j031399j090586j079321j082599
3047.1E46485901j159549j205265j202047j214624j175880j131475j177788j246512
3063.4E36972761j273155j192749j057863j061022j155615j201153j187563j122296
3079.7E27721345j072764j100898j122951j102805j086414j076758j101017j145184
3096E18912554j200915j240670j219273j234174j315653j347840j305163j345992j481056
3114.4E07221818j527488j478017j422882j409709j454234j539529j616180j637190
3130.7D95136589j644552j684487j743823j781404j773328j786172j822859j826048
$$ plain form
3008.3 555790246 556005359 556213975 556442380 556638181 556741059 556726456 556532979 556116760 555566192 554951131
3028.7 554951131 554232955 553399146 552538216 551689029 550769806 549738407 548647821 547568500 546485901
3047.1 546485901 545326352 544121087 542919040 541704416 540528536 539397061 538219273 536972761
3063.4 536972761 535699606 534506857 533448994 532387972 531232357 530031204 528843641 527721345
3079.7 527721345 526648581 525547683 524424732 523321927 522235513 521158755 520057738 518912554
3096 518912554 517711639 516470969 515251696 514017522 512701869 511354029 510048866 508702874 507221818
3114.4 507221818 505694330 504216313 502793431 501383722 499929488 498389959 496773779 495136589
3130.7 495136589 493492037 491807550 490063727 488282323 486508995 484722823 482899964 481073916
3147D81073916j863569j946539j957059j903444j914859j978874j993567k001196k048612
3165.4D63466197k076626k083629k091289k074867k080679k123177k143383k154052
3181.7D46638495k139122k098053k099037k123237k125800k119124k081155k030582
3198D29822385k053082k085983k076269k082020k080261k048314k010673j974702j987577
3216.4D11423504k045273k029717j964540j958131j972080j966744j978040j970977
3232.7C95538002j933038j939476j973718j953930j900941j896620j925855j920283
3249C80094141j905173j953066j999199j953930j903474j904607j903683j895279j886755
3267.4C62788975j873195j860261j805872j694351j600742j576066j579523j565099
$$ plain form
3147 481073916 479210347 477263808 475306749 473403305 471488446 469509572 467516005 465514809 463466197
3165.4 463466197 461389571 459305942 457214653 455139786 453059107 450935930 448792547 446638495
3181.7 446638495 444499373 442401320 440302283 438179046 436053246 433934122 431852967 429822385
3198 429822385 427769303 425683320 423607051 421525031 419444770 417396456 415385783 413411081 411423504
3216.4 411423504 409378231 407348514 405383974 403425843 401453763 399487019 397508979 395538002
3232.7 395538002 393604964 391665488 389691770 387737840 385836899 383940279 382014424 380094141
3249 380094141 378188968 376235902 374236703 372282773 370379299 368474692 366571009 364675730 362788975
3267.4 362788975 360915780 359055519 357249647 355555296 353954554 352378488 350798965 349233866
3283.7C49233866j537293j533509j511782j422703j399637j441717j386106j312375
3300C37688744j339316j377404j374096j375109j349508j343459j429022j470089j459628
3318.4C25171113j539439j650721j697004j697152j703024j742095j797140j818478
3334.7C11526060j783252j750976j742124j677394j615196j659990j685679j593262
3351B98018187j509487j504928j464457j403182j430869j470000j438320j368165j292944
3369.3B85135835j244723j234949j207501j109183r94056r38982q95768q57741p98642
3387.7B75854290p05809o91742p03632o61076n96135n21303m86612m92245m46886l55750
3408.1B70193100k86639k43604j67310q9497o1124k1011N7191J45465K45333L69519
$$ plain form
3283.7 349233866 347696573 346163064 344651282 343228579 341828942 340387225 339001119 337688744
3300 337688744 336349428 334972024 333597928 332222819 330873311 329529852 328100830 326630741 325171113
3318.4 325171113 323631674 321980953 320283949 318586797 316883773 315141678 313344538 311526060
3334.7 311526060 309742808 307991832 306249708 304572314 302957118 301297128 299611449 298018187
3351 298018187 296508700 295003772 293539315 292136133 290705264 289235264 287796944 286428779 285135835
3369.3 285135835 283891112 282656163 281448662 280339479 279345423 278406441 277510673 276652932 275854290
3387.7 275854290 275148481 274456739 273753107 273092031 272495896 271974593 271487981 270995736 270548850 270193100
3408.1 270193100 269906461 269662857 269495547 269406050 269344926 269323915 269381106 269526571 269771904 270141423
3428.5B70141423M41044M87715N55843N78613O08474O96212P55697P96557R00745J025528
3448.9B76987851J118183J152038J199037J295209J341999J339674J403302J514524
3465.2B87351817J554221J513243J504778J586765J667321J764894J833230J800716
3481.5C00576985J759171J834035J948476J996279K059698K065480J992881J985312
3497.8C16218317K076655K188623K257824K254635K295941K370149K371550K360731
3514.2C34394425K361775K379238K431840K555013K584636K538711K628564K776266
3530.5C54650468K835422K869726K919733K943307K988547L013075L110915L238559
3546.8C78569752L213704L252536L447711L486812L422618L486604L513842L405273
$$ plain form
3428.5 270141423 270582467 271070182 271626025 272204638 272813112 273509324 274265021 275061578 275962323 276987851
3448.9 276987851 278106034 279258072 280457109 281752318 283094317 284433991 285837293 287351817
3465.2 287351817 288906038 290419281 291924059 293510824 295178145 296943039 298776269 300576985
3481.5 300576985 302336156 304170191 306118667 308114946 310174644 312240124 314233005 316218317
3497.8 316218317 318294972 320483595 322741419 324996054 327291995 329662144 332033694 334394425
3514.2 334394425 336756200 339135438 341567278 344122291 346706927 349245638 351874202 354650468
3530.5 354650468 357485890 360355616 363275349 366218656 369207203 372220278 375331193 378569752
3546.8 378569752 381783456 385035992 388483703 391970515 395393133 398879737 402393579 405798852
3563.1D05798852L612221M337758M473805L992140L883273M078924M196734M249960
3579.4D38623667M258036M064799M191398M980535N047500M294932M257142M608125
3595.7D74326134M643976M702568M713655M349858M215329M692138M790544M442573
3612.1E10876775M109621L666222M056573M890621M557490L849447M138529O064653
3628.4E46209931O534458M673838M220784M386067M294515M178286L648996K970695
3644.7E81117570L411293N244792N326390L247440K961755L993153L675521K990544
3661F11968458K842068K408624K158761K973139K991081K094388L167689L364443J846493
3679.4F35815144J339376R77337O21855J144350J758635R85622J24335J52410N66780
$$ plain form
3563.1 405798852 409411073 413748831 418222636 422214776 426098049 430176973 434373707 438623667
3579.4 438623667 442881703 446946502 451137900 456118435 461165935 465460867 469718009 474326134
3595.7 474326134 478970110 483672678 488386333 492736191 496951520 501643658 506434202 510876775
3612.1 510876775 514986396 518652618 522709191 527599812 532157302 536006749 540145278 546209931
3628.4 546209931 552744389 557418227 561639011 566025078 570319593 574497879 578146875 581117570
3644.7 581117570 584528863 589773655 595100045 598347485 601309240 605302393 608977914 611968458
3661 611968458 614810526 617219150 619377911 622351050 625342131 627436519 630604208 633968651 635815144
3679.4 635815144 637154520 638131857 638753712 639898062 641656697 642642319 642766654 642919064 643485844
3697.7F43485844J280785K256989K329588J692474J692593K432227K895057J882792
3714F59948349Q86083Q01503R61662J018047R97066Q77679L40879l6359L44932J123428
3734.4F67263269J421035L64840q45611k30730J424074O78897r6500J234472J298189
3752.8F72511935L9697p1824N70774N18263K5093J21534L15368N81563O71029Q5592
3773.2F75369024k36153J36971N85318L29911K6525K42590K57373N6863j08421k06887
3793.6F76453114o3420j71065L7193P73847K59221J04546O54877n3883q06153m00066
3814F76788211L62515M4525K40326Q89182J23024k44558j89841k50399j38581j71423
3834.4F77452981J70529P35641M52161J15990L3439m74334j137376r37820J155139
$$ plain form
3697.7 643485844 644766629 647023618 649353206 651045680 652738273 655170500 658065557 659948349
3714 659948349 660834432 661635935 662597597 663615644 664612710 665490389 665831268 665794909 666139841 667263269
3734.4 667263269 668684304 669049144 668203533 667972803 669396877 670075774 669979274 671213746 672511935
3752.8 672511935 672551632 672479808 673050582 673568845 673593938 673715472 674030840 674612403 675283432 675369024
3773.2 675369024 675132871 675269842 675855160 676185071 676211596 676454186 676711559 676768422 676660001 676453114
3793.6 676453114 676389694 676218629 676255822 677029669 677288890 677393436 678048313 677994430 677188277 676788211
3814 676788211 677150726 677195251 677435577 678324759 678447783 678203225 678013384 677762985 677624404 677452981
3834.4 677452981 677623510 678359151 678811312 678927302 678960741 678486407 677349031 676411211 677566350
3852.7F77566350K119839j15216j064777o09518J17124K61247l25859j03950M79102
3871.1F78324342K81036K3544l19958j95801Q2433j00076K02417O6459k41458L41355
3891.5F78464293K16604o55294p08103j43647K47478N49436N05269o8844l39627k82168
3911.9F77785397l10302j57714J32382R954j86026M1842Q9526k54273k27153J48654
3932.3F77072287J66714j10090k65300j78457M8340L815j46151p331P1704n3704r9480
3954.7F76502347o5267k9206L2305J7763p6473p7903k5571l2961k2233M5836N4419
3977.1F76323056k086k1279l2604p0214p9453k2173L8088J6272k1875J0729
3997.5F76138461
$$ plain form
3852.7 677566350 679686189 679570973 678506196 677896678 678013802 678275049 677949190 677845240 678324342
3871.1 678324342 678605378 678628922 678308964 678113163 678195596 678095520 678297937 678364396 678122938 678464293
3891.5 678464293 678680897 678025603 677317500 677173853 677421331 677970767 678476036 678407192 678067565 677785397
3911.9 677785397 677475095 677317381 677449763 677459717 677273691 677315533 677405059 677150786 676923633 677072287
3932.3 677072287 677239001 677128911 676863611 676685154 676733494 676737309 676591158 676583827 676655531 676601827 676502347
3954.7 676502347 676437080 676407874 676440179 676457942 676381469 676303566 676277995 676245034 676222801 676268637 676323056
3977.1 676323056 676320970 676299691 676267087 676196873 676117420 676095247 676133335 676149607 676127732 676138461
3997.5 676138461
##END=$$ End of the data block
