##TITLE=G5-Salen $$ Begin of the data block
##JCAMP-DX=5.00 $$ ACD/SpecManager v 10.08
##SPECTROMETER/DATA SYSTEM=Alpha
##DATE=08 Apr 2014 08:54:24
##DATA TYPE=INFRARED SPECTRUM
##DATA CLASS=XYDATA
##ORIGIN=
##OWNER=
##NPOINTS=1765
##FIRSTX=399.75695801
##LASTX=3997.56933594
##MAXX=3997.56933594
##MINX=399.75695801
##MAXY=0.84458327
##MINY=0.25924215
##XFACTOR=1.0000000000
##YFACTOR=1.000000000000000e-9
##FIRSTY=0.84242147
##DELTAX=2.03957629
##XUNITS=1/CM
##YUNITS=ARBITRARY UNITS
##XYDATA=(X++(Y..Y))
$$ plain form
399.8 842421472 843938649 844583273 842623949 840819240 841216683 841361225 839288354 837224603 837201774
418.1 837201774 836593211 832551658 826857328 820163369 809006393 792542577 781555057 787500978
434.4 787500978 805449486 820400774 827839613 832538486 835830271 835872829 833932817 833127677 833489895
452.8 833489895 832300603 829093039 826826990 825900912 822612345 815504849 804188967 786359012
469.1 786359012 766720831 758867621 767476797 782115817 791687012 793298244 789447784 784474075
485.4 784474075 788579106 804819465 822768688 834044099 838763773 839134872 838201582 838643789
501.7 838643789 839493036 838578105 836972356 837025464 837960958 837435067 835732937 835206985 835982859 835779011
522.1 835779011 834265828 833510578 834011197 833631158 831683934 830140471 830130577 829993904 828318775
$$ packed form
399.8H42421472J517177O44624j959324j804709L97443J44542k072871k063751k2829
418.1H37201774o08563m041553n694330o693959j1156976j6463816j0987520N945921
434.4G87500978J7948508J4951288P438839M698873L291785M2558j940012q05140L62218
452.8H33489895j189292l207564k266049r26078l288567p107496j1315882j7829955
469.1G86359012j9638181p853210Q609176J4639020R571195J611232l850460m973709
485.4G84474075M105031J6240359J7949223J1275411M719674L71099r33290M42207
501.7H38643789Q49247r14931j605749N3108R35494n25891j702130n25952P75874k03848
522.1H35779011j513183p55250N00619l80039j947224j543463r894j36673j675129
$$ plain form
540.5 828318775 826306939 825078368 822987497 817564726 808499277 797915876 788293064 780520082
556.8 780520082 772427738 763969541 764959097 781601012 803368032 818473518 825754821 828087628
573.1 828087628 827720106 827094853 827519953 827977896 827482283 826963902 827648580 828666151 828329206 827250779
593.5 827250779 827344775 828251839 828197598 827243745 826961994 827510893 827447951 826390266 825657904 825855613
613.9 825855613 825792968 824825764 824131906 824480057 824815571 823886931 822178721 820655882 818544090
632.3 818544090 814376593 808225036 800536573 788882673 767508268 732927322 698394060 694640040
648.6 694640040 731019497 777347624 808035135 823318005 830267012 832734525 833320737 833644688
664.9 833644688 833576858 832964122 832949877 833494067 833930194 833601296 832579613 831824243 831535101 830831349
$$ packed form
540.5H28318775k011836j228571k090871n422771r065449j0583401r622812p772982
556.8G80520082q092344q458197R89556J6641915K1767020J5105486P281303K332807
573.1H28087628l67522o25253M25100M57943m95613n18381O84678J017571l36945j078427
593.5H27250779R3996R07064n4241r53853k81751N48899o2942j057685p32362J97709
613.9H25855613o2645r67204o93858L48151L35514r28640j708210j522839k111792
632.3H18544090m167497o151557p688463j1653900k1374405l4580946l4533262l754020
648.6F94640040L6379457M6328127L0687511J5282870O949007K467513N86212L23951
664.9H33644688o7830o12736j4245N44190M36127l28898j021683p55370k89142p03752
$$ plain form
685.3 830831349 829364002 827942431 827055693 825951457 824104130 821989059 820201874 818407416 815942585
703.7 815942585 812979817 810250044 807598770 804217160 800021529 795564890 790903389 785148680
720 785148680 777803063 769096315 758830965 745573282 727169633 701670647 666258454 613489151
736.3 613489151 531665027 432177395 383801222 422873825 448991776 400564343 381532580
750.6 381532580 442492038 497912169 510027170 537629366 611200809 689106822 732807994
764.8 732807994 740909457 720717430 678735852 636513650 625890911 656552017 707113147 752441585
781.2 752441585 783527970 803238869 816187978 824326038 828190804 828980446 828352213 827023625
797.5 827023625 824791551 821747124 818172872 813418210 806923509 801146388 799426556 800629973
$$ packed form
685.3H30831349j467347j421571q86738j104236j847327k115071j787185j794458k464831
703.7H15942585k962768k729773k651274l381610m195631m456639m661501n754709
720G85148680p345617q706748j0265350j3257683j8403649k5498986l5412193n2769303
736.3F13489151q1824124r9487632m8376173L9072603K6117951m8427433j9031763
750.6C81532580O0959458N5420131J2115001K7602196P3571443P7906013M3701172
764.8G32807994Q101463k0192027m1981578m2222202j0622739L0661106N0561130M5328438
781.2G52441585L1086385J9710899J2949109Q138060L864766P89642o28233j328588
797.5H27023625k232074l044427l574252m754662o494701n777121j719832J203417
$$ plain form
813.8 800629973 800855935 798701167 795238853 791312277 786719263 781082869 774620354 767613173 759762704
832.1 759762704 750534832 739715099 727123559 711986721 693224430 670155346 642920911 612425208
848.5 612425208 580508709 550344110 526053309 511442065 509590089 524159789 558579028 609944940
864.8 609944940 664266169 703767478 720823407 724083006 728267848 738059461 748834550 757214189
881.1 757214189 763142228 767004728 768759310 768546164 766623974 761673212 749827921 731323540
897.4 731323540 722894788 741963804 775501013 799309433 809917092 814692795 817381382 818935812
913.7 818935812 819897532 820616484 821030200 820840597 820222139 819521666 818394363 815337539 806564510
932.1 806564510 788165212 771626770 777637064 799643517 815086186 820228279 821496129 821615875
$$ packed form
813.8H00629973K25962k154768l462314l926576m593014n636394o462515p007181p850469
832.1G59762704r227872j0819733j2591540j5136838j8762291k3069084k7234435l0495703
848.5F12425208l1916499l0164599k4290801j4611244j851976J4569700L4419239N1365912
864.8F09944940N4321229L9501309J7055929L259599M184842R791613J0775089Q379639
881.1G57214189N928039L862500J754582k13146j922190m950762j1845291j8504381
897.4G31323540q428752J9069016L3537209K3808420J0607659M775703K688587J554430
913.7H18935812R61720P18952M13716j89603o18458p00473j127303l056824q773029
932.1H06564510j8399298j6538442O010294K2006453J5442669N142093J267850J19746
$$ plain form
948.4 821615875 821351528 820849657 819914520 818214715 815514684 811441422 805103958 794673502 774851441
966.8 774851441 738631129 698249280 681523740 688444793 693740189 683970034 675330281 696832955
983.1 696832955 741459668 776311100 791951060 797366619 798508883 797350943 794730723 790866733
999.4 790866733 785607755 778818786 770506084 760332882 747101426 728713989 702230096 663276911
1015.7 663276911 608096004 552486956 543853581 607976496 699863672 760804176 780361474
1030 780361474 773942769 748597443 700857103 628994763 552281022 517297864 554961145 637759805
1046.3 637759805 715061307 765772581 794709086 810323119 818497181 822937131 825399160 826312006
1062.6 826312006 826011479 825098753 823813677 822063923 820120811 818666339 817933440 817434669 816621661
$$ packed form
948.4H21615875k64347n01871r35137j699805k700031m073262o337464j0430456j9822061
966.8G74851441l6220312m0381849j6725540O921053N295396r770155q639753K1502674
983.1F96832955M4626713L4851432J5639960N415559J142264j157940k620220l863990
999.4G90866733n258978o788969q312702j0173202j3231456j8387437k6483893l8953185
1015.7F63276911n5180907n5609048q633375O4122915R1887176O0940504J9557298
1030G80361474o418705k5345326m7740340p1862340p6713741l4983158L7663281Q2798660
1046.3F37759805P7301502N0711274K8936505J5614033Q174062M439950K462029R12846
1062.6H26312006l00527r12726j285076j749754j943112j454472p32899m98771q13008
$$ plain form
1081 816621661 815480649 814206302 812597811 810447633 807836592 804634333 800035417 793006718 782622397
1099.3 782622397 768167078 751029491 737273932 731596351 726840019 712683797 697718561 704522669
1115.6 704522669 736071765 770926714 792993546 802735567 805795789 805909514 804951906 803358972
1132 803358972 800721705 796493590 789995551 778967381 757067084 711023152 634787917 558487058
1148.3 558487058 543031514 614241779 716254115 782281756 807698429 815344393 816916227
1162.6 816916227 816094041 814358890 812601745 811219335 810133934 808808744 806801379 803928614
1178.9 803928614 800264359 795596361 789267480 780418992 768270373 751335740 726072550 689528525
1195.2 689528525 649578273 628338635 639729202 671368122 700942934 716999233 719700277
$$ packed form
1081H16621661j141012j274347j608491k150178k611041l202259m598916p028699j0384321
1099.3G82622397j4455319j7137587j3755559n677581m756332j4156222j4965236O804108
1115.6G04522669L1549096L4854949K2066832R742021L060222J13725r57608j592934
1132H03358972k637267m228115o498039j1028170k1900297m6043932p6235235p6300859
1148.3E58487058j5455544P1210265J02012336O6027641K5416673P645964J571834
1162.6H16916227q22186j735151j757145j382410j085401j325190k007365k872765
1178.9H03928614l664255m667998o328881q848488j2148619j6934633k5263190l6544025
1195.2F89528525l9950252k1239638J1390567L1638920K9574812J6056299K701044
$$ plain form
1209.5 719700277 713797748 702941775 688421369 674555242 671301723 684952617 709364951 733116150
1225.8 733116150 750927150 763644099 772380412 776803672 776641011 772559166 765480697 755298734
1242.1 755298734 741052985 724700153 716197371 726729333 751348078 772225976 780144513 778081000
1258.4 778081000 771001160 762356460 753893435 744036078 728968680 705607951 672179699 627636492
1274.7 627636492 571284652 504663587 437510222 397153884 419550091 502274454 588434815
1289 588434815 632136345 643945217 655234516 679070711 710691154 741496742 764902472 778788865
1305.3 778788865 785528004 787899852 785582304 776280403 762995780 759133875 774310589 797327340
1321.6 797327340 812675357 818597913 819607794 818395317 816017687 813143671 810304523 807851791
$$ packed form
1209.5G19700277n902529j0855973j4520406j3866127l253519J3650894K4412334K3751199
1225.8G33116150J7811000J2716949Q736313M423260j62661m081845p078469j0181963
1242.1G55298734j4245749j6352832q502782J0531962K4618745K0877898P918537k063513
1258.4G78081000p079840q644700q463025r857357j5067398k3360729l3428252m4543207
1274.7F27636492n6351840o6621065o7153365m0356338K2396207Q2724363Q6160361
1289E88434815M3701530J1808872J1289299K3836195L1620443L0805588K3405730J3886393
1305.3G78788865O739139K371848k317548r301901j3284623l861905J5176714K3016751
1321.6G97327340J5348017N922556J009881j212477k377630k874016k839148k452732
$$ plain form
1338 807851791 806083262 805136323 804522574 803604305 802054346 800007224 797606230 794727325 791026592
1356.3 791026592 786101699 778692126 765980721 746617854 720941842 690885067 668056607 664792836
1372.6 664792836 679724395 698852658 712776840 720895827 724459350 725150645 723667145 719899356
1388.9 719899356 714431226 706544936 695011914 681110919 665934622 651866615 640831053 632322907
1405.3 632322907 626833618 622977316 616918564 605927587 591248631 577834666 576272368 593116105
1421.6 593116105 623158157 656940341 685565889 709602475 728345394 739875019 745822012
1435.9 745822012 746696115 743350685 736380577 725515723 709725797 685459912 651940286 613768101
1452.2 613768101 582148314 566771150 559878349 554627836 568032622 614895821 674078166 710140407
$$ packed form
1338H07851791j768529r46939o13749r18269j549959k047122k400994k878905l700733
1356.3G91026592m924893p409573j2711405j9362867k5676012l0056775k2828460l263771
1372.6F64792836J4931559J9128263J3924182Q118987L563523O91295j483500l767789
1388.9G19899356n468130p886290j1533022j3900995j5176297j4068007j1035562q508146
1405.3F32322907n489289l856302o058752j0990977j4678956j3413965j562298J6843737
1421.6E93116105L0042052L3782184K8625548K4036586J8742919J1529625N946993
1435.9G45822012Q74103l345430o970108j0864854j5789926k4265885l3519626l8172185
1452.2F13768101l1619787j5377164o892801n250513J3404786M6863199N9182345L6062241
$$ plain form
1468.5 710140407 726647556 734095693 735472023 732124865 724533856 712169409 694602847 672106624
1484.8 672106624 641884863 598763943 547119856 502126813 462789387 434382588 445708454
1499.1 445708454 496351063 560270011 631039977 709157467 751767755 766077280 772767305
1513.4 772767305 774880767 773370922 769661605 764187813 759342372 757364988 758153677 761097968
1529.7 761097968 765188396 769409716 771953523 772179186 769119978 763699591 758639395 753141165
1546 753141165 746499002 737836719 727918327 717644751 707358241 691499829 669070959 653479576
1562.3 653479576 637046695 615489781 585782290 544361234 504914641 470440477 444796324
1576.6 444796324 449718684 481852770 528301954 573873222 606834173 625419140 632425249 630251825
$$ packed form
1468.5G10140407J6507149P448137J376330l347158p591009j2364447j7566562k2496223
1484.8F72106624l0221761m3120920n1644087m4993043l9337426k8406799J1325866
1499.1D45708454N0642609O3918948P0769966P8117490M2610288J4309525O690025
1513.4G72767305K113462j509845l709317n473792m845441j977384P88689K944291
1529.7G61097968M090428M221320K543807K25663l059208n420387n060196n498230
1546G53141165o642163q662283r918392j0273576j0286510j5858412k2428870j5591383
1562.3F53479576j6432881k1556914k9707491m1421056l9446593l4474164k5644153
1576.6D44796324M922360L2134086M6449184M5571268L2960951J8584967P006109k173424
$$ plain form
1592.9 630251825 621308208 608739376 594115853 576495647 555558980 533557415 514568686
1607.2 514568686 503161132 501260042 505668819 513034046 521227956 525601625 522757292 506997705
1623.5 506997705 475277960 427005827 367409825 313661516 272044033 259242147 308261007
1637.8 308261007 398132652 494641662 573805690 638136685 688700914 715929091 736564219
1652 736564219 760683715 773348987 779420376 783820927 786401987 787464082 788106382 788957059 789978206
1670.4 789978206 790956080 791189194 791090965 792717218 797229886 804744780 814217269 819756150 821360409
1688.8 821360409 821594596 821381569 820980012 820406377 820323050 820853055 821849465 822573125 822641253 822377563
1709.2 822377563 822175324 822068274 821838677 821465611 821591735 822597980 824048340 825700700 827394843
$$ packed form
1592.9F30251825q943617j2568832j4623523j7620206k0936667k2001565j8988729
1607.2E14568686j1407554j901090M408777P365227Q193910M373669k844333j5759587
1623.5E06997705l1719745m8272133n9596002n3748309m1617483j2801886M9018860
1637.8C08261007Q9871645R6509010P9164028O4330995N0564229K7228177K0635128
1652G36564219K4119496J2665272O071389M400551K581060J062095O42300Q50677J021147
1670.4G89978206R77874K33114r8229J626253M512668P514894R472489N538881J604259
1688.8H21360409K34187k13027m01557n73635q3327N30005R96410P23660O8128k63690
1709.2H22377563k02239j07050k29597l73066J26124J006245J450360J652360J694143
$$ plain form
1727.5 827394843 829046309 830309451 831008911 831654966 832471669 833088458 833305061 833446026 833616555
1745.9 833616555 833576977 832894266 831969798 831474483 831063569 830367744 829531550 828705370 828116059 827614963
1766.3 827614963 826926708 826203883 825280905 824209094 823171377 822094917 820990264 819774568 818173528
1784.6 818173528 816309214 814583063 812443912 809480131 807013690 805850089 805789769 806616127 807991207
1803 807991207 809703767 811602175 813251734 814279556 814831734 815254390 815484226 815368652 815068364
1821.3 815068364 814768732 814392686 813794911 812937260 812406838 812638640 813039541 813175440 813306808 813646615
1841.7 813646615 813828170 813618422 813336432 813175380 813080132 812870324 812579334 812411249 812340438 812053382
1862.1 812053382 811458945 810691297 809596479 807998121 806174338 804781258 804715931 805960655 807380378
$$ packed form
1727.5H27394843J651466J263142O99460O46055Q16703O16789K16603J40965J70529
1745.9H33616555l9578o82711r24468m95315m10914o95825q36194q26180n89311n01096
1766.3H27614963o88255p22825r22978j071811j037717j076460j104653j215696j601040
1784.6H18173528j864314j726151k139151k963781k466441j163601o0320Q26358J375080
1803H07991207J712560J898408J649559J027822N52178M22656K29836j15574l00288
1821.3H15068364k99632l76046n97775q57651n30422K31802M00901J35899J31368L39807
1841.7H13646615J81555k09748k81990j61052r5248k09808k90990j68085p0811k87056
1862.1H12053382n94437p67648j094818j598358j823783j393080o5327J244724J419723
$$ plain form
1880.5 807380378 808247030 808593988 808491409 807770908 806653976 805805981 805237830 804409027 802918792
1898.8 802918792 800829828 798707068 797119558 796077371 795476437 795607865 796564519 797898054 799230814
1917.2 799230814 800489068 801460564 801693916 800997972 799663603 797996283 796033084 793612599 790883660
1935.5 790883660 788358331 786349177 785169780 785831213 788669884 792292535 795161188 796822429
1951.9 796822429 797641098 798090756 798286915 798095167 797609448 797092617 796534657 795772433 794937968 794330597
1972.3 794330597 794030786 793771327 793342531 792933822 792758107 792624831 792247772 791735232 791318119 790908992
1992.6 790908992 790326118 789645433 789125443 788875043 788651466 788295269 788060665 788147032 788291514 788212419
2013 788212419 788050890 788017392 787996531 787751496 787374735 787156284 787040532 786681473 786027551 785419226
$$ packed form
1880.5H07380378Q66652L46958j02579p20501j116932q47995n68151q28803j490235
1898.8H02918792k088964k122760j587510j042187o00934J31428R56654J333535J332760
1917.2G99230814J258254R71496K33352o95944j334369j667320j963199k420485k728939
1935.5G90883660k525329k009154j179397O61433K838671L622651K868653J661241
1951.9G96822429Q18669M49658J96159j91748m85719n16831n57960p62224q34465o07371
1972.3G94330597k99811k59459m28796m08709j75715j33276l77059n12540m17113m09127
1992.6G90908992n82874o80685n19990k50400k23577l56197k34604Q6367J44482p9095
2013G88212419j61529l3498k0861k45035l76761k18451j15752l59059o53922o08325
$$ plain form
2033.4 785419226 785056174 784717500 784194410 783666074 783322215 782935441 782208323 781300485 780512869 779787838
2053.8 779787838 778992772 778373480 778311491 778730035 779134691 779249668 779274642 779371023 779303968 778871655
2074.2 778871655 778325796 777989984 777722716 777164578 776327670 775512218 774767876 773947358 773200154 772937596
2094.6 772937596 773222744 773584008 773642302 773542941 773514211 773400545 772982478 772433996 772068620 771825790
2115 771825790 771415293 770833075 770353675 770065904 769748211 769285321 768914878 768809557 768722832 768389225
2135.4 768389225 767938316 767627656 767391920 766988456 766459227 766081214 765906632 765682757 765277088 764866948
2155.8 764866948 764573157 764205098 763570368 762839615 762298584 761874497 761339366 760797560 760546505 760610342
2176.2 760610342 760760486 760925829 761203051 761491835 761501968 761177063 760825038 760679483 760579944 760295033
$$ packed form
2033.4G85419226l63052l38674n23090n28336l43859l86774p27118r07838p87616p25031
2053.8G79787838p95066o19292o1989M18544M04656J14977K4974R6381o7055m32313
2074.2G78871655n45859l35812k67268n58138q36908q15452p44342q20518p47204k62558
2094.6G72937596K85148L61264N8294r9361k8730j13666m18067n48482l65376k42830
2115G71825790m10497n82218m79400k87771l17693m62890l70443j05321q6725l33607
2135.4G68389225m50909l10660k35736m03464n29229l78013j74582k23875m05669m10140
2155.8G64866948k93791l68059o34730p30753n41031m24087n35131n41806k51055O3837
2176.2G60610342J50144J65343K77222K88784J0133l24905l52025j45555r9539k84911
$$ plain form
2196.6 760295033 759910882 759659290 759518981 759278595 758922338 758628726 758389950 757970929 757329643 756706417
2217 756706417 756199121 755626440 754897714 754189610 753624558 752997994 752081573 751010537 750101149 749437571
2237.4 749437571 748903394 748512328 748360038 748319805 748101413 747616827 747072756 746685684 746433675 746137261
2257.8 746137261 745752692 745368361 744965255 744490147 744025409 743676066 743392229 743006945 742533565 742179275
2278.2 742179275 741998851 741872251 741751850 741684675 741659403 741574645 741290987 740716457 739920557 739066720
2298.6 739066720 738268971 737590909 737000167 736376107 735642672 734786868 733865619 732983649 732125461 731133521
2319 731133521 729991078 728940248 728105247 727251530 726170301 724952996 723744094 722513139 721257985
2337.3 721257985 720231533 719762087 719837666 720173895 720601022 720779896 720271289 719046414 717609584
$$ packed form
2196.6G60295033l84151k51592j40309k40386l56257k93612k38776m19021o41286o23226
2217G56706417n07296n72681p28726p08104n65052o26564r16421j071036r09388o63578
2237.4G49437571n34177l91066j52290m0233k18392m84586n44071l87072k52009k96414
2257.8G46137261l84569l84331m03106m75108m64738l49343k83837l85284m73380l54290
2278.2G42179275j80424j26600j20401o7175k5272q4758k83658n74530p95900q53837
2298.6G39066720p97749o78062n90742o24060p33435q55804r21249q81970q58188r91940
2319G31133521j142443j050830q35001q53717j081229j217305j208902j230955j255154
2337.3G21257985j026452m69446P5579L36229M27127J78874n08607j224875j436830
$$ plain form
2355.7 717609584 716433346 715763986 715537906 715411007 715310335 715412498 715599298 715621591 715461791 715275705
2376.1 715275705 715097189 714805186 714364052 713875234 713343263 712574840 711446941 710176528 709161222
2394.4 709161222 708555639 708189785 707869589 707526386 707054734 706352353 705592573 705115855 704999864 704986691
2414.8 704986691 704904974 704868674 704945683 704929769 704633355 704190195 703835905 703546047 703134000 702618837
2435.2 702618837 702189505 701830029 701339245 700689971 700057566 699535251 698991239 698303282 697605848 697053432
2455.6 697053432 696543753 695890367 695087135 694244742 693389595 692507207 691696823 691122055 690784812 690517366
2476 690517366 690214694 689850092 689330637 688514173 687401533 686192334 685086429 684153736 683390558
2494.4 683390558 682843983 682541788 682325482 681971431 681412280 680759370 680109322 679407001 678631663 677945793
$$ packed form
2355.7G17609584j176238o69360k26080j26899j00672J02163J86800K2293j59800j86086
2376.1G15275705j78516k92003m41134m88818n31971p68423j127899j270413j015306
2394.4G09161222o05583l65854l20196l43203m71652p02381p59780m76718j15991j3173
2414.8G04986691q1717l6300P7009j5914k96414m43160l54290k89858m12047n15163
2435.2G02618837m29332l59476m90784o49274o32405n22315n44012o87957o97434n52416
2455.6F97053432n09679o53386q03232q42393q55147q82388q10384n74768l37243k67446
2476F90517366l02672l64602n19455q16464j112640j209199j105905r32693p63178
2494.4F83390558n46575l02195k16306l54051n59151o52910o50048p02321p75338o85870
$$ plain form
2514.8 677945793 677496672 677246153 677047372 676809132 676509380 676033854 675292552 674447298 673744857 673279166
2535.2 673279166 672984481 672764301 672576606 672311962 671726465 670709133 669438362 668175817 667176545
2553.5 667176545 666722298 666902781 667441845 667937398 668184638 668242395 668238699 668156981 667873144 667393684
2573.9 667393684 666938663 666674614 666525126 666371584 666263223 666273117 666305125 666272104 666330457 666723847
2594.3 666723847 667485833 668380260 669116497 669551849 669649124 669437647 669061482 668730855 668592095 668628812
2614.7 668628812 668730676 668829978 668858826 668647587 668030679 666966915 665472686 663663864 662000358
2633.1 662000358 661206365 661658525 662992716 664532423 665905476 667048514 667889833 668344319 668476403
2651.4 668476403 668457329 668437898 668500066 668685615 669095397 669886172 671086550 672533631 674060822 675639629
$$ packed form
2514.8F77945793m49121k50519j98781k38240k99752m75526p41302q45254p02441m65691
2535.2F73279166k94685k20180j87695k64644n85497j017332j270771j262545r99272
2553.5F67176545m54247J80483N39064M95553K47240N7757l696q1718k83837m79460
2573.9F67393684m55021k64049j49488j53542j08361R894L2008l3021N8353L93390
2594.3F66723847P61986Q94427P36237M35352R7275k11477l76165l30627j38760L6717
2614.7F68628812J01864R9302K8848k11239o16908j063764j494229j808822j663506
2633.1F62000358p93993M52160J334191J539707J373053J143038Q41319M54486J32084
2651.4F68476403j9074j9431O2168J85549M09782P90775J200378J447081J527191J578807
$$ plain form
2671.8 675639629 677251101 678788006 680183828 681401134 682368159 683081567 683615148 684053004 684446156
2690.2 684446156 684754610 684858859 684627175 683941066 682701290 680907845 678749919 676541686 674570680
2708.5 674570680 672994673 671850920 671110809 670663953 670395970 670285285 670320094 670468032 670680821
2726.9 670680821 670917034 671166480 671344280 671333551 671118438 670842826 670795739 671208382 672074854 673190475
2747.3 673190475 674350798 675487638 676586807 677622318 678610444 679600418 680606842 681657612 682812452
2765.6 682812452 684092462 685425818 686637342 687505186 687723219 687034726 685532749 683628321 681793511
2784 681793511 680387616 679504931 678956270 678591073 678461134 678595424 678875446 679215252 679695010 680323303
2804.4 680323303 680981576 681659043 682372510 683046639 683643758 684171379 684573174 684727073 684516966 683911979
$$ packed form
2671.8F75639629J611472J536905J395822J217306R67025P13408N33581M37856L93152
2690.2F84446156L08454J04249k31684o86109j239776j793445k157926k208233j971006
2708.5F74570680j576007j143753p40111m46856k67983j10685L4809J47938K12789
2726.9F70680821K36213K49446J77800j0729k15113k75612m7087M12643Q66472J115621
2747.3F73190475J160323J136840J099169J035511R88126R89974J006424J050770J154840
2765.6F82812452J280010J333356J211524Q67844K18033o88493j501977j904428j834810
2784F81793511j405895q82685n48661l65197j29939J34290K80022L39806M79758O28293
2804.4F80323303O58273O77467P13467O74129N97119N27621M01795J53899k10107o04987
$$ plain form
2824.8 683911979 682995796 681842089 680472016 679004788 677648187 676495910 675386906 674092889
2841.1 674092889 672613084 671071470 669465721 667696536 665737569 663578510 661044955 657931089
2857.4 657931089 654256999 650301278 646567941 643678963 642164171 642372370 644319654 647449315
2873.7 647449315 650987148 654484332 657596648 659862399 660970747 660756409 659000516 655441999
2890.1 655441999 649845243 642143965 632931948 624549210 621236742 625969231 636673033 647513568
2906.4 647513568 654121101 656135798 655418098 653773129 652320027 651559949 651237369 650477946 648491859
2924.7 648491859 645409703 642589450 641963720 644851923 650990486 658628941 665755987 671184242
2941 671184242 674566269 675968707 675731242 674405932 672599256 670903444 670183241 671445370 674918056
$$ packed form
2824.8F83911979r16183j153707j370073j467228j356601j152277j109004j294017
2841.1F74092889j479805j541614j605749j769185j958967k159059k533555l113866
2857.4F57931089l674090l955721l733337k888978j514792K08199J947284L129661
2873.7F47449315L537833L497184L112316K265751J108348k14338j755893l558517
2890.1F55441999n596756p701278r212017q382738l312468M732489J0703802J0840535
2906.4F47513568O607533K014697p17700j644969j453102p60078l22580p59423j986087
2924.7F48491859l082156k820253o25730K888203O138563P638455P127046N428255
2941F71184242L382027J402438k37465j325310j806676j695812p20203J262129L472686
$$ plain form
2959.4 674918056 679763675 684751451 688963950 691989422 693750143 694408715 694190085 693189859 691501439
2977.8 691501439 689279020 686750770 684352279 682542622 681494772 681014180 680677891 680104554 679100394
2996.1 679100394 677691340 675972223 673988819 671898663 670024991 668914199 669418275 672103047
3012.4 672103047 676467657 681228518 685304224 688324630 690454245 691885293 692681968 692987084 692820787
3030.8 692820787 692022204 690504491 688353837 685861886 683128953 679983079 676449537 672999024
3047.1 672999024 670489490 669608355 670443058 672340751 673926055 674622476 676078558 680211246 686320722
3065.5 686320722 691880822 695542812 697788000 699454129 700968742 702417791 703733623 704926312
3081.8 704926312 706013143 706872284 707488775 707974792 708309412 708504081 708724380 709070385 709413171
$$ packed form
2959.4F74918056M845619M987776M212499L025472J760721O58572k18630j000226j688420
2977.8F91501439k222419k528250k398491j809657j047850m80592l36289n73337j004160
2996.1F79100394j409054j719117j983404k090156j873672j110792N04076K684772
3012.4F72103047M364610M760861M075706L020406K129615J431048P96675L05116j66297
3030.8F92820787p98583j517713k150654k491951k732933l145874l533542l450513
3047.1F72999024k509534q81135Q34703J897693J585304O96421J456082M132688O109476
3065.5F86320722N560100L661990K245188J666129J514613J449049J315832J192689
3081.8G04926312J086831Q59141O16491M86017L34620J94669K20299L46005L42786
$$ plain form
3100.1 709413171 709565163 709598064 709727347 709949732 710072517 710137486 710348904 710608304 710664332 710441411
3120.5 710441411 710077822 709803700 709661365 709543705 709412754 709284723 709186852 709108591 708998978 708835006
3140.9 708835006 708618701 708313465 707900226 707441926 706981719 706528068 706082702 705648720 705262244 704934955
3161.3 704934955 704644680 704414666 704279363 704166710 703955650 703662932 703409672 703199983 702921271 702535152
3181.7 702535152 702112257 701709509 701268911 700731754 700189412 699684501 699101925 698402107 697693110 697051644
3202.1 697051644 696448505 695864916 695319414 694790781 694224477 693614066 692995369 692385435 691776633 691092014
3222.5 691092014 690293372 689475894 688721478 687990367 687176168 686236382 685235083 684208274 683100581
3240.9 683100581 681875885 680551350 679128170 677602947 676198840 675399065 675480723 676187932 676975191
$$ packed form
3100.1G09413171J51992L2901J29283K22385J22785O4969K11418K59400N6028k22921
3120.5G10441411l63589k74122j42335j17660j30951j28031r7871p8261j09613j63972
3140.9G08835006k16305l05236m13239m58300m60207m53651m45366m33982l86476l27289
3161.3G04934955k90275k30014j35303j12653k11060k92718k53260k09689k78712l86119
3181.7G02535152m22895m02748m40598n37157n42342n04911n82576o99818p08997o41466
3202.1F97051644o03139n83589n45502n28633n66304o10411o18697o09934o08802o84619
3222.5F91092014p98642q17478p54416p31111q14199r39786j001299j026809j107693
3240.9F83100581j224696j324535j423180j525223j404107p99775Q1658P07209P87259
$$ plain form
3259.2 676975191 677473128 677636683 677529693 677171230 676647723 676145315 675711811 675222874 674618125 673913956
3279.6 673913956 673119724 672253191 671339273 670462668 669684470 668912768 668053746 667087376 665993214
3298 665993214 664861441 663900137 663159192 662328482 661088049 659515798 657895446 656406760 654993474
3316.3 654993474 653534830 652043700 650604606 649197102 647597969 645760298 643872559 642004132
3332.6 642004132 640231550 638589263 636807024 634706974 632432401 630107701 627897024 625939846
3348.9 625939846 623908579 621465206 618852913 616430640 614161313 611771882 609260261 606924474
3365.3 606924474 604756355 602366149 599563956 596708477 594215333 591986716 589784682 587559938
3381.6 587559938 585375726 583396554 581781983 580496132 579134941 577361703 575510681 574124455
$$ packed form
3259.2F76975191M97937J63555j06990l58463n23507n02408m33504m88937o04749p04169
3279.6F73913956p94232q66533r13918q76605p78198p71702q59022r66370j094162
3298F65993214j131773r61304p40945q30710j240433j572251j620352j488686j413286
3316.3F54993474j458644j491130j439094j407504j599133j837671j887739j868427
3332.6F42004132j772582j642287j782239k100050k274573k324700k210677j957178
3348.9F25939846k031267k443373k612293k422273k269327k389431k511621k335787
3365.3F06924474k168119k390206k802193k855479k493144k228617k202034k224744
3381.6E87559938k184212j979172j614571j285851j361191j773238j851022j386226
$$ plain form
3397.9 574124455 573064208 571655869 569814324 568169653 566968858 565926194 564858973 563698351
3414.2 563698351 562505186 561528981 560742676 559959710 559296668 558915257 558730245 558552265 558424234
3432.6 558424234 558419943 558295310 557903171 557521164 557472169 557785869 558246076 558668435 559095919 559591532
3453 559591532 560191333 561004341 562001467 562876523 563648701 564746916 566049933 566935301 567298174 567707658
3473.4 567707658 568517029 569631577 570748925 571559906 572308183 573327661 574370563 575276554 576263905
3491.7 576263905 577401221 578571856 579671562 580776334 581914961 582821846 583509684 584353924 585535169
3510.1 585535169 586923540 588208735 589300275 590450168 591805756 593298376 594627202 595593154
3526.4 595593154 596519828 597691834 599091172 600704014 602295339 603636324 605056226 606740415
$$ packed form
3397.9E74124455j060247j408339j841545j644671j200795j042664j067221j160622
3414.2E63698351j193165r76205p86305p82966o63042l81411j85012j77980j28031
3432.6E58424234m291j24633l92139l82007m8995L13700M60207M22359M27484M95613
3453E59591532N99801Q13008R97126Q75056P72178J098215J303017Q85368L62873M09484
3473.4E67707658Q09371J114548J117348Q10981P48277J019478J042902R05991R87351
3491.7E76263905J137316J170635J099706J104772J138627R06885O87838Q44240J181245
3510.1E85535169J388371J285195J091540J149893J355588J492620J328826R65952
3526.4E95593154R26674J172006J399338J612842J591325J340985J419902J684189
$$ plain form
3542.7 606740415 608321786 609513462 610596478 611857951 613165975 614479184 615938067 617531061
3559 617531061 619156241 620678008 621948421 623197794 624853015 626668096 628309608 629909456 631712914
3577.4 631712914 633794963 636026561 638150275 639981031 641588390 643375695 645345867 647223830
3593.7 647223830 649048090 650941133 652778089 654553890 656395793 658079386 659471154 660920084
3610 660920084 662570775 664251626 665742815 666999280 668412507 670019090 671512306 672654212 673349440
3628.4 673349440 674284697 675634623 676928997 678004920 678910732 679833055 680832505 681762576 682332993
3646.7 682332993 682479024 682830155 683529615 684063733 684534431 685244799 685720205 685786009 685948610 686181784
3667.1 686181784 685958862 685741723 685805857 685307443 684915125 685292125 685851276 686488271 687186897 687565565
$$ packed form
3542.7F06740415J581371J191676J083016J261473J308024J313209J458883J592994
3559F17531061J625180J521767J270413J249373J655221J815081J641512J599848J803458
3577.4F31712914K082049K231598K123714J830756J607359J787305J970172J877963
3593.7F47223830J824260J893043J836956J775801J841903J683593J391768J448930
3610F60920084J650691J680851J491189J256465J413227J606583J493216J141906O95228
3628.4F73349440R35257J349926J294374J075923R05812R22323R99450R30071N70417
3646.7F82332993J46031L51131O99460N34118M70698P10368M75406O5804J62601K33174
3667.1F86181784k22922k17139O4134m98414l92318L77000N59151O36995O98626L78668
$$ plain form
3687.5 687565565 687314510 687095523 687386036 687778234 687971354 687912822 687681019 687719464 688094020 688260317
3707.9 688260317 687831223 687248707 687339485 687729597 687852204 687704265 687458158 687180936 687006474 687161922
3728.3 687161922 687458634 687505007 687152445 686813891 687011540 687339008 686896265 685849607 685765028 685892224
3748.7 685892224 685176432 684909463 685475886 685815871 685611546 685495496 685679615 685684085 685412109 684979439
3769.1 684979439 684660733 684693635 684785724 684694469 684379816 684026361 683743119 683460891 683295131 683203042
3789.5 683203042 683064342 682885945 682651520 682510734 682184935 681480944 681337297 681456029 681278706 681358099
3809.9 681358099 681682706 681732774 681427300 681274056 680889428 680275142 680302024 680480182 680454433 680374861
3830.3 680374861 680318654 680309355 679946005 679226220 678962052 679093540 679288507 679648221 680030704 679864943
$$ packed form
3687.5F87565565k51055k18987K90513L92198J93120n8532k31803L8445L74556J66297
3707.9F88260317m29094n82516R0778L90112J22607j47939k46107k77222j74462J55448
3728.3F87161922K96712M6373l52562l38554J97649L27468m42743j046658q4579J27196
3748.7F85892224p15792k66969N66423L39985k04325j16050J84119M470k71976m32670
3769.1F84979439l18706L2902R2089r1255l14653l53455k83242k82228j65760r2089
3789.5F83203042j38700j78397k34425j40786l25799p03991j43647J18732j77323P9393
3809.9F81358099L24607N0068l05474j53244l84628o14286K6882J78158k5749p9572
3830.3F80374861n6207r299l63350p19785k64168J31488J94967L59714L82483j65761
$$ plain form
3850.7 679864943 678392529 677039146 677440107 678211689 678482056 678178906 677835107 677789032 677454531
3869 677454531 676833510 676563442 676676452 676910400 676752329 676418304 676415682 676253617 676003933 675845265
3889.4 675845265 675448060 675248682 675414562 675290823 674736083 674154222 673622429 673244298 673173666 673207641
3909.8 673207641 673210263 673099518 672723353 672256887 672031164 671884835 671528220 671209276 671162724 671017230
3930.2 671017230 670573056 670205534 670016050 669798136 669519842 669237554 669156969 669313312 669456840 669586718
3950.6 669586718 669863701 670224786 670531511 670781314 670963705 671028197 670979083 670851052 670728862 670673907
3971 670673907 670605600 670457244 670316339 670263469 670265257 670202196 670013070 669795096 669623673 669471622 669328094
3993.4 669328094 669219673 669152856
$$ packed form
3850.7F79864943j472414j353383M00961P71582K70367l03150l43799m6075l34501
3869F77454531o21021k70068J13010K33948j58071l34025k622j62065k49684j58668
3889.4F75845265l97205j99378J65880j23739n54740n81861n31793l78131p0632L3975
3909.8F73207641K622j10745l76165m66466k25723j46329l56615l18944m6552j45494
3930.2F71017230m44174l67522j89484k17914k78294k82288q0585J56343J43528J29878
3950.6F69586718K76983L61085L06725K49803J82391O4492m9114j28031j22190n4955
3971F70673907o8307j48356j40905n2870J788o3061j89126k17974j71423j52051j43528
3993.4F69328094j08421o6817
$$ plain form
3997.5 669152856
$$ packed form
3997.5F69152856
##END=$$ End of the data block
