##TITLE=G5-2 $$ Begin of the data block
##JCAMP-DX=5.00 $$ ACD/SpecManager v 10.08
##SPECTROMETER/DATA SYSTEM=Alpha
##DATE=13 May 2014 09:34:16
##DATA TYPE=INFRARED SPECTRUM
##DATA CLASS=XYDATA
##ORIGIN=
##OWNER=
##NPOINTS=1765
##FIRSTX=399.75695801
##LASTX=3997.56933594
##MAXX=3997.56933594
##MINX=399.75695801
##MAXY=0.84088778
##MINY=0.29828447
##XFACTOR=1.0000000000
##YFACTOR=1.000000000000000e-9
##FIRSTY=0.76387620
##DELTAX=2.03957629
##XUNITS=1/CM
##YUNITS=ARBITRARY UNITS
##XYDATA=(X++(Y..Y))
399.8G63876200j673639m206181m777610o77228M582107N971313L625273J164973j78993
418.1G67706215j010835j614749j521468j205683j864493k714336k644241k441466
434.4G52688944k917409l256082k990127k606451l047288m128635m673600n344033
450.7G23725319p831037j1735082j6773343k1737814k3193240k1000981k0996333k3792326
467.1E76665163p424772K7417720M3312609L1157017J5873968O044865j785517r069204
483.4F82191849j2079895l993094R420276J4486611R670079L187537l91603j152873
499.7G01338887r95576j441539j966536j427233n73396q08120j513541j119375O1691
518.1F91555262J85668p91013r38833P70927M186272Q824289J1233151P346272q8214
$$ plain form
399.8 763876200 762202561 757996380 753218770 752541542 757123649 763094962 766720235 767885208 767706215
418.1 767706215 766695380 765080631 763559163 762353480 760488987 757774651 755130410 752688944
434.4 752688944 749771535 746515453 743525326 740918875 737871587 733742952 729069352 723725319
450.7 723725319 715894282 704159200 687385857 665648043 642454803 621453822 600457489 576665163
467.1 576665163 569240391 596658111 639970720 671127737 687001705 693046570 691261053 682191849
483.4 682191849 670111954 666118860 675539136 690025747 699695826 702883363 702491760 701338887
499.7 701338887 700343311 698901772 696935236 695508003 694934607 694126487 692612946 691493571 691555262
518.1 691555262 691740930 690949917 690011084 690782011 694968283 703792572 715025723 722371995 722283781
536.4G22283781n219460o201267n167484n203665o662190n553841O57797P599949R915948
554.8G06449568O461919O25789k729893l637910l522396k253354j203775j580477k167165
573.1F96442306j580477j082062k310634m585683p182479j1385978j3775050o285191
589.4F48254752N960405P927299J447379K51413O557524J2426436J2356281Q597195
605.8G03778684N585849M145801K210498q92341l864825p122337j3322473k2578299
622.1F67940557k7085960j9914210j2483895j8763303k1584750Q36611K9028476K9718458
638.4F27691984P682979m255473M085183J5703261K4554193L0445218K7725637J9656777
654.7G53289759J2296140Q303225P132888O080687L819943K574801M839838N154490
$$ plain form
536.4 722283781 717064321 710863054 705695570 700491905 693829715 688275874 688933671 696533620 706449568
554.8 706449568 712911487 713537276 710807383 707169473 703647077 701393723 700189948 698609471 696442306
573.1 696442306 694861829 693779767 691469133 686883450 679700971 668314993 654539943 648254752
589.4 648254752 654215157 662142456 663589835 663841248 670398772 682825208 695181489 703778684
605.8 703778684 709364533 713510334 715720832 714828491 710963666 703841329 690518856 667940557
622.1 667940557 640854597 620940387 608456492 589693189 568108439 568945050 597973526 627691984
638.4 627691984 635374963 631119490 635204673 650907934 675462127 705907345 733632982 753289759
654.7 753289759 765585899 773889124 781022012 787102699 790922642 793497443 798337281 803491771
671H03491771K688050J476646K069056K302051J075089K85863J008273J420557K89500
689.4H16106856o43313O0022Q79109J08003r02414m66585K83480l52979j322091q12828
709.8H12937260K21252k08676j537859j647711o47008o33598j823902k068639j168251
728.1H03422868j383126l031969l919303l373325l530562n449652p894218j0513962
744.4G64326751j1471271o704867j27554j311183q931995j5027105j8167973k1233201
760.8F81351602k7317703l6126792m3137729m5275867l4998238l227413L6334157O1818838
777.1E89420855O7196250N2746177K8471350J0301471J185954o397307j7401278k7063370
793.4F98460102k5266349j7796636k0688832j6278803K1359801O2153459O4478278
$$ plain form
671 803491771 806179821 807656467 809725523 812027574 813102663 813388526 814396799 815817356 816106856
689.4 816106856 815463543 815523565 816402674 816510677 815608263 815141678 815425158 815072179 813750088 812937260
709.8 812937260 813158512 812949836 811411977 809764266 809117258 808483660 806659758 804591119 803422868
728.1 803422868 802039742 799007773 795088470 791715145 788184583 782734931 774840713 764326751
744.4 764326751 752855480 746150613 746023059 744711876 735779881 720752776 702584803 681351602
760.8 681351602 654033899 617907107 574769378 529493511 494495273 491267860 527602017 589420855
777.1 589420855 656617105 709363282 737834632 748136103 749322057 742924750 725523472 698460102
793.4 698460102 673193753 655397117 634708285 618429482 639789283 701942742 766421020
807.7G66421020M0491045K0116269R716749L849984K92718m64261J10865k92540j410603
826H38831246j364350n26429p52091j888812k056360j089513r97007k140284k598285
844.4H25418115j657009j325787k546012l648341l626823m274905p801235j3903379
860.7G86634624j5009701o467164p13646o69897N750299J4144063J3061583N253553
877H01983714l21865k058923l826797o280244p764756q359552j0290742j5077054k2307992
895.4G25695789l0996680l7547291k6196062J2889206M8816562M9980581L1010747
909.6G73652852J6471266J0404647Q155048N936801K879143N42581l22580n81682q89957
928H16248119r65297r77695j621664k620339k916694k588093l274143m765511l842115
$$ plain form
807.7 766421020 806912065 827028334 836745083 840595067 840887785 840423524 840534389 840241849 838831246
826 838831246 837466896 836940467 836188376 834299564 832243204 831153691 830156684 828016400 825418115
844.4 825418115 823761106 822435319 819889307 816240966 812614143 808339238 800538003 786634624
860.7 786634624 771624923 765157759 764444113 763774216 769524515 783668578 796730161 801983714
877 801983714 801661849 799602926 795776129 789495885 781731129 773371577 763080835 748003781 725695789
895.4 725695789 694699109 657151818 630955756 643844962 692661524 742642105 773652852
909.6 773652852 790124118 800528765 808683813 814620614 817499757 818042338 817719758 817138076 816248119
928 816248119 815282822 814305127 812683463 810063124 807146430 804558337 801284194 796518683 792676568
946.4G92676568j16765J534283p05898m332960q625030j2157440p033349O968022J3465404
964.7G81672835O862462j980841p964254j4291703k5333941l5785318j8689930K5385141
981G09874451M3542087K4356246O449998J304626K26319n11348j544059j794517m04298
999.4G81499505Q13842K28822r10699j248598j212001j660407k258956k419472k407610
1017.7G70424426l061474m384458o170630r181023j3761163j6302943j0398924P281363
1034.1G14445174K4194598K0576000L701568p241726j2446106j8790483k3016930j1060297
1050.4F90361798J6462683L1931937K3340166Q975029J338959j855374l786444m892469
1066.7G61876285m575729l708244m432737p257641j2001693j9262016k1442950m230439
$$ plain form
946.4 792676568 792559803 794094086 793388188 789055228 780430198 768272758 761239409 768207431 781672835
964.7 781672835 788535297 786554456 778590202 764298499 738964558 703179240 684489310 709874451
981 709874451 753416538 777772784 784222782 785527408 785753727 785242379 783698320 781903803 781499505
999.4 781499505 782313347 782542169 781631470 780382872 779170871 777510464 775251508 772832036 770424426
1017.7 770424426 767362952 762978494 756807864 747626841 733865678 717562735 707163811 714445174
1034.1 714445174 738639772 759215772 762917340 755675614 743229508 724439025 701422095 690361798
1050.4 690361798 706824481 738756418 762096584 771071613 772410572 770555198 766768754 761876285
1066.7 761876285 757300556 753592312 749159575 741901934 729900241 710638225 689195275 684964836
1083F84964836K2407770K9553115J7303586O193042J837790J38342j294076k662182
1099.3G58442223l412604l086508j697659l12507j32025j089036k443254l934860n388260
1117.7G36945510p193148j0443330j6282499k3430765k2953212l491700K5012017L4724951
1134G12887824K1313309M621089n447686j2553692k1566748l3828080l8959205k3561895
1150.3F02904916O991148L8006663N2905440M1676999K0269870O810606J165569j312793
1166.6G69418418k336323k461493k497733k893686l352344l474474l657520m373550
1182.9G44371295n368531o308198p681966j0496854j5377581k1647931k5730431k3051738
1199.3F28708065j1814177M798650J7457545J8865943J1653245K708435j789749J230717
$$ plain form
1083 684964836 707372606 736925721 754229307 760422349 762260139 762398481 761104405 758442223
1099.3 758442223 755029619 751943111 750245452 749932945 749800920 748711884 746268630 742333770 736945510
1117.7 736945510 729752362 719309032 703026533 679595768 656642556 653150856 678162873 712887824
1134 712887824 734201133 738822222 733374536 720820844 699254096 665426016 626466811 602904916
1150.3 602904916 609896064 647902727 700808167 742485166 762755036 769565642 770731211 769418418
1166.6 769418418 767082095 764620602 762122869 759229183 755876839 752402365 748744845 744371295
1182.9 744371295 739002764 732694566 725012600 714515746 699138165 677490234 651759803 628708065
1199.3 628708065 616893888 621692538 639150083 658016026 669669271 672377706 670587957 671818674
1215.6F71818674R948313J8366039J9711256J3320505M402995k390921n584717n200624
1231.9G24391520k319455J188874L658056L855110J668512j548051m463852p450640
1248.2G18980074j1235774j0835051p08521P730842L914118j678109k820671m576802
1264.5F98770106p404387r728611j1827111j4192820j7243146k1194816k6263237l1771302
1280.8E59144676l4595490l1498015k4263441j8541992j2674808M021465L0295760
1295.1D71888155M9602836N5274963N3958297M8855782L9730131K9532075K0904184
1309.4G69746423J3421774O015122j512349r173214j8290103k9317796l3065021j9746304
1325.7F78078532l692388n165279j4145375k830386K8664708M5783699L1685829N441010
$$ plain form
1215.6 671818674 681766987 700133026 719844282 733164787 737567782 735176861 729592144 724391520
1231.9 724391520 722072065 723260939 726918995 730774105 732442617 730894566 726430714 718980074
1248.2 718980074 707744300 696909249 696200728 703931570 707845688 706167579 703346908 698770106
1264.5 698770106 691365719 681637108 669809997 655617177 638374031 617179215 590915978 559144676
1280.8 559144676 524549186 493051171 468787730 450245738 437570930 441592395 471888155
1295.1 471888155 521490991 576765954 630724251 679580033 719310164 748842239 769746423
1309.4 769746423 783168197 789183319 787670970 778497756 760207653 730889857 697824836 678078532
1325.7 678078532 674386144 669220865 655075490 652245104 680909812 726693511 758379340 763820350
1342G63820350j1025607n511761J5600681K5237620J5881479M357338j148761l030002
1358.3H04181337l853082m262686l911614l611029l908097m436136n299329o339252
1374.7G68560112p271886r872198j5503347k3909688l0495525k0170033J3638497L6444425
1391G11420357K9318214R134829o149471o861389L997207J0059476N187034j260399
1407.3G54845858m038930n504251o517231o830275p030189p303596p033050q742213
1423.6G01846123j2629211j5567720j5024841j2274325j3910174k2054851k9316128
1437.9E81068873l1664431k9537916j0164738J8202126L5449744M6056151N1705599
1452.2F61115408L9863408J5976846l964186j1288226j8849790l3782899l9487958
$$ plain form
1342 763820350 752794743 747282982 762883663 788121283 804002762 808360100 807211339 804181337
1358.3 804181337 800328255 796065569 792153955 788542926 784634829 780198693 774899364 768560112
1374.7 768560112 761288226 751416028 735912681 712002993 681507468 661337435 674975932 711420357
1391 711420357 740738571 749873400 743723929 736862540 740859747 750919223 756106257 754845858
1407.3 754845858 750806928 745302677 738785446 731955171 724924982 717621386 710588336 701846123
1423.6 701846123 689216912 673649192 658624351 646350026 632439852 610385001 581068873
1437.9 581068873 549404442 519866526 509701788 527903914 563353658 609409809 661115408
1452.2 661115408 700978816 716955662 712991476 701703250 682853460 649070561 609582603
1466.4F09582603j9311428K5711954Q0609500P6775610K8814197L918827l132761n038738
1482.8G97929764n339921n503595n289852m090190l068388l663718m295349l149987
1499.1G63528764k057671k598584m830897o570220m123211l330171m747152o378114
1515.4G28892744p459104p827938r306490j0041357j1599660j5739619j9468367k6387751
1531.7F21062458l8085223l8532674k9463053j3992369J5156090L3398271M5120239
1546E94663739N1604510M5556902K8897524J4733672O546140n28097m528761l975689
1562.3G32969940n377174p152617q551240r489119q476674r876907j3939977j3904929
1578.6F56201303j3421535j5754462j8069446k0517766k3410917k6872277l2254040
$$ plain form
1466.4 609582603 590271175 615983129 696592629 773368239 802182436 806101263 802968502 797929764
1482.8 797929764 792589843 787086248 781796396 777706206 774637818 770974100 766678751 763528764
1499.1 763528764 761471093 758872509 754041612 747471392 743348181 740018010 735270858 728892744
1515.4 728892744 721433640 713605702 704299212 694257855 682658195 666918576 647450209 621062458
1531.7 621062458 582977235 544444561 514981508 500989139 516145229 549543500 594663739
1546 594663739 646268249 691825151 720722675 735456347 742002487 741474390 736945629 732969940
1562.3 732969940 727592766 720440149 711888909 702399790 693923116 684046209 670106232 656201303
1578.6 656201303 642779768 627025306 608955860 588438094 565027177 538154900 505900860
1592.9E05900860l8144648l3504367n807549L6511302O1255008M6980381J1927188
1607.2E85118175j6893030l1751096l6820412m2767435m9680531m1886955l2950759
1621.4C32367957k6186586p896900J5587330L1412601L1279177K3456156K5729805
1635.7D25749540M1129589N1470638N1966667M4251025L8102328L0796886J7241359
1650G00708032Q705854L597677k070308m581988n76079J2448669K4558425K4570286
1666.3G67360568K1041572J7313719J0798514O314754M675925K829790O43313j315832
1682.6H29662323j533329k26260q08835j834810k221643k574563j955867k15352J773775
1701H20065439K319574J058221J38640m01616j166999j931250k561987k098143k17378
$$ plain form
1592.9 505900860 467756212 434251845 428444296 464955598 526210606 573190987 585118175
1607.2 585118175 568225145 536474049 499653637 456886202 407205671 365318716 332367957
1621.4 332367957 306181371 298284471 313871801 345284402 376563579 400019735 425749540
1635.7 425749540 466879129 518349767 570316434 614567459 652669787 683466673 700708032
1650 700708032 709413886 713011563 710941255 706359267 705783188 718231857 742790282 767360568
1666.3 767360568 788402140 805715859 816514373 822829127 827505052 830334842 830978155 829662323
1682.6 829662323 828128994 827902734 827093899 825259089 823037446 820462883 818507016 818291664 820065439
1701 820065439 822385013 823443234 823581874 823180258 822013259 820082009 817520022 815421879 815204501
1719.3H15204501M49121k04444m09722j60515j3948k37763l61383O38783P07627l6240
1739.7H15576017k1339L32773K08914k40564m54485K8908J47760n22792q75295q35180
1760.1H13344717n71847j16885l89993r99451j195848q65042n4776J00612l04401m51803
1780.5H08495283m37200n20050m88461o89864j379311j362264m75883k84732p59542
1798.9H02097976j044690r31502r25183j095891j053214n27620J52349L12448j5557
1817.2G96969116l18289n03182p16806p29561o01053m94063o8963k0921n73098p78735
1837.6G92164445o19352q25167j130938n27144K62380M49240L04759J0729k21849m55797
1858G89411306p68780r84431r67085q89778n85258J41978M37796L0875m55379p06911
$$ plain form
1719.3 815204501 815653622 815449178 815039456 814878941 814864993 814627230 814265847 814904630 815612257 815576017
1739.7 815576017 815554678 815887451 816096365 815855801 815401316 815430224 815577984 815055192 814179897 813344717
1760.1 813344717 812772870 812655985 812265992 811266541 810070693 809205651 809150875 809251487 808947086 808495283
1780.5 808495283 808058083 807538033 807049572 806359708 804980397 803618133 803142250 802857518 802097976
1798.9 802097976 801053286 800121784 799196601 798100710 797047496 796519876 796672225 796984673 796969116
1817.2 796969116 796650827 796147645 795430839 794701278 794100225 793606162 793537199 793516278 792943180 792164445
1837.6 792164445 791545093 790719926 789588988 789061844 789324224 789773464 790078223 790088952 789867103 789411306
1858 789411306 788642526 787658095 786691010 785801232 785215974 785357952 785795748 785826623 785371244 784664333
1878.4G84664333p43806o84262o66559p03930o10888j32204J75238J6987k1994K9981
1898.8G81322896j84237n61655p95364q12054p37667o70374o59823p72297r22680r10282
1919.2G74296463r41039r39965o81519n80252n20408j01983L24666K58208k10345o05762
1939.6G70298064o00755k59400j33335k64287k39373j89364k93791l61919l54946m94421
1960G67106473p50303r34541r53615p70092m90367k07603J2696o378k23816m10556
1980.4G62371898n01991o26385r52065j350581j360476n67377N67078J075864Q89421
1998.8G59545386M95672J23084j96100l50356l15428k56776k87891l64125l73661l50714
2019.2G57669091m69565o39320o48200n18918l45886j69814k3961J4842r1314k46346
$$ plain form
1878.4 784664333 783920527 783236265 782569706 781865776 781254888 781122684 781297922 781314909 781292915 781322896
1898.8 781322896 781138659 780577004 779781640 778969586 778231919 777561545 776901722 776129425 775206745 774296463
1919.2 774296463 773355424 772415459 771733940 771153688 770633280 770531297 770855963 771114171 770903826 770298064
1939.6 770298064 769697309 769437909 769304574 769040287 768800914 768611550 768317759 767955840 767600894 767106473
1960 767106473 766356170 765421629 764468014 763697922 763207555 762999952 763012648 763006270 762782454 762371898
1980.4 762371898 761869907 761243522 760291457 758940876 757580400 757013023 757580101 758655965 759545386
1998.8 759545386 760041058 760164142 759968042 759617686 759302258 759045482 758757591 758393466 758019805 757669091
2019.2 757669091 757199526 756560206 755912006 755393088 755047202 754877388 754853427 754868269 754776955 754530609
2039.6G54530609l15905k85029k18571j61886j51098k05814l05772l93033m28796m41551
2060G51623154m43101l82006k66552j98841k44260l26813l79741m51207n20945n14924
2080.3G47894764m67777m51744m27306l49402k65479k57313k98918k74181j81377j36316
2100.7G44784951j91390k46346k20716k15471l04759l53753k92480k57969l43263m54843
2121.1G41903961m73798m73559n46097n54920l80098j67013j22904k29299k60711k21551
2141.5G38474011l06189m25040l46601j49668j04487k21550k61962j52708j06751j90020
2161.9G36209035j72377J1921J13368K7716j7881J01984J86979N9903j03116m5061
2182.3G36372471J09136Q8334O974R6380K10464R2686j31965j47343l0577j02818k86519
$$ plain form
2039.6 754530609 754214704 753929675 753711104 753549218 753398120 753192306 752886534 752493501 752064705 751623154
2060 751623154 751180053 750798047 750531495 750332654 750088394 749761581 749381840 748930633 748409688 747894764
2080.3 747894764 747426987 746975243 746547937 746198535 745933056 745675743 745376825 745102644 744921267 744784951
2100.7 744784951 744593561 744347215 744126499 743911028 743606269 743252516 742960036 742702067 742358804 741903961
2121.1 741903961 741430163 740956604 740410507 739855587 739475489 739308476 739185572 738956273 738695562 738474011
2141.5 738474011 738167822 737742782 737396181 737246513 737142026 736920476 736658514 736505806 736399055 736209035
2161.9 736209035 736036658 736048579 736161947 736189663 736171782 736273766 736460745 736520648 736417532 736372471
2182.3 736372471 736481607 736569941 736576915 736673295 736883759 736976445 736844480 736697137 736666560 736563742 736277223
2204.8G36277223k60294q3506q0287k47598k87831j80244k00272m10378n36263m39703
2225.2G33550847l69966m88997n29468l03686r6082j20223j72257q3745k6584j79231
2245.6G31180608l40938k31684k1696m7087k16067k52187k21014l32356m90367m45485
2265.9G28581727k28703j43230k85864l85404k83480j61349j19687j4007J75476K76626
2286.3G27412105K17080J26302J14858Q6725n0426j83284j77622j36852k67088m94063
2306.7G26647735n46277m37617l98159m84050o41942q24213r39071q80837o68109m97162
2327.1G20330298m84407m85063l60548k67267k90990l24547k74718O6936Q06451J081287
2347.5G19797432K31624j010001j700103j662254j359344q88705m13001p6174M18782
$$ plain form
2204.8 736277223 736016929 735933423 735853136 735605538 735317707 735137463 734937191 734526813 733990550 733550847
2225.2 733550847 733180881 732691884 732162416 731858730 731762648 731642425 731470168 731386423 731359839 731180608
2245.6 731180608 730839670 730607986 730586290 730539203 730323136 730070949 729849935 729517579 729027212 728581727
2265.9 728581727 728353024 728209794 727923930 727538526 727255046 727093697 726974010 726960003 727135479 727412105
2286.3 727412105 727629185 727755487 727870345 727957070 727906644 727723360 727545738 727408886 727141798 726647735
2306.7 726647735 726101458 725663841 725265682 724781632 724139690 723315477 722376406 721495569 720827460 720330298
2327.1 720330298 719845891 719360828 719000280 718733013 718442023 718117476 717842758 717909694 718716145 719797432
2347.5 719797432 720029056 719019055 717318952 715656698 714297354 713408649 712995648 712919474 713338256
2365.9G13338256J115441J599193J656651J395643J089633R33945Q50141O41346L22401
2384.2G22942650K9207j80424l11732l66807l14653j74165o9558j09256k04443k11657
2404.6G21029162j32143o7592o0618m4286j4007o0380j55031j67310j12355j17660
2425G20097780k03907k49207k07126j69695k07066k50876k17378j82212k25544k78056
2445.4G17906713k43544j93358k51650l07084j99556m8458m2379j41144j63436j23382
2465.8G16192722k11060l74019m07159l31879l19958m08291m52817l67820k57492k28524
2486.2G12833703k09034j28925j05798k09153k61187j57535o9023j22368k02954j91986
2506.6G11175740j85311k92122l72887k57075j02460j52231l17037l63588k77758k42948
$$ plain form
2365.9 713338256 714453697 716052890 717709541 719105184 720194817 721128762 721978903 722620249 722942650
2384.2 722942650 722971857 722791433 722479701 722112894 721798241 721624076 721554518 721445262 721240819 721029162
2404.6 721029162 720897019 720829427 720768809 720724523 720710516 720650136 720495105 720327795 720215440 720097780
2425 720097780 719893873 719644666 719437540 719267845 719060779 718809903 718592525 718410313 718184769 717906713
2445.4 717906713 717663169 717469811 717218161 716911077 716711521 716663063 716620684 716479540 716316104 716192722
2465.8 716192722 715981662 715607643 715200484 714868605 714548647 714140356 713687539 713319719 713062227 712833703
2486.2 712833703 712624669 712495744 712389946 712180793 711919606 711762071 711693048 711570680 711367726 711175740
2506.6 711175740 710990429 710698307 710325420 710068345 709965885 709813654 709496617 709133029 708855271 708612323
2527G08612323l22044l44157k17378j18971j79768k48611k15530k06530k78235k78413
2547.4G06202686j22845L4153J3471j05262j08779m4465j11997k57253k90275k45213
2567.8G04964221k81752l89814m13835l36230k76685k66254k51233k24769l03805m75705
2588.2G01744139n00142l00289o7234N9188J04964Q7440m4346k95937n20528n84721
2608.6F99682534o19948p83086q92401o86645k44618J21296K53677K81036K73883J30833
2629F97516561r0600k15351k46167k67029k35081j02877L1352o56j82450l09467l31879
2651.4F95566356m01377n61953o74903p20978q25584q12412l39806M41909R67264R24945
2671.8F93563461N24104J61767k6643j52052k36690k11417j10567j9610O1274J19268
$$ plain form
2527 708612323 708290279 707946122 707728744 707609773 707430005 707181394 706965864 706759334 706481099 706202686
2547.4 706202686 706079841 706113994 706127465 706022203 705913424 705868959 705756962 705499709 705209434 704964221
2567.8 704964221 704682469 704292655 703878820 703542590 703265905 702999651 702748418 702523649 702219844 701744139
2588.2 701744139 701243997 700943708 700876474 700935662 701040626 701128066 701083720 700787783 700267255 699682534
2608.6 699682534 699062586 698279500 697387099 696700454 696455836 696577132 696830809 697111845 697385728 697516561
2629 697516561 697425961 697210610 696964443 696697414 696462333 696359456 696390808 696390152 696207702 695898235 695566356
2651.4 695566356 695164979 694603026 693928123 693207145 692381561 691569149 691229343 691671252 692638516 693563461
2671.8 693563461 694087565 694249332 694222689 694070637 693833947 693622530 693511963 693492353 693553627 693672895
2692.2F93672895O2466j02758k56360l15487k81811k42472k61605l11195l56734l97563
2712.6F91209376m46439m89950n06699m95672m41552l25262k47002l00586l78192l99470
2733F87178552l59773k81096k57015k55943j59740J8537P8917p3433k06232j47105
2753.4F85535669m8935n7697j07050j39118k03490k91586l46660l72827l64304l00944
2773.8F83303058k21491j68740j31727j11222j21117j11639j28031k71499l92914l05653
2794.2F81339025r4592N305r0242j98781k24173k44737k78354l50356m55022m94539
2814.6F78913534m70758m58777m72724m92811n21243n29706m90726m35411m13180m62949
2835F74165249n63443p89404j143992j275897j002490o54340n51462n56410m32789
$$ plain form
2692.2 693672895 693735361 693632603 693376243 693060756 692778945 692536473 692274868 691963673 691606939 691209376
2712.6 691209376 690762937 690272987 689766288 689270616 688829064 688503802 688256800 687956214 687578022 687178552
2733 687178552 686818779 686537683 686280668 686024725 685864985 685883522 685962439 685889006 685682774 685535669
2753.4 685535669 685486734 685429037 685321987 685182869 684979379 684687793 684341133 683968306 683604002 683303058
2773.8 683303058 683081567 682912827 682781100 682669878 682548761 682437122 682309091 682037592 681644678 681339025
2794.2 681339025 681244433 681249738 681159496 680960715 680736542 680491805 680213451 679863095 679408073 678913534
2814.6 678913534 678442776 677983999 677511275 677018464 676497221 675967515 675476789 675041378 674628198 674165249
2835 674165249 673601806 672812402 671668410 670392513 669390023 668735683 668184221 667627811 667195022
2853.3F67195022j95324N8829J60158K0564j84059k93136l26157k89023j48832l2723
2873.7F65965319m4048o6877p0214j49667k76327l85463m87209n77748o37173o82056
2894.1F62588537p25985p67410q14139q80778r87590j086175j074851r79542r80318
2912.5F54291749j181185j434684j528323j438796j323879j397073j713395j935661
2928.8F42338753j206815R25362L028810L317892K134144Q23796q9705p04765j127839
2947.2F49439633j210451q64923n32091m71711m34101l19659j70887q8334j72377k33590
2967.6F44941509J54376J049518J699984J486540Q52585L42369j52766n85020o26087
2985.9F49163008k15471L50416M92990N3882l95834o61314r10461r67264q81076r37462
$$ plain form
2853.3 667195022 666999698 667058527 667218685 667239249 667055190 666762054 666435897 666146874 665998042 665965319
2873.7 665965319 665921271 665854394 665784180 665634513 665358186 664972723 664485514 663907766 663270593 662588537
2894.1 662588537 661862552 661095142 660281003 659400225 658412635 657326460 656251609 655272067 654291749
2912.5 654291749 653110564 651675880 650147557 648708761 647384882 645987809 644274414 642338753
2928.8 642338753 641131938 642057300 645086110 648404002 650538146 651361942 651272237 650567472 649439633
2947.2 649439633 648229182 647364259 646832168 646360457 645926356 645606697 645435810 645347476 645175099 644941509
2967.6 644941509 645095885 646145403 647845387 649331927 650184512 650526881 650374115 649789095 649163008
2985.9 649163008 648947537 649297953 649790943 649844825 649448991 648787677 647877216 646909952 646028876 645091414
3006.3F45091414j144647j366615j466334j221001o75381l37898k54751L65794J504123
3024.7F40494704J855552J091838K02597k86520o26266q97586p84457m47571l36588
3043F40265703m07636l94106k91645l04699m05789m02868l96013m48286m01080l66032
3063.4F36447549n26190p89046r83596j015902r12189p95663p79986p68781n03242
3081.8F29372954O6042O38485Q21114M44710k55585p78079q30173o21438n30958n93484
3102.2F27733588n53548l89636m44948p72357q69155o55055o33717q91805j191258
3120.5F21332109j349866j273692j120091j033723j077652j206279j230240j118362
3136.8F11922204j043260j108646j105785q85129o37591n24521o26266r96292j341402
$$ plain form
3006.3 645091414 643946767 642580152 641113818 639892817 639217436 638879538 638624787 638990581 640494704
3024.7 640494704 642350256 643442094 643644691 643358171 642731905 641834319 641049862 640602291 640265703
3043 640265703 639858067 639463961 639172316 638867617 638461828 638058960 637662947 637214661 636813581 636447549
3063.4 636447549 635921359 635132313 634148717 633132815 632220626 631424963 630644977 629876196 629372954
3081.8 629372954 629438996 630077481 630898595 631343305 631087720 630309641 629479468 628858030 628327072 627733588
3102.2 627733588 627180040 626790404 626345456 625573099 624703944 624048889 623415172 622523367 621332109
3120.5 621332109 619982243 618708551 617588460 616554737 615477085 614270806 613040566 611922204
3136.8 611922204 610878944 609770298 608664513 607779384 607141793 606617272 605991006 604994714 603653312
3155.2F03653312j387060j369297j416266j392544j360118j442313j543522j540840
3171.5E92201352j511216j558185j668214j712203j675368j701176j814604j885474
3187.8E78674912j869261j917541k080500k177358k136886k144098k267659k357840
3204.1E61723769k337158k289891k269686k180993j949370j672149j464367j212000
3220.5E46348155q32320n09083l60131k68817j78874j86980l29077n29706p03156q41558
3240.9E41608453j009584j238823j384198j392782j453578j625658j758098j777649
3257.2E29968083j808584j929521j994074j875400j697183j575589j389384j032889
3273.5E16665459o21260l38614k18868k42948m78149r10342j358270j639545j792848
$$ plain form
3155.2 603653312 602266252 600896955 599480689 598088145 596728027 595285714 593742192 592201352
3171.5 592201352 590690136 589131951 587463737 585751534 584076166 582374990 580560386 578674912
3187.8 578674912 576805651 574888110 572807610 570630252 568493366 566349268 564081609 561723769
3204.1 561723769 559386611 557096720 554827034 552646041 550696671 549024522 547560155 546348155
3220.5 546348155 545515835 545006752 544646621 544377804 544198930 544011950 543682873 543153167 542450011 541608453
3240.9 541608453 540598869 539360046 537975848 536583066 535129488 533503830 531745732 529968083
3257.2 529968083 528159499 526229978 524235904 522360504 520663321 519087732 517698348 516665459
3273.5 516665459 516044199 515705585 515486717 515243769 514765620 513855278 512497008 510857463 509064615
3291.8E09064615j977146k157211k180219j949012j497537j103699j189053j768917
3308.2D95241821k387375k751350k918452l063619l257245l433675l471195l437758
3324.5D70521152l602296l884137l964424l858060l674298l473669l532142l779620
3340.8D40752506l849476l832490l672301l266394l227979l609389l667415l338098
3357.1D12288964l058374l040910l044456k703577k352387k555728l056049l086329
3373.4C89391154k598405k212345k103448k078444j977056j737506j359283r77517
3389.7C74347150j050800j460999j412302q20846m77254q56072j258284r67681m70728
3408.1C65572184k56210k24710l27587m00126k41488p5370p5668n5135R0808K34574
$$ plain form
3291.8 509064615 507087469 504930258 502750039 500801027 499303490 498199791 497010738 495241821
3308.2 495241821 492854446 490103096 487184644 484121025 480863780 477430105 473958910 470521152
3324.5 470521152 466918856 463034719 459070295 455212235 451537937 448064268 444532126 440752506
3340.8 440752506 436903030 433070540 429398239 426131845 422903866 419294477 415627062 412288964
3357.1 412288964 409230590 406189680 403145224 400441647 398089260 395533532 392477483 389391154
3373.4 389391154 386792749 384580404 382476956 380398512 378421456 376683950 375324667 374347150
3389.7 374347150 373296350 371835351 370423049 369602203 369124949 368268877 367010593 366042912 365572184
3408.1 365572184 365315974 365091264 364763677 364363551 364122063 364046693 363971025 363915890 364006698 364241272
3428.5C64241272J93954K17974M53263M46260K23488L57956Q32170J229703J464308
3446.8C69660348J615464J777500J966000K147853K380282K648771K746820K822638
3463.2C87765676L152817L360927L069073K652288K708942L101378L399909L381431
3479.5D12592441L125578L093630L276616L265679L148914L178060L275394L335208
3495.8D38291520L228754L059029L018499K932220K791733K828121L025562L187477
3512.1D62362915L077776K802759K704650K780587K893686K786577K525895K589584
3528.4D84524429K842337K895683K840638K723604K551228K570868K630234K494931
3544.7E06073952K356291K354264K372265K431988K566934K670348K684474K555549
$$ plain form
3428.5 364241272 364435226 364653200 365106463 365552723 365776211 366134167 366966337 368196040 369660348
3446.8 369660348 371275812 373053312 375019312 377167165 379547447 382196218 384943038 387765676
3463.2 387765676 390918493 394279420 397348493 400000781 402709723 405811101 409211010 412592441
3479.5 412592441 415718019 418811649 422088265 425353944 428502858 431680918 434956312 438291520
3495.8 438291520 441520274 444579303 447597802 450530022 453321755 456149876 459175438 462362915
3512.1 462362915 465440691 468243450 470948100 473728687 476622373 479408950 481934845 484524429
3528.4 484524429 487366766 490262449 493103087 495826691 498377919 500948787 503579021 506073952
3544.7 506073952 508430243 510784507 513156772 515588760 518155694 520826042 523510516 526066065
3561.1E26066065K237737K018929K551734L301203L200710K849817K842665K958059
3577.4E48026919L070593L138244K927065K521336K633810L288329L292561K902567
3593.7E71801424K959728L237188L264189L148377K886236K466142K456248K763509
3610E94983041K771437K689660K474845K347648K817571K932250K234161J352430J329422
3628.4F15932465K464056K687573K243757J980603J720905J552165J343965P35701
3644.7F30661190Q463L74318J879394K082228J217962J106798J412988J016676M80473
3663F40240490K16842k15411n13852k8610l4213k84076P20084J290739R63628N79059
3683.4F42934680P8320m32372l36468M65214Q84235O12676J08719k98500k24769K35319
$$ plain form
3561.1 526066065 528303802 530322731 532874465 536175668 539376378 542226195 545068860 548026919
3577.4 548026919 551097512 554235756 557162821 559684157 562317967 565606296 568898857 571801424
3593.7 571801424 574761152 577998340 581262529 584410906 587297142 589763284 592219532 594983041
3610 594983041 597754478 600444138 602918983 605266631 608084202 611016452 613250613 614603043 615932465
3628.4 615932465 618396521 621084094 623327851 625308454 627029359 628581524 629925489 630661190
3644.7 630661190 630669653 631043971 632923365 635005593 636223555 637330353 638743341 639760017 640240490
3663 640240490 640457332 640241921 639728069 639699459 639665246 639381170 640101254 641391993 642355621 642934680
3683.4 642934680 643013000 642580628 642244160 642709374 643593609 644206285 644315004 644016504 643791735 644027054
3703.8F44027054J06633n61595q77738j75297P66992O01054j07110m91440m50969k61903
3724.2F42575681R060J58727k51412q78453p90537K74062R36032J96278j105786j170218
3744.6F39953434l7372k43187n06281O15716R66370K20537j86444J30296J63973k19643
3765F40857399l61920k56717R3579K71380n2690m04716m11570j48475p4685q6426K2649
3787.5F39447808l0994k90275o09159p16210n76794p23004m89414L00169J94311O6221
3807.8F36572659L62754M6193p21871r47595n54979o19054k21252M58240K60592k5630
3828.2F34610057k40505m10855m00960n61237m95136R3519M20869M30047K36392l59594
3848.6F33322597j367867j869083j19567J263857O36697k79605o47963l38673k17915
$$ plain form
3703.8 644027054 644133687 643572092 642694354 642519057 643286049 643887103 643779993 643288553 642837584 642575681
3724.2 642575681 642584741 642743468 642492056 641613603 640823066 641097128 642033160 642229438 641123652 639953434
3744.6 639953434 639916062 639672875 639166594 639782310 640748680 640969217 640782773 640913069 641077042 640857399
3765 640857399 640495479 640238762 640332341 640603721 640551031 640146315 639734745 639586270 639511585 639425159 639447808
3787.5 639447808 639416814 639126539 638517380 637801170 637224376 636501372 636011958 636312127 636506438 636572659
3807.8 636572659 636935413 636981606 636259735 635312140 634757161 634138107 633916855 634375095 634635687 634610057
3828.2 634610057 634369552 633958697 633557737 632996500 632501364 632594883 633015752 633445799 633682191 633322597
3848.6 633322597 631954730 630085647 629966080 631229937 631866634 631587029 630939066 630600393 630382478
3867F30382478n42521k62082K65896L20971m5061o08265m36604p4208j48415J3828
3887.4F28866017j24335l25323M4823Q881n81622q55029o36041j60157M46736N85020
3907.8F27268970J62959k28584m56690n97954l98577k2351K2232p1585N7817M9471
3928.2F25785708j54554k5809K58207J67847j27912l50356l81708k27034j88470j96040
3948.6F24559879l9398N9187n066m3691r119k2531m3511n1796j11163j54674j47283
3971F23990834j50681j35779q0764q1480j07408r2446j29104k13444k36213j88530
3991.4F22574985j31071p8022l4630
3997.5F22331262
$$ plain form
3867 630382478 629839957 629577875 629843771 630164742 630119681 629511416 629074812 629000604 628852189 628866017
3887.4 628866017 628741682 628416359 628461182 628470063 627888441 627033412 626397371 626237214 626683950 627268970
3907.8 627268970 627431929 627203345 626746655 626148701 625750124 625727773 625750005 625678420 625736237 625785708
3928.2 625785708 625631154 625605345 625863552 626031399 625903487 625553131 625171423 624944389 624755919 624559879
3948.6 624559879 624520481 624579668 624574602 624530911 624521792 624499261 624455750 624403954 624292791 624138117 623990834
3971 623990834 623840153 623704374 623623610 623542130 623434722 623342276 623213172 622999728 622763515 622574985
3991.4 622574985 622443914 622365892 622331262
3997.5 622331262
##END=$$ End of the data block
