##TITLE=G5-1 $$ Begin of the data block
##JCAMP-DX=5.00 $$ ACD/SpecManager v 10.08
##SPECTROMETER/DATA SYSTEM=Alpha
##DATE=13 May 2014 09:34:16
##DATA TYPE=INFRARED SPECTRUM
##DATA CLASS=XYDATA
##ORIGIN=
##OWNER=
##NPOINTS=1765
##FIRSTX=399.75695801
##LASTX=3997.56933594
##MAXX=3997.56933594
##MINX=399.75695801
##MAXY=0.81197089
##MINY=0.21118298
##XFACTOR=1.0000000000
##YFACTOR=1.000000000000000e-9
##FIRSTY=0.72051567
##DELTAX=2.03957629
##XUNITS=1/CM
##YUNITS=ARBITRARY UNITS
##XYDATA=(X++(Y..Y))
399.8G20515668k683222o179392n359352M14372N288899P417440O727755K245426k650916
$$ 720515668 717832446 711653054 706293702 706708074 711996973 719414413 726142168 728387594 725736678
418.1G25736678k331257r53734k807081k977490j550019k721310m309535l351152l212511
$$ 725736678 723405421 722451687 719644606 716667116 715117097 712395787 708086252 704735100 701522589
436.5G01522589m628659m407465l746808n096495o016314n668163p820904j2087405
$$ 701522589 696893930 692486465 688739657 683643162 677626848 671958685 664137781 652050376
452.8F52050376j5070677k0098507k7455807k8987348k4856627k4248421k5848657
$$ 652050376 636979699 616881192 589425385 560438037 535581410 511332989 485484332
467.1D85484332m635006L5462498N2267731L7719667K0092964P489919l204643j1991799
$$ 485484332 480849326 516311824 568579555 606299222 626392186 633882105 630677462 618685663
483.4F18685663j5291929m881502J3037920J9504071J1582195L277004N88715j007318
$$ 618685663 603393734 598512232 611550152 631054223 642636418 645913422 646502137 645494819
499.7F45494819k745629k154231j180410j924276j962722p30276q33929j606345m26054
$$ 645494819 642749190 640594959 639414549 637490273 635527551 634797275 633963346 632357001 631930947
518.1F31930947P63774k66552p07149J390278N386770J1444449J4992535Q893431j937449
$$ 631930947 632694721 632428169 631721020 633111298 638498068 649942517 664935052 673828483 671891034
536.4F71891034p001102o581247o693006p704019p417739n063593P57813Q777202J2960374
$$ 671891034 664889932 658308685 651615679 643911660 636493921 631430328 632188141 640965343 653925717
554.8F53925717Q203089n69522m102409l839851l871500k950847j760841k091765k411842
$$ 653925717 662128806 661559284 657456875 653617024 649745524 646794677 645033836 642942071 640530229
573.1F40530229j676917j973927l585995n187511q619845j5248120j7155170n666435
$$ 640530229 638853312 636879385 633293390 628105879 619486034 604237914 587082744 581416309
589.4E81416309Q449972Q347332Q06510J195848Q576811J4696538J5383780J1508942
$$ 581416309 589866281 598213613 599020123 600215971 608792782 623489320 638873100 650382042
605.8F50382042O764173M030228J994073j366734n146861r759307j8007994k8669417
$$ 650382042 657146215 661176443 663170516 661803782 656656921 646897614 628889620 600220203
622.1F00220203l2673895k3910761j5240669k0678938k1869450L166258L3591181L4362197
$$ 600220203 567546308 543635547 528394878 507715940 485846490 489012748 522603929 556966126
638.4E56966126R731531m731715M071355J8367470L0023872L7341953L4531057K5696873
$$ 556966126 566697657 561965942 566037297 584404767 614428639 651770592 686301649 711998522
654.7G11998522J6716957J0934651Q872748P355630N031645M710019O536782M679858
$$ 711998522 728715479 739650130 748522878 755878508 760910153 765620172 772156954 776836812
671G76836812K908230L106177K504230J198768J321316J521349L23594k15233L82424
$$ 776836812 779745042 782851219 785355449 786554217 787875533 789396882 789720476 789505243 789887667
689.4G89887667m6671r42468m04239J1980r16898j245379o28293j040995j806438j286089
$$ 789887667 789840996 788898528 788494289 788506269 787589371 786343992 785715699 784674704 782868266 781582177
709.8G81582177j004994j935542k191543j645029k064228k696097k312481k342642
$$ 781582177 780577183 778641641 776450098 774805069 772740841 770044744 767732263 765389621
726.1G65389621l403485l882765l925562n038202o199181o405413p495225j0916173
$$ 765389621 761986136 758103371 754177809 749139607 742940426 736535013 729039788 718123615
742.4G18123615j5468598j6045332q309543n85496m829347j5948713k2441089k3963750
$$ 718123615 702655017 686609685 678300142 677714646 672885299 656936586 634495497 610531747
758.7F10531747k5955736l1496287l8461625m2990864m3971270l3777147k033532L8937598
$$ 610531747 584576011 553079724 514618099 471627235 427655965 393878818 391845286 430782884
775D30782884O7431927P5073630O0377478L4133256J3105571J357794p252038j8783867
$$ 430782884 498214811 573288441 633665919 667799175 680904746 682262540 675010502 656226635
791.4F56226635k9951096k9061436k1084726k3555219j7278850K6396453P4469090
$$ 656226635 626275539 597214103 576129377 552574158 535295308 561691761 636160851
805.6F36160851P9658150N2964449K6932120J1429131L904343R21846n98789j662194
$$ 636160851 715819001 768783450 795715570 807144701 811049044 811970890 811372101 809709907
821.9H09709907j680077j392602j773358k200127k074182k142310k544164k508700
$$ 809709907 808029830 806637228 804863870 802663743 800589561 798447251 795903087 793394387
838.3G93394387k388835k852261l282905k979874k971113l727973m486322n265355
$$ 793394387 791005552 788153291 784870386 781890512 778919399 775191426 770705104 765439749
854.6G65439749p042527j0706723j6925216j8413603r150565k507448j187742Q122266
$$ 765439749 758397222 747690499 730765283 712351680 703201115 700693667 699505925 707628191
870.9G07628191J8746554J7414868P623911l53098l556609n438268p641614r436786
$$ 707628191 726374745 743789613 751413524 751060426 747503817 742065549 734423935 724987149
887.2G24987149j0636210j2888968j7833233k5800586l6057770m3608904k9800355
$$ 724987149 714350939 701461971 683628738 657828152 621770382 578161478 548361123
901.5E48361123J6020357N8070004O0003936L8564504K1642804J3316750R449065P053793
$$ 548361123 564381480 622451484 682455420 721019924 742662728 755979478 765428543 772482336
917.8G72482336L795683K09629j527905j383364j215697j615285k130330k843440l569364
$$ 772482336 776278019 776487648 774959743 773576379 772360682 770745397 768615067 765771627 762202263
936.2G62202263l695548l719985m902959o127238m228413m8697J192331j233220n180598
$$ 762202263 758506715 754786730 749883771 743756533 739528120 739479423 740671754 739438534 734257936
954.5G34257936j1019349j5399277p708728R896755J6298473O863773l959775j1289299
$$ 734257936 723238587 707839310 700130582 710027337 726325810 733189583 729229808 717940509
970.8G17940509j9719124l3080339m3369174k0145059L2836080N3560674L0230284
$$ 717940509 698221385 665141046 621771872 601626813 634462893 688023567 718253851
985.1G18253851Q681834K330184L68774j176894k031148j709163m85897L70324J18136
$$ 718253851 726935685 729265869 729634643 728457749 726426601 724717438 724231541 724601865 724720001
1003.5G24720001p69794j675546k042770k103627k515912l144026l385007l894627
$$ 724720001 723950207 722274661 720231891 718128264 715612352 712468326 709083319 705188692
1019.8G05188692n335391p625997j1328995j6455710j8409610j0274768J0545135K9319763
$$ 705188692 699853301 692227304 680898309 664442599 646032989 635758221 646303356 675623119
1036.1F75623119K4122834L745973r891629j6486466k3305178k7122736j2225747K0824194
$$ 675623119 699745953 703491926 693600297 677113831 653808653 626685917 614460170 635284364
1052.4F35284364L9458633K8777480J0521054P97272k694428m663766o007909n586267
$$ 635284364 674742997 703520477 714041531 714838803 712144375 707480609 701472700 695886433
1068.7F95886433m421294n172669q411468j4216303k3099065k5320232m316569K7119756
$$ 695886433 691465139 686292470 677881002 663664699 640565634 615245402 610928833 638048589
1085F38048589L5041690K0509482P518649J798093p12454j825631k926767m180550
$$ 638048589 673090279 693599761 701118410 702916503 702204049 700378418 697451651 693271101
1101.4F93271101l918410j811921j23740k15888j292407k731979m442036n905271p915854
$$ 693271101 689352691 687540770 687417030 687201142 685908735 683176756 678734720 672829449 664913595
1119.7F64913595j2054384j8877685k6589632k5840581l682196K9630959M1414023
$$ 664913595 652859211 633981526 607391894 581551313 577869117 607500076 648914099
1134F48914099K4780631L829181p914901j5848636k6796699m0724516m5124531k6711285
$$ 648914099 673694730 677523911 669609010 653760374 626963675 586239159 541114628 514403343
1150.3E14403343Q172989M4830322O3663006N0714433K4651289Q001805P13229k435625
$$ 514403343 522576332 567406654 631069660 681784093 706435382 714437187 715150416 712714791
1166.6G12714791l176450l232360l824532m099906l890931m325629n219340n595803
$$ 712714791 709538341 706305981 702481449 698381543 694490612 690164983 684945643 679349840
1182.9F79349840o185770p841587r888173j2680709j8148065k5731802l0132710k6287139
$$ 679349840 673164070 665322483 655434310 642753601 624605536 598873734 568741024 542453885
1199.3E42453885j3362169N171239J9795418K2090673J4173210L939390j380861J748980
$$ 542453885 529091716 534262955 554058373 576149046 590322256 594261646 592880785 594629765
1215.6E94629765J2051880K2746503K4496138J6223371N563140k150297o409407o322205
$$ 594629765 606681645 629428148 653924286 670147657 675710797 673560500 667151093 660828888
1231.9F60828888k165079K489984M863501M785597K540887j321614n195022q704185
$$ 660828888 658663809 661153793 666017294 670802891 673343778 672022164 666827142 658122957
1248.2F58122957j2979448j2633145q65698R123087M786730j380622k172888m471719
$$ 658122957 645143509 632510364 631644666 640767753 645554483 644173861 642000973 637529254
1264.5F37529254q579135j1269748j3282895j6444326k0533979k4821281l0242264
$$ 637529254 628950119 617680371 604397476 587953150 567419171 542597890 512355626
1278.8E12355626l6491275l9268613l4862042k6135146j9445151j2809813M763543
$$ 512355626 475864351 436595738 401733696 375598550 356153399 343343586 348107129
1293.1C48107129L2117576N3093582O1195880O2178076N8076202M8588276L6952913
$$ 348107129 380224705 433318287 494514167 556692243 614768445 663356721 700309634
1307.4G00309634K5772751J5538811N957723m001439j4202356k4591148l6124229l9644361
$$ 700309634 726082385 741621196 747578919 743577480 729375124 704783976 668659747 629015386
1323.7F29015386k3455322l854274n228520j6026139l018856L4281909N4902852L7669062
$$ 629015386 605560064 601705790 596477270 580451131 577432275 611714184 666617036 704286098
1340G04286098N250752j4728784o833375K0498157L2560587J9680619M262507k291024
$$ 704286098 709536850 694808066 687974691 708472848 741033435 760714054 764976561 762685537
1356.3G62685537m198372n598664o040633m879117m662156n615771n827010o207525
$$ 762685537 758487165 752888501 746847868 741968751 737306595 731690824 725863814 719656289
1372.6G19656289p737816r015560j1554897j8086970k8176248l5457611k2958338J6106009
$$ 719656289 711918473 702902913 691348016 673261046 645084798 609627187 586668849 602774858
1388.9F02774858M2471290L4061909R635508q835614q918404M780113J1907161N934834
$$ 602774858 645246148 679308057 688943565 680107951 671189547 675969660 687876821 693811655
1405.3F93811655j361132m598796o748378p772029p645607q103251q888900q340657
$$ 693811655 692450523 687851727 681103349 673331320 665685713 657582462 648693562 640352905
1421.6F40352905j0176778j5017390j8365860j7287612j3977230j5741408k4580180
$$ 640352905 630176127 615158737 596792877 579505265 565528035 549786627 525206447
1435.9E25206447l2769055l5758882l3413947j2088746J9364953L9879918N3985745
$$ 525206447 492437392 456678510 423264563 411175817 430540770 470420688 524406433
1450.1E24406433O1439335M7331989J8814981m754305j3699054k2872508l9737821
$$ 524406433 585845768 633177757 651992738 647238433 633539379 610666871 570929050
1464.4E70929050m5307934k1419167L1629383R7434700R2963755L3871293K930880
$$ 570929050 525621116 504201949 535831332 633266032 726229787 760101080 763031960
1478.7G63031960n297244p536471p733881p196725o708503n796790m379928m518151
$$ 763031960 757734716 750198245 742464364 735267639 728559136 722762346 718382418 713864267
1495G13864267n449355m406869k621949k972424n956650q088410m819870m112064o077230
$$ 713864267 708414912 704008043 701386094 698413670 692457020 684368610 679548740 675436676 669359446
1513.4F69359446p637144q555829r262264j1111140j1771143j3720214j8698037k2726595
$$ 669359446 661722302 653166473 643904209 632793069 621021926 607301712 588603675 565877080
1529.7E65877080l0178607m3022573m3036311l2242388j5020877J6211718L6769003
$$ 565877080 535698473 492675900 449639589 417397201 402376324 418588042 455357045
1543.9D55357045N1550239O0605467N5114269L6321282J9016087Q122623o86824n181551
$$ 455357045 506907284 567512751 622627020 658948302 677964389 686087012 685400188 680218637
1560.3F80218637m988551o825805q529007r938300j1268377j0079742j1384010j6085208
$$ 680218637 675230086 668404281 659875274 649936974 638668597 628588855 617204845 601119637
1576.6F01119637j6239583j5563130j8294871k1163523k3694039k6517451l0233472
$$ 601119637 584880054 569316924 551022053 529858530 506164491 479647040 449413568
1590.9D49413568l5671175m0817082l4929275n870849L8617223O6079945N1921457
$$ 449413568 413742393 372925311 337996036 332125187 370742410 436822355 488743812
1605.1D88743812J3394803j9137502l5555542m0298849m4805795m9631685m0482670
$$ 488743812 502138615 483001113 447445571 407146722 362340927 312709242 272226572
1619.4B72226572l0862182k3671270o510138J4916420K9707938L0312598K3807436
$$ 272226572 241364390 217693120 211182982 226099402 255807340 286119938 309927374
1633.7C09927374K7050823M3301016N5476189N7863355N0782293M5271217L7663877
$$ 309927374 336978197 380279213 435755402 493618757 544401050 589672267 627336144
1648F27336144K1169126J0448397M192352k900481o130338r45806J5494585L0488491
$$ 627336144 648505270 658953667 663146019 660245538 654115200 653169394 668663979 699152470
1664.3F99152470L0756592K6996017K2229552J3280630P604540N589544K636970l35336
$$ 699152470 729909062 756905079 779134631 792415261 800019801 805609345 808246315 807910979
1680.6H07910979k223551k468110j362800j518548k118647k848446l667414k424002
$$ 807910979 805687428 803219318 801856518 800337970 798219323 795370877 791703463 789279461
1696.9G89279461J38819K279401L032029J908004N48899n59449j304686k074182l098846
$$ 789279461 789418280 791697681 794729710 796637714 797186613 796627164 795322478 793248296 790149450
1715.3G90149450k495408j3411L34859p87973p68662n79834j212716j681745j442850
$$ 790149450 787654042 787640631 787975490 787187517 786418855 785839021 784626305 782944560 781501710
1733.6G81501710m90605o74427j234770r06050q57651j119852r82404j010478q12888
$$ 781501710 781011105 780336678 779101908 778195858 777338207 776218355 775235951 774225473 773412585
1752G73412585l86953o94871j275063j385986p63596k57909q81851j386582j348257
$$ 773412585 773025632 772330761 771055698 769669712 768906116 768648207 767766356 766379774 765031517
1770.3G65031517j363576m97699K67864k65956j029015q17776l87489p15375j355708
$$ 765031517 763667941 763170242 763438106 763172150 762143135 761325359 760937870 760222495 758866787
1788.7G58866787j696765j353741q34704p27355q64744j259506j430511j162768j193821
$$ 758866787 757170022 755816281 754981577 754254222 753389478 752129972 750699461 749536693 748342872
1807G48342872j429439p45058L71039L06725l11374k42055l19779j080036j106798
$$ 748342872 746913433 746168375 746539414 746846139 746534765 746292710 745972931 744892895 743786097
1825.4G43786097m37439n04076n06103j11103l70443r82345j035690q90910j128555
$$ 743786097 743348658 742844582 742338479 742227376 741856933 740874588 739838898 738947988 737819433
1843.8G37819433p74860K06530O48677L00467j16884j39952n03004j121461j108289
$$ 737819433 737044573 737251103 737899780 738200247 738083363 737943411 737440407 736318946 735210657
1862.1G35210657q81910j189232r73404L38138O50107k83718o72161m96984q05676
$$ 735210657 734328747 733139515 732166111 732504249 733154356 732870638 732198477 731701493 730895817
1880.5G30895817j125693p92623n89668q06153l30329L55184J46151j31906J4961j73092
$$ 730895817 729770124 728977501 728387833 727581680 727251351 727606535 727752686 727620780 727635741 727462649
1900.9G27462649p49111r02593p35164q95381j003801o88851p54357j331746j288235
$$ 727462649 726713538 725810945 725075781 724180400 723176599 722487748 721733391 720401645 719113410
1919.2G19113410q41260r23932j028419p09772l15666q7678J80363L96490k98p04646
$$ 719113410 718272150 717348218 716319799 715610027 715294361 715206683 715387046 715783536 715783238 715078592
1939.6G15078592p50124k20776j63436l79443k07066j64330m18902l69012k48432o27399
$$ 715078592 714328468 714107692 713944256 713564813 713357747 713193417 712774515 712405503 712157071 711529672
1960G11529672r79721q80182q89480j050353p01964n8174O0618k13802k21253k20477
$$ 711529672 710549951 709669769 708780289 707729936 707027972 706969798 707030416 706816614 706595361 706374884
1980.4G06374884o06358r30369j057744j401842j567066o30736P87735J264214R80020
$$ 706374884 705768526 704838157 703780413 702378571 700811505 700180769 700968504 702232718 703212738
1998.8G03212738O22451J30415l12805k90513j78158l83675m90785l29256l60548n58556
$$ 703212738 703835189 703965604 703652799 703362286 703184128 702800453 702309668 701980412 701619864 701061308
2019.2G01061308n22196m62413p01308p87914l96788q8274j27912q4102J2636k41935
$$ 701061308 700539112 700076699 699375391 698587477 698190689 698102415 697974503 697890401 697903037 697661102
2039.6F97661102m91381l11255j60277k95580k74539j27732l13044n62668m84109m34816
$$ 697661102 697169721 696858466 696698189 696402609 696128070 696000338 695687294 695124626 694640517 694205701
2060F94205701n92351n23209k32518k36988m43637m12226l83198o00458o52968m72010
$$ 694205701 693613350 693090141 692857623 692620635 692176998 691764772 691381574 690781116 690128148 689656138
2080.3F89656138n31375p24554n63502l33608m26471m53710k32876k03848l68654l06070
$$ 689656138 689124763 688400209 687836707 687503099 687076628 686622918 686390042 686186194 685817540 685511470
2100.7F85511470j68979l03746m18484k68519k51829m43638m13358k76744m22001n90325
$$ 685511470 685342491 685038745 684620261 684351742 684099913 683656275 683242917 682966173 682544172 681953847
2121.1F81953847n23388n63383p66218o92785l98576l14236l23951j83463j78575m29988
$$ 681953847 681430459 680867076 680100858 679408073 679009497 678695261 678371310 678187847 678009272 677579284
2141.5F77579284n06401l50535l48091l87550j89960o6817k55823l40104j61111j07050
$$ 677579284 677072883 676722348 676374257 675986707 675796747 675729930 675474107 675134003 674972892 674865842
2161.9F74865842j62304p331J55807Q4698Q4281K72095K79605Q8573P2300J77920J21892
$$ 674865842 674703538 674696207 674852014 674936712 675020993 675293088 675572693 675661266 675733566 675911486 676033378
2184.4F76033378N5790J83045K28763Q2612Q2791J80423J1981k22564j78635j35124
$$ 676033378 676089168 676272213 676500976 676583588 676666379 676846802 676858783 676636219 676457584 676322460
2204.8F76322460k60353k36511j00792j67429k99931k52783k49684m45664n24163m27723
$$ 676322460 676062107 675825596 675724804 675557375 675257444 675004661 674754977 674309313 673785150 673357427
2225.2F73357427m96626o41882n16653l04163k73108j75536M6909O795k57075l05831
$$ 673357427 672860801 672218919 671702266 671398103 671124995 670949459 670996368 671003163 670746088 670440257
2245.6F70440257k01404k30194j96516k0564n0783k81989l51966l30150m62353m88341
$$ 670440257 670238853 670008659 669812143 669791579 669740796 669458807 669106841 668776691 668314338 667825997
2265.9F67825997k42353j48475l31402m00841l28719l38614k27154J32382L41177K81692
$$ 667825997 667583644 667435169 667103767 666702926 666374207 666035593 665808439 665940821 666281998 666563690
2286.3F66563690L16143M19378K50816K5213Q6069J35243o1691j72078j05024k08258
$$ 666563690 666879833 667299211 667550027 667575240 667661309 667796552 667734861 667562783 667457759 667249501
2306.7F67249501l89040l07739j74880k88724m73142n82397p20322p08521l77893k06888
$$ 667249501 666860461 666552722 666377842 666089118 665615976 665033579 664313257 663604736 663226843 663019955
2327.1F63019955m50551n49972k88964j83344k51352j09137M9472j6451J69576N15222
$$ 663019955 662569404 662019432 661730468 661547124 661295772 661186635 661236107 661219656 661389232 661904454
2347.5F61904454J98543n96225j075625j025677r45091q87335o77526l74794R2328
$$ 661904454 662102997 661506772 660431147 659405470 658460379 657573044 656895518 656520724 656613052
2365.9F56613052Q28922J357197J217723Q21054O55890N23984L16024K26855J61589
$$ 656613052 657441974 658799171 660016894 660837948 661493838 662017822 662333846 662560701 662722290
2384.2F62722290j10686m14372m46796l71158l84510k75075o3956j13726l16143k71380
$$ 662722290 662611604 662197232 661750436 661379278 660994768 660719693 660655737 660542011 660225868 659954488
2404.6F59954488r3758p3314m2378J02281N4777j56641j61708o1452j62184k51413
$$ 659954488 659860730 659787416 659745038 659847319 659902096 659745455 659583747 659522295 659360111 659108698
2425F59108698j38342j41323l21745l07978j59502k03609k79010j64091j28746l09348
$$ 659108698 658970356 658829033 658507288 658199310 658039808 657836199 657557189 657393098 657264352 656955004
2445.4F56955004l71099k69353k83420l01957j35661l7372j37627j67250r3341j81318
$$ 656955004 656583905 656314552 656031132 655729175 655593514 655556142 655418515 655251265 655157924 654976606
2465.8F54976606l50892l22402k79903m34041n01573m08113m72427n69582l44812q1778
$$ 654976606 654625714 654303312 654023409 653589368 653087795 652679682 652207255 651637673 651292861 651211083
2486.2F51211083j39237k39491j86920k08020k67804j63853p9155j93298k55048j69516
$$ 651211083 651071846 650832355 650645435 650437415 650169611 650005758 649926603 649733305 649478257 649308741
2506.6F49308741k27690l87430l27289j59562j94013l01897k54035k38478l57509l44992
$$ 649308741 649081051 648693621 648366332 648206770 648012757 647710860 647456825 647218347 646860838 646515846
2527F46515846k54810l50952m13835k30193j09792k09570k39372j74105k63095l39091
$$ 646515846 646261036 645910084 645496249 645266056 645156264 644946694 644707322 644533217 644270122 643931031
2547.4F43931031j60992J4722k0384o0559k1815r2566k32399k33352k24232l73543
$$ 643931031 643770039 643784761 643764377 643703818 643682003 643589437 643357038 643123686 642899454 642525911
2567.8F42525911m37438l40402l95417n27382l88563j80066k39074l62813l78848m62949
$$ 642525911 642088473 641748071 641352654 640825272 640436709 640256643 640017569 639654756 639275908 638812959
2588.2F38812959n55336l92616o0558J34646J69397J50800l4750l57926n24938n73456
$$ 638812959 638257623 637865007 637804449 637939095 638108492 638259292 638224542 637866616 637341678 636768222
2608.6F36768222p65681r73761r36211p21514m11868J4484L57330L90291K51174J80840
$$ 636768222 636002541 635028780 634092569 633371055 632959187 632973671 633331001 633721292 633972466 634153306
2629F34153306P3553j97411l88443l31045k20120j28448O0559J26362j35184l87907
$$ 634153306 634226859 634029448 633641005 633309960 633089840 632961392 633021951 633148313 633013129 632625222
2649.4F32625222m17888m81963o44326p02739p73370j034856j056016l92735N40555
$$ 632625222 632207334 631725371 631081045 630378306 629604936 628570080 627514064 627121329 627661884
2667.7F27661884J067817J101375Q02993K93255p9155j35719j49131k18034j35005
$$ 627661884 628729701 629831076 630634069 630927324 630848169 630712450 630563319 630345285 630210280
2686.1F30210280L3915N6565L5644R8169K7239k22802l16501k39610k97666m02868
$$ 630210280 630244195 630300760 630336404 630434573 630461812 630239010 629922509 629682899 629385233 628982365
2706.5F28982365l50535l37839m60207m98355m54247n47230o82592n70178l27588k80916
$$ 628982365 628631830 628293991 627833784 627335429 626881182 626333952 625651360 625081182 624753594 624472678
2726.9F24472678l38435l14594l94583n43236m58002k82050k53677j77562L9637P3135
$$ 624472678 624134243 623819649 623425066 622881830 622423828 622141778 621888101 621710539 621750176 621823311
2747.3F21823311j29461j98901q0884k8252m5896l3915r0480k45988l31760l67164
$$ 621823311 621693850 621494949 621414065 621385813 621339917 621306002 621215522 620969534 620637774 620270610
2767.7F20270610n01037n45800l34799j45316j59621j69814r8109r8765j34945j48833
$$ 620270610 619769573 619223773 618888974 618743658 618584037 618414223 618316114 618217349 618082404 617933571
2788.1F17933571k84612m47631l36706n7876K7716o4612j05083j44899k75194l51906
$$ 617933571 617648959 617201328 616864622 616806746 616834462 616769850 616664767 616519868 616244674 615892768
2808.5F15892768l63648m53174n19514m37320l93152n36799o63758o21616n54502n05686
$$ 615892768 615529120 615075946 614556432 614119112 613725960 613189161 612525403 611903787 611349285 610843599
2828.9F10843599l99590l52859m70460o30080q34823j140118j228332q34704l05652
$$ 610843599 610444009 610091150 609620690 608990610 608155787 607015669 605787337 604952633 604646981
2847.2F04646981j42396k27749j75536n722J22369J79708J04427j18196l10600l33667
$$ 604646981 604504585 604276836 604101300 604095578 604217947 604397655 604502082 604383886 604073286 603739619
2867.6F03739619k38776j38402q2672q4042j75119k97308l33666l43860m45544n45502
$$ 603739619 603500843 603362441 603279769 603195727 603020608 602723300 602389634 602045774 601600230 601054728
2888F01054728n51105n63263o52194p28488p42197p66278q28027r07779j028717j118123
$$ 601054728 600503623 599940360 599288166 598559678 597817481 597051203 596223176 595315397 594286680 593168557
2908.4E93168557j064122j039207j233399j464307j519621j476228j500845j714229
$$ 593168557 592104435 591065228 589831829 588367522 586847901 585371673 583870828 582156599
2924.7E82156599k211929k657532j757145J178801M018187M285693K623618R22501
$$ 582156599 579944670 577287138 575529993 576708794 580726981 585012674 587636292 588558793
2941E88558793k03133q54373j125097j043737o24180j68800J6153k6405j24633j69873
$$ 588558793 588355660 587501287 586376190 585332453 584708273 584539473 584555626 584529221 584404588 584234715
2961.4E84234715l02434o27876q31663m42565N24402J243174J109183N24759o6221
$$ 584234715 583932281 583304405 582472742 582030177 582554579 583797753 584906936 585431695 585365474
2979.8E85365474o16431r54270q95739m58717J45793L65317p8857o28651r22083j111627
$$ 585365474 584749043 583794773 582899034 582440317 582586110 582951427 582872570 582243919 581321836 580210209
3000.2E80210209j140297j040875j136303j494587j821518j870870j513005q12471
$$ 580210209 579069912 578029037 576892734 575398147 573576629 571705759 570192754 569380283
3016.5E69380283k92778j63436M11153J649440K193272J419186L10540l25143o41167
$$ 569380283 569087505 568924069 569335222 570984662 573177934 574597120 574907660 574582517 573941350
3034.9E73941350r05514r37760o93619m90248m77195m70519l51787k91407l68297m44948
$$ 573941350 573035836 572098076 571404457 570914209 570437014 569966495 569614708 569323301 568955004 568510056
3055.3E68510056m59612m12285l33011l69549n98908q88586j067519j105368j068354
$$ 568510056 568050444 567638159 567305148 566935599 566336691 565448105 564380586 563275218 562206864
3073.6E62206864j001715r36866q63969n96583O2108Q51810J104891N92768j75893
$$ 562206864 561205149 560268283 559404314 558807731 558869839 559721649 560826540 561419308 561243415
3092E61243415o98805q14080o57618n55516n74708n36620m42803n06342p69734q91328
$$ 561243415 560544610 559730530 559072912 558517396 557942688 557406068 556963265 556456923 555687189 554795861
3112.4E54795861p66396p68662r81867j215458j367152j357138j241386j153946j196325
$$ 554795861 554029465 553260803 552278936 551063478 549696326 548339188 547097802 545943856 544747531
3130.7E44747531j310050j313329j220166j205206j283944j210451r17673o68109n80728
$$ 544747531 543437481 542124152 540903986 539698780 538414836 537204385 536286712 535618603 535037875
3149.1E35037875o51002r70781j367032j494885j442968j451493j486242j490652j534462
$$ 535037875 534386873 533416092 532049060 530554175 529111207 527659714 526173472 524682820 523148358
3167.4E23148358j596689j614631j646280j703560j732409j749635j811206j886308
$$ 523148358 521551669 519937038 518290758 516587198 514854789 513105154 511293948 509407640
3183.7E09407640j936198j993000k070666k128303k137422k165169k246827k325564
$$ 509407640 507471442 505478442 503407776 501279473 499142051 496976882 494730055 492404491
3200.1D92404491k377093k435804k472043k433180k338440k206027j990378j698285
$$ 492404491 490027398 487591594 485119551 482686371 480347931 478141904 476151526 474453241
3216.4D74453241j387567j028478o47217l36498j19865J8060O7145L5256n9128k30759
$$ 474453241 473065674 472037196 471389979 471053481 470933616 470951676 471018821 471054077 470994949 470764190
3236.8D70764190m48018o93679r51231j165926j298487j372517j467913j625776j796097
$$ 470764190 470316172 469622493 468671262 467505336 466206849 464834332 463366419 461740643 459944546
3255.1D59944546j888066j916200j967758k006531j945496j816421j640231j374066
$$ 459944546 458056480 456140280 454172522 452165991 450220495 448404074 446763843 445389777
3271.4D45389777j014262n88745k11000k8223r3609m05073q56042j261771j556546
$$ 445389777 444375515 443786770 443575770 443547547 443453938 443048865 442192823 440931052 439374506
3289.8D39374506j811534k029746k133936k103925j859009j395106j004190j088261
$$ 439374506 437562972 435533226 433399290 431295365 429436356 428041250 427037060 425948799
3306.1D25948799j637876k209038k570927k810478l062696l279835l347307l329188
$$ 425948799 424310923 422101885 419530958 416720480 413657784 410377949 407030642 403701454
3322.4D03701454l367632l573448l795683l807038l715634l577739l357977l347486
$$ 403701454 400333822 396760374 392964691 389157653 385442019 381864280 378506303 375158817
3338.8C75158817l561646l664941l653258l431916k995223k949148l298968l346175
$$ 375158817 371597171 367932230 364278972 360847056 357851833 354902685 351603717 348257542
3355.1C48257542l037602k787888k749711k662540k284884k018512k284497k729922
$$ 348257542 345219940 342432052 339682341 337019801 334734917 332716405 330431908 327701986
3371.4C27701986k718300k281993j933873j788676j733065j659810j475126j150131
$$ 327701986 324983686 322701693 320767820 318979144 317246079 315586269 314111143 312961012
3387.7C12961012p90417q09252j159191j121611n59211k38955o21140r99361o61462
$$ 312961012 312170595 311361343 310202152 309080541 308521330 308282375 307661235 306661874 306000412
3406.1C06000412j22399M7088M113j10120j64509l159J38372J21981J69278K96682
$$ 306000412 305878013 305925101 305929214 305819094 305654585 305651426 305789798 305911779 306081057 306377739
3426.5C06377739L34143K58744L78847O62387O17683L88175M94867Q99494J287788
$$ 306377739 306711882 306970626 307349473 308011860 308629543 309017718 309512585 310412079 311699867
3444.8C11699867J573563J769960J949876K131641K295167K509146K717883K786517
$$ 311699867 313273430 315043390 316993266 319124907 321420074 323929220 326647103 329433620
3461.1C29433620K941608L338516L550679L277242K887666K917230L240317L496528
$$ 329433620 332375228 335713744 339264423 342541665 345429331 348346561 351586878 355083406
3477.4C55083406L521085L353685L334522L452718L392369L279954L341824L431052
$$ 355083406 358604491 361958176 365292698 368745416 372137785 375417739 378759563 382190615
3493.8C82190615L431916L318787L186017L171533L143579L032446L016919L158897
$$ 382190615 385622531 388941318 392127335 395298868 398442447 401474893 404491812 407650709
3510.1D07650709L285051L171801K936900K855032K901435K977282K905935K742708
$$ 407650709 410935760 414107561 417044461 419899493 422800928 425778210 428684145 431426853
3526.4D31426853K793223K917319K875298K841801K819031K675563K607972K581775
$$ 431426853 434220076 437137395 440012693 442854494 445673525 448349088 450957060 453538835
3542.7D53538835K446264K312392K310962K363294K460688K586693K566218K472371
$$ 453538835 455985099 458297491 460608453 462971747 465432435 468019128 470585346 473057717
3559D73057717K381355K104640J835435K367139L266871L227562K751142K629995K726704
$$ 473057717 475439072 477543712 479379147 481746286 485013157 488240719 490991861 493621856 496348560
3577.4D96348560K856433K965212K793849K379417K475679L132701L108203K710045
$$ 496348560 499204993 502170205 504964054 507343471 509819150 512951851 516060054 518770099
3593.7E18770099K815902L079653L056884K976894K752840K247930K085567K417981
$$ 518770099 521586001 524665654 527722538 530699432 533452272 535700202 537785769 540203750
3610E40203750K602577K570749K282977K059638K554119K805054K116442J113534R16421
$$ 540203750 542806327 545377076 547660053 549719691 552273810 555078864 557195306 558308840 559225261
3628.4E59225261K123654K590776K105832J727521J500964J364947J146853N33282
$$ 559225261 561348915 563939691 566045523 567773044 569274008 570638955 571785808 572319090
3644.7E72319090k78055p3612J525938K075613J293123R95576J234710R36687M72188
$$ 572319090 572041035 571967423 573493361 575568974 576862097 577857673 579092383 580029070 580501258
3663E80501258J82093l67701p70629j87218o7115m48286N48720J303136R99451N86152
$$ 580501258 580683351 580315650 579545021 579357803 579290688 578842402 579391122 580694258 581693709 582279861
3683.4E82279861M6432n82516n07832M62592R79245O92784J50085l12328l22819J20044
$$ 582279861 582326293 581743777 581235945 581698537 582677782 583370566 583520651 583208323 582885504 583005548
3703.8E83005548P3373n89729j016139l50357P14720O74009m172m71831n01394k80380
$$ 583005548 583078921 582489192 581473053 581122696 581837416 582511425 582507253 582035422 581534028 581253648
3724.2E81253648L8206J93060l43979j126408r97126J99735R60410L14891j012802
$$ 581253648 581291854 581484914 581140935 580014527 579017401 579217136 580177546 580492437 579479635
3742.6E79479635j285136j93953l19183o50823N22553J027883L06069j61647J22666
$$ 579479635 578194499 578000546 577681363 577030540 577553093 578580976 578887045 578725398 578848064
3760.9E78848064J41382k46048l38912k63214L2961K96474J0610m15147m50671j59263
$$ 578848064 578989446 578743398 578404486 578141272 578174233 578470707 578481317 578066170 577615499 577456236
3781.3E77456236q0228j06752k1100q4460k82883n79656p91490o96361q03172n84960
$$ 577456236 577376008 577269256 577248156 577163696 576880813 576301157 575509667 574813306 574010134 573425174
3801.7E73425174K27213J27554L2961M66228J60932p03096j024187o46889o80447k64704
$$ 573425174 573652387 573779941 573812902 574279130 574440062 573736966 572712779 572065890 571385443 571120739
3822.1E71120739N12719L45588K801k70366m89355m70638o48677n99623J10924N21541
$$ 571120739 571633458 571979046 571981847 571711481 571222126 570751488 570102811 569503188 569614112 570135653
3842.5E70135653N07653K87056l46422j433969k126694l95238J337886Q56161j51515
$$ 570135653 570643306 570930362 570583940 569149971 567023277 566628039 567965925 568822086 568670571
3860.9E68670571o78957m53591k41876m97937k47240K56240L11494j5497o54042n93185
$$ 568670571 567991614 567538023 567296147 566798210 566550970 566807210 567118704 567103207 566449165 565855980
3881.3E65855980j41621j65581k1279j36137l78847j0491M8518n28037q75831o90639
$$ 565855980 565714359 565548778 565527499 565391362 565012515 565002024 565050542 564522505 563646674 562956035
3901.7E62956035k32637L93331O13332K17021j97769m70161o61731m38094l1531l0935
$$ 562956035 562723398 563116729 563730061 563947082 563749313 563279152 562617421 562179327 562147796 562116861
3922.1E62116861j54972K2173R4831r9480k2709K78234K20776j19925l84390m04775
$$ 562116861 561961889 561984062 562078893 561979413 561956704 562234938 562455714 562335789 561951399 561546624
3942.5E61546624k01464j61648k59340j60873J2279P6115L9280j9968l3438k0385p0512
$$ 561546624 561345160 561183512 560924172 560763299 560775578 560851693 560890973 560871005 560837567 560817182 560746670
3964.9E60746670j32025j37209j41204j38998j02401r0718j52349j74344j19388j09434
$$ 560746670 560614645 560477436 560336232 560197234 560094833 560004115 559851766 559677422 559558034 559448600
3985.3E59448600j53363j78337j96099k30193k17319j45257
$$ 559448600 559295237 559116900 558920801 558690608 558473289 558328032
3997.5E58328032
$$ 558328032
##END=$$ End of the data block
